All pastes #768567 Raw Edit

plasma dataengines

public text v1 · immutable
·published 2007-11-10 18:48 UTC
rendered paste body
[ 20%] [ 80%] Building CXX object dataengines/ebn/CMakeFiles/plasma_engine_ebn.dir/ebnengine.o
Built target plasma_engine_twitter
In file included from /home/teste/kde/include/syndication/global.h:25,
                 from /home/teste/kde/include/syndication/loader.h:14,
                 from /home/teste/kdesvn/extragear/plasma/dataengines/ebn/ebnengine.h:23,
                 from /home/teste/kdesvn/extragear/plasma/dataengines/ebn/ebnengine.cpp:19:
/home/teste/kde/include/syndication/feed.h:26:32: error: boost/shared_ptr.hpp: No such file or directory
/home/teste/kde/include/syndication/feed.h:40: error: ‘boost’ has not been declared
/home/teste/kde/include/syndication/feed.h:40: error: expected initializer before ‘<’ token
/home/teste/kde/include/syndication/feed.h:42: error: ‘boost’ has not been declared
/home/teste/kde/include/syndication/feed.h:42: error: expected initializer before ‘<’ token
/home/teste/kde/include/syndication/feed.h:44: error: ‘boost’ has not been declared
/home/teste/kde/include/syndication/feed.h:44: error: expected initializer before ‘<’ token
/home/teste/kde/include/syndication/feed.h:46: error: ‘boost’ has not been declared
/home/teste/kde/include/syndication/feed.h:46: error: expected initializer before ‘<’ token
/home/teste/kde/include/syndication/feed.h:48: error: ‘boost’ has not been declared
/home/teste/kde/include/syndication/feed.h:48: error: expected initializer before ‘<’ token
/home/teste/kde/include/syndication/feed.h:50: error: ‘boost’ has not been declared
/home/teste/kde/include/syndication/feed.h:50: error: expected initializer before ‘<’ token
/home/teste/kde/include/syndication/feed.h:81: error: ‘SpecificDocumentPtr’ does not name a type
/home/teste/kde/include/syndication/feed.h:90: error: ‘ItemPtr’ was not declared in this scope
/home/teste/kde/include/syndication/feed.h:90: error: template argument 1 is invalid
/home/teste/kde/include/syndication/feed.h:97: error: ‘CategoryPtr’ was not declared in this scope
/home/teste/kde/include/syndication/feed.h:97: error: template argument 1 is invalid
/home/teste/kde/include/syndication/feed.h:136: error: ‘ImagePtr’ does not name a type
/home/teste/kde/include/syndication/feed.h:145: error: ‘PersonPtr’ was not declared in this scope
/home/teste/kde/include/syndication/feed.h:145: error: template argument 1 is invalid
/home/teste/kde/include/syndication/global.h:80: error: ‘FeedPtr’ does not name a type
/home/teste/kde/include/syndication/loader.h:28: error: ‘boost’ has not been declared
/home/teste/kde/include/syndication/loader.h:28: error: expected initializer before ‘<’ token
/home/teste/kde/include/syndication/loader.h:164: error: ‘Syndication::FeedPtr’ has not been declared
/home/teste/kdesvn/extragear/plasma/dataengines/ebn/ebnengine.h:62: error: ‘Syndication::FeedPtr’ has not been declared
/home/teste/kde/include/syndication/item.h:40: error: ‘boost’ has not been declared
/home/teste/kde/include/syndication/item.h:40: error: expected initializer before ‘<’ token
/home/teste/kde/include/syndication/item.h:42: error: ‘boost’ has not been declared
/home/teste/kde/include/syndication/item.h:42: error: expected initializer before ‘<’ token
/home/teste/kde/include/syndication/item.h:44: error: ‘boost’ has not been declared
/home/teste/kde/include/syndication/item.h:44: error: expected initializer before ‘<’ token
/home/teste/kde/include/syndication/item.h:46: error: ‘boost’ has not been declared
/home/teste/kde/include/syndication/item.h:46: error: expected initializer before ‘<’ token
/home/teste/kde/include/syndication/item.h:48: error: ‘boost’ has not been declared
/home/teste/kde/include/syndication/item.h:48: error: expected initializer before ‘<’ token
/home/teste/kde/include/syndication/item.h:72: error: ‘SpecificItemPtr’ does not name a type
/home/teste/kde/include/syndication/item.h:152: error: ‘PersonPtr’ was not declared in this scope
/home/teste/kde/include/syndication/item.h:152: error: template argument 1 is invalid
/home/teste/kde/include/syndication/item.h:167: error: ‘EnclosurePtr’ was not declared in this scope
/home/teste/kde/include/syndication/item.h:167: error: template argument 1 is invalid
/home/teste/kde/include/syndication/item.h:175: error: ‘CategoryPtr’ was not declared in this scope
/home/teste/kde/include/syndication/item.h:175: error: template argument 1 is invalid
/home/teste/kdesvn/extragear/plasma/dataengines/ebn/ebnengine.cpp:90: error: ‘Syndication::FeedPtr’ has not been declared
/home/teste/kdesvn/extragear/plasma/dataengines/ebn/ebnengine.cpp: In member function ‘void EbnEngine::processFeed(Syndication::Loader*, int, Syndication::ErrorCode)’:
/home/teste/kdesvn/extragear/plasma/dataengines/ebn/ebnengine.cpp:102: error: base operand of ‘->’ is not a pointer
/home/teste/kdesvn/extragear/plasma/dataengines/ebn/ebnengine.cpp:103: error: base operand of ‘->’ is not a pointer
/home/teste/kdesvn/extragear/plasma/dataengines/ebn/ebnengine.cpp:104: error: base operand of ‘->’ is not a pointer
/home/teste/kdesvn/extragear/plasma/dataengines/ebn/ebnengine.cpp:106: error: base operand of ‘->’ is not a pointer
/home/teste/kdesvn/extragear/plasma/dataengines/ebn/ebnengine.cpp:106: error: base operand of ‘->’ is not a pointer
/home/teste/kdesvn/extragear/plasma/dataengines/ebn/ebnengine.cpp:108: error: base operand of ‘->’ is not a pointer
/home/teste/kdesvn/extragear/plasma/dataengines/ebn/ebnengine.cpp:108: error: template argument 1 is invalid
/home/teste/kdesvn/extragear/plasma/dataengines/ebn/ebnengine.cpp:108: error: invalid type in declaration before ‘(’ token
/home/teste/kdesvn/extragear/plasma/dataengines/ebn/ebnengine.cpp:108: error: base operand of ‘->’ is not a pointer
/home/teste/kdesvn/extragear/plasma/dataengines/ebn/ebnengine.cpp:108: error: request for member ‘brk’ in ‘_container_’, which is of non-class type ‘int’
/home/teste/kdesvn/extragear/plasma/dataengines/ebn/ebnengine.cpp:108: error: request for member ‘i’ in ‘_container_’, which is of non-class type ‘int’
/home/teste/kdesvn/extragear/plasma/dataengines/ebn/ebnengine.cpp:108: error: request for member ‘e’ in ‘_container_’, which is of non-class type ‘int’
/home/teste/kdesvn/extragear/plasma/dataengines/ebn/ebnengine.cpp:108: error: request for member ‘brk’ in ‘_container_’, which is of non-class type ‘int’
/home/teste/kdesvn/extragear/plasma/dataengines/ebn/ebnengine.cpp:108: error: request for member ‘i’ in ‘_container_’, which is of non-class type ‘int’
/home/teste/kdesvn/extragear/plasma/dataengines/ebn/ebnengine.cpp:108: error: expected initializer before ‘&’ token
/home/teste/kdesvn/extragear/plasma/dataengines/ebn/ebnengine.cpp:108: error: request for member ‘brk’ in ‘_container_’, which is of non-class type ‘int’
/home/teste/kdesvn/extragear/plasma/dataengines/ebn/ebnengine.cpp:118: error: ‘item’ was not declared in this scope
/home/teste/kdesvn/build/extragear/plasma/dataengines/ebn/ebnengine.moc: In member function ‘virtual int EbnEngine::qt_metacall(QMetaObject::Call, int, void**)’:
/home/teste/kdesvn/build/extragear/plasma/dataengines/ebn/ebnengine.moc:72: error: expected type-specifier
/home/teste/kdesvn/build/extragear/plasma/dataengines/ebn/ebnengine.moc:72: error: expected `>'
/home/teste/kdesvn/build/extragear/plasma/dataengines/ebn/ebnengine.moc:72: error: expected `('
/home/teste/kdesvn/build/extragear/plasma/dataengines/ebn/ebnengine.moc:72: error: ‘FeedPtr’ is not a member of ‘Syndication’
/home/teste/kdesvn/build/extragear/plasma/dataengines/ebn/ebnengine.moc:72: error: expected primary-expression before ‘)’ token
make[2]: *** [dataengines/ebn/CMakeFiles/plasma_engine_ebn.dir/ebnengine.o] Error 1
make[1]: *** [dataengines/ebn/CMakeFiles/plasma_engine_ebn.dir/all] Error 2
make: *** [all] Error 2