All pastes #76416 Raw Edit

Untitled

public text v1 · immutable
·published 2006-07-01 16:01 UTC
rendered paste body
/bin/sh ../../../libtool --silent --mode=compile i686-pc-linux-gnu-g++ -DHAVE_CONFIG_H -I. -I. -I../../.. -I../../../amarok/src -I../../../amarok/src/amarokcore -I../../../amarok/src -I../../../amarok/src/engine -I../../../amarok/src/plugin -I../../../amarok/src/statusbar -I../../../amarok/src/mediadevice -I/usr/kde/3.5/include -I/usr/qt/3/include -I.  -I/usr/kde/3.5/include  -DQT_THREAD_SUPPORT  -D_REENTRANT  -Wno-long-long -Wundef -ansi -D_XOPEN_SOURCE=500 -D_BSD_SOURCE -Wcast-align -Wconversion -Wchar-subscripts -Wall -W -Wpointer-arith -DNDEBUG -DNO_DEBUG -O2 -O2 -march=athlon -pipe -fomit-frame-pointer -fno-inline -Wformat-security -Wmissing-format-attribute -Wno-non-virtual-dtor -fno-exceptions -fno-check-new -fno-common -DQT_CLEAN_NAMESPACE -DQT_NO_ASCII_CAST -DQT_NO_STL -DQT_NO_COMPAT -DQT_NO_TRANSLATION -c -o crashhandler.lo `test -f 'crashhandler.cpp' || echo './'`crashhandler.cpp
make[4]: *** No rule to make target `amarokconfig.h', needed by `all-am'.  Stop.
make[4]: *** Waiting for unfinished jobs....
crashhandler.cpp:12:26: error: amarokconfig.h: No such file or directory
amarokdcophandler.cpp:22:26: error: amarokconfig.h: No such file or directory
crashhandler.cpp: In static member function 'static void amaroK::Crash::crashHandler(int)':
crashhandler.cpp:98: error: 'AmarokConfig' has not been declared
crashhandler.cpp:178: error: 'AmarokConfig' has not been declared
In file included from amarokdcophandler.cpp:35:
../../../amarok/src/playlist.h:23:26: error: amarokconfig.h: No such file or directory
make[4]: *** [crashhandler.lo] Error 1
amarokdcophandler.cpp:922:33: error: amarokdcophandler.moc: No such file or directory
../../../amarok/src/playlist.h:117: error: incomplete type 'AmarokConfig' used in nested name specifier
../../../amarok/src/playlistbrowser.h:74: error: incomplete type 'AmarokConfig' used in nested name specifier
amarokdcophandler.cpp: In member function 'virtual bool amaroK::DcopPlayerHandler::equalizerEnabled()':
amarokdcophandler.cpp:80: error: incomplete type 'AmarokConfig' used in nested name specifier
amarokdcophandler.cpp: In member function 'virtual bool amaroK::DcopPlayerHandler::osdEnabled()':
amarokdcophandler.cpp:87: error: incomplete type 'AmarokConfig' used in nested name specifier
amarokdcophandler.cpp: In member function 'virtual bool amaroK::DcopPlayerHandler::randomModeStatus()':
amarokdcophandler.cpp:97: error: incomplete type 'AmarokConfig' used in nested name specifier
amarokdcophandler.cpp: In member function 'virtual QString amaroK::DcopPlayerHandler::engine()':
amarokdcophandler.cpp:206: error: incomplete type 'AmarokConfig' used in nested name specifier
amarokdcophandler.cpp: In member function 'virtual QString amaroK::DcopPlayerHandler::setContextStyle(const QString&)':
amarokdcophandler.cpp:236: error: incomplete type 'AmarokConfig' used in nested name specifier
amarokdcophandler.cpp: In member function 'virtual void amaroK::DcopPlayerHandler::enableOSD(bool)':
amarokdcophandler.cpp:286: error: incomplete type 'AmarokConfig' used in nested name specifier
amarokdcophandler.cpp: In member function 'virtual void amaroK::DcopPlayerHandler::enableRandomMode(bool)':
amarokdcophandler.cpp:292: error: 'struct AmarokConfig::EnumRandomMode' has not been declared
amarokdcophandler.cpp:292: error: 'struct AmarokConfig::EnumRandomMode' has not been declared
amarokdcophandler.cpp: In member function 'virtual void amaroK::DcopPlayerHandler::enableRepeatPlaylist(bool)':
amarokdcophandler.cpp:298: error: 'struct AmarokConfig::EnumRepeat' has not been declared
amarokdcophandler.cpp:298: error: 'struct AmarokConfig::EnumRepeat' has not been declared
amarokdcophandler.cpp: In member function 'virtual void amaroK::DcopPlayerHandler::enableRepeatTrack(bool)':
amarokdcophandler.cpp:304: error: 'struct AmarokConfig::EnumRepeat' has not been declared
amarokdcophandler.cpp:304: error: 'struct AmarokConfig::EnumRepeat' has not been declared
amarokdcophandler.cpp: In member function 'virtual void amaroK::DcopPlayerHandler::setEqualizerEnabled(bool)':
amarokdcophandler.cpp:384: error: incomplete type 'AmarokConfig' used in nested name specifier
amarokdcophandler.cpp: In member function 'virtual QString amaroK::DcopScriptHandler::readConfig(const QString&)':
amarokdcophandler.cpp:816: error: 'KConfigSkeletonItem' was not declared in this scope
amarokdcophandler.cpp:816: error: 'configItem' was not declared in this scope
amarokdcophandler.cpp:816: error: incomplete type 'AmarokConfig' used in nested name specifier
amarokdcophandler.cpp: In member function 'virtual QStringList amaroK::DcopScriptHandler::readListConfig(const QString&)':
amarokdcophandler.cpp:826: error: 'KConfigSkeletonItem' was not declared in this scope
amarokdcophandler.cpp:826: error: 'configItem' was not declared in this scope
amarokdcophandler.cpp:826: error: incomplete type 'AmarokConfig' used in nested name specifier
amarokdcophandler.cpp: In member function 'virtual QString amaroK::DcopScriptHandler::readConfig(const QString&)':
amarokdcophandler.cpp:821: warning: control reaches end of non-void function
make[4]: *** [amarokdcophandler.lo] Error 1
make[4]: Leaving directory `/var/tmp/portage/amarok-svn-1.4-r8/work/amarok-svn-1.4/amarok/src/amarokcore'
make[3]: *** [all-recursive] Error 1
make[3]: Leaving directory `/var/tmp/portage/amarok-svn-1.4-r8/work/amarok-svn-1.4/amarok/src'
make[2]: *** [all-recursive] Error 1
make[2]: Leaving directory `/var/tmp/portage/amarok-svn-1.4-r8/work/amarok-svn-1.4/amarok'
make[1]: *** [all-recursive] Error 1
make[1]: Leaving directory `/var/tmp/portage/amarok-svn-1.4-r8/work/amarok-svn-1.4'
make: *** [all] Error 2

!!! ERROR: media-sound/amarok-svn-1.4-r8 failed.
Call stack:
  ebuild.sh, line 1545:   Called dyn_compile
  ebuild.sh, line 940:   Called src_compile
  amarok-svn-1.4-r8.ebuild, line 86:   Called kde_src_compile
  kde.eclass, line 164:   Called kde_src_compile 'all'
  kde.eclass, line 306:   Called kde_src_compile 'myconf' 'configure' 'make'
  kde.eclass, line 302:   Called die