All pastes #756522 Raw Edit

Something

public text v1 · immutable
#756522 ·published 2007-10-31 15:34 UTC
rendered paste body
rm -f *.mod.c *.mod *.o .*.cmd *.ko
rm -rf /home/jesse/rtl8185_linux_26.1024.0302.2007/ieee80211/tmp
make -C /lib/modules/2.6.22.9-desktop586-1mdv/build M=/home/jesse/rtl8185_linux_26.1024.0302.2007/ieee80211 CC=gcc modules
make[1]: Entering directory `/usr/src/linux-2.6.22.9-desktop586-1mdv'
  CC [M]  /home/jesse/rtl8185_linux_26.1024.0302.2007/ieee80211/ieee80211_softmac.o
/home/jesse/rtl8185_linux_26.1024.0302.2007/ieee80211/ieee80211_softmac.c: In function ‘ieee80211_softmac_scan_wq’:
/home/jesse/rtl8185_linux_26.1024.0302.2007/ieee80211/ieee80211_softmac.c:417: warning: passing argument 2 of ‘queue_delayed_work’ from incompatible pointer type
/home/jesse/rtl8185_linux_26.1024.0302.2007/ieee80211/ieee80211_softmac.c: In function ‘ieee80211_softmac_stop_scan’:
/home/jesse/rtl8185_linux_26.1024.0302.2007/ieee80211/ieee80211_softmac.c:491: warning: passing argument 1 of ‘cancel_delayed_work’ from incompatible pointer type
/home/jesse/rtl8185_linux_26.1024.0302.2007/ieee80211/ieee80211_softmac.c: In function ‘ieee80211_associate_abort’:
/home/jesse/rtl8185_linux_26.1024.0302.2007/ieee80211/ieee80211_softmac.c:907: warning: passing argument 2 of ‘queue_delayed_work’ from incompatible pointer type
/home/jesse/rtl8185_linux_26.1024.0302.2007/ieee80211/ieee80211_softmac.c: In function ‘ieee80211_stop_protocol_rtl’:
/home/jesse/rtl8185_linux_26.1024.0302.2007/ieee80211/ieee80211_softmac.c:2082: warning: passing argument 1 of ‘cancel_delayed_work’ from incompatible pointer type
/home/jesse/rtl8185_linux_26.1024.0302.2007/ieee80211/ieee80211_softmac.c:2190:78: error: macro "INIT_WORK" passed 3 arguments, but takes just 2
/home/jesse/rtl8185_linux_26.1024.0302.2007/ieee80211/ieee80211_softmac.c: In function ‘ieee80211_softmac_init’:
/home/jesse/rtl8185_linux_26.1024.0302.2007/ieee80211/ieee80211_softmac.c:2190: error: ‘INIT_WORK’ undeclared (first use in this function)
/home/jesse/rtl8185_linux_26.1024.0302.2007/ieee80211/ieee80211_softmac.c:2190: error: (Each undeclared identifier is reported only once
/home/jesse/rtl8185_linux_26.1024.0302.2007/ieee80211/ieee80211_softmac.c:2190: error: for each function it appears in.)
/home/jesse/rtl8185_linux_26.1024.0302.2007/ieee80211/ieee80211_softmac.c:2191:88: error: macro "INIT_WORK" passed 3 arguments, but takes just 2
/home/jesse/rtl8185_linux_26.1024.0302.2007/ieee80211/ieee80211_softmac.c:2192:94: error: macro "INIT_WORK" passed 3 arguments, but takes just 2
/home/jesse/rtl8185_linux_26.1024.0302.2007/ieee80211/ieee80211_softmac.c:2193:96: error: macro "INIT_WORK" passed 3 arguments, but takes just 2
/home/jesse/rtl8185_linux_26.1024.0302.2007/ieee80211/ieee80211_softmac.c:2194:82: error: macro "INIT_WORK" passed 3 arguments, but takes just 2
/home/jesse/rtl8185_linux_26.1024.0302.2007/ieee80211/ieee80211_softmac.c:2195:82: error: macro "INIT_WORK" passed 3 arguments, but takes just 2
/home/jesse/rtl8185_linux_26.1024.0302.2007/ieee80211/ieee80211_softmac.c: In function ‘ieee80211_softmac_free’:
/home/jesse/rtl8185_linux_26.1024.0302.2007/ieee80211/ieee80211_softmac.c:2214: warning: passing argument 1 of ‘cancel_delayed_work’ from incompatible pointer type
make[2]: *** [/home/jesse/rtl8185_linux_26.1024.0302.2007/ieee80211/ieee80211_softmac.o] Error 1
make[1]: *** [_module_/home/jesse/rtl8185_linux_26.1024.0302.2007/ieee80211] Error 2
make[1]: Leaving directory `/usr/src/linux-2.6.22.9-desktop586-1mdv'
make: *** [modules] Error 2
rm -f *.mod.c *.mod *.o .*.cmd *.ko
rm -rf /home/jesse/rtl8185_linux_26.1024.0302.2007/rtl8185/tmp
make -C /lib/modules/2.6.22.9-desktop586-1mdv/build M=/home/jesse/rtl8185_linux_26.1024.0302.2007/rtl8185 CC=gcc modules
make[1]: Entering directory `/usr/src/linux-2.6.22.9-desktop586-1mdv'
  CC [M]  /home/jesse/rtl8185_linux_26.1024.0302.2007/rtl8185/r8180_core.o
In file included from /home/jesse/rtl8185_linux_26.1024.0302.2007/rtl8185/r8180_core.c:61:
/home/jesse/rtl8185_linux_26.1024.0302.2007/rtl8185/r8180.h:29:26: error: linux/config.h: No such file or directory
/home/jesse/rtl8185_linux_26.1024.0302.2007/rtl8185/r8180_core.c: In function ‘rtl8180_rx’:
/home/jesse/rtl8185_linux_26.1024.0302.2007/rtl8185/r8180_core.c:2233: warning: implicit declaration of function ‘rdtsc’
/home/jesse/rtl8185_linux_26.1024.0302.2007/rtl8185/r8180_core.c:3130:67: error: macro "INIT_WORK" passed 3 arguments, but takes just 2
/home/jesse/rtl8185_linux_26.1024.0302.2007/rtl8185/r8180_core.c: In function ‘rtl8180_init’:
/home/jesse/rtl8185_linux_26.1024.0302.2007/rtl8185/r8180_core.c:3130: error: ‘INIT_WORK’ undeclared (first use in this function)
/home/jesse/rtl8185_linux_26.1024.0302.2007/rtl8185/r8180_core.c:3130: error: (Each undeclared identifier is reported only once
/home/jesse/rtl8185_linux_26.1024.0302.2007/rtl8185/r8180_core.c:3130: error: for each function it appears in.)
/home/jesse/rtl8185_linux_26.1024.0302.2007/rtl8185/r8180_core.c:3468: warning: ‘deprecated_irq_flag’ is deprecated (declared at include/linux/interrupt.h:66)
/home/jesse/rtl8185_linux_26.1024.0302.2007/rtl8185/r8180_core.c:3468: warning: passing argument 2 of ‘request_irq’ from incompatible pointer type
/home/jesse/rtl8185_linux_26.1024.0302.2007/rtl8185/r8180_core.c: In function ‘rtl8180_pci_probe’:
/home/jesse/rtl8185_linux_26.1024.0302.2007/rtl8185/r8180_core.c:4223: error: ‘struct net_device’ has no member named ‘get_wireless_stats’
/home/jesse/rtl8185_linux_26.1024.0302.2007/rtl8185/r8180_core.c: In function ‘rtl8180_pci_module_init’:
/home/jesse/rtl8185_linux_26.1024.0302.2007/rtl8185/r8180_core.c:4348: warning: implicit declaration of function ‘pci_module_init’
make[2]: *** [/home/jesse/rtl8185_linux_26.1024.0302.2007/rtl8185/r8180_core.o] Error 1
make[1]: *** [_module_/home/jesse/rtl8185_linux_26.1024.0302.2007/rtl8185] Error 2
make[1]: Leaving directory `/usr/src/linux-2.6.22.9-desktop586-1mdv'
make: *** [modules] Error 2