All pastes #75633 Raw Edit

amarok-svn

public text v1 · immutable
#75633 ·published 2006-06-30 11:29 UTC
rendered paste body
compiling /home/koen/programs/amarok-svn/amarok/src/directorylist.cpp
compiling /home/koen/programs/amarok-svn/amarok/src/enginebase.cpp
compiling /home/koen/programs/amarok-svn/amarok/src/enginecontroller.cpp
compiling /home/koen/programs/amarok-svn/amarok/src/equalizerpresetmanager.cpp
compiling /home/koen/programs/amarok-svn/amarok/src/equalizersetup.cpp
compiling /home/koen/programs/amarok-svn/amarok/src/filebrowser.cpp
compiling /home/koen/programs/amarok-svn/amarok/src/hintlineedit.cpp
compiling /home/koen/programs/amarok-svn/amarok/src/htmlview.cpp
compiling /home/koen/programs/amarok-svn/amarok/src/ktrm.cpp
g++ -DHAVE_CONFIG_H -I./amarok/src -I/home/koen/programs/amarok-svn/amarok/src -I. -I./amarok/src/amarokcore -I/home/koen/programs/amarok-svn/amarok/src/amarokcore -I/home/koen/programs/amarok-svn/amarok/src/analyzers -I/home/koen/programs/amarok-svn/amarok/src/plugin -I/home/koen/programs/amarok-svn/amarok/src/statusbar -I/home/koen/programs/amarok-svn/amarok/src/mediadevice -I/home/koen/programs/amarok-svn/amarok/src -I/usr/include/kde/arts -I/usr/include/taglib -I/home/koen/programs/amarok-svn/amarok/src/sqlite -I/usr/include/kde -I/usr/share/qt3/include -I. -DQT_THREAD_SUPPORT -D_REENTRANT -Wno-long-long -Wundef -ansi -D_XOPEN_SOURCE=500 -D_BSD_SOURCE -Wcast-align -Wconversion -Wchar-subscripts -Wall -W -Wpointer-arith -g3 -fno-inline -Wformat-security -Wmissing-format-attribute -Wno-non-virtual-dtor -fno-exceptions -fno-check-new -fno-common -DQT_CLEAN_NAMESPACE -DQT_NO_ASCII_CAST -DQT_NO_STL -DQT_NO_COMPAT -DQT_NO_TRANSLATION -fPIC -DPIC -c /home/koen/programs/amarok-svn/amarok/src/ktrm.cpp -o ./amarok/src/.libs/ktrm.o -Wp,-MD,./amarok/src/.deps/ktrm.TUlo
/home/koen/programs/amarok-svn/amarok/src/ktrm.cpp: In member function 'int KTRMRequestHandler::startLookup(KTRMLookup*)':
/usr/local/include/tunepimp/tp_c.h:645: error: too few arguments to function 'int tp_AddFile(void*, const char*, int)'
/home/koen/programs/amarok-svn/amarok/src/ktrm.cpp:77: error: at this point in file
/home/koen/programs/amarok-svn/amarok/src/ktrm.cpp: In constructor 'KTRMRequestHandler::KTRMRequestHandler()':
/home/koen/programs/amarok-svn/amarok/src/ktrm.cpp:141: error: 'tp_SetUseUTF8' was not declared in this scope
/home/koen/programs/amarok-svn/amarok/src/ktrm.cpp:143: error: invalid conversion from 'void (*)(void*, void*, TPCallbackEnum, int)' to 'void (*)(void*, void*, TPCallbackEnum, int, TPFileStatus)'
/home/koen/programs/amarok-svn/amarok/src/ktrm.cpp:143: error:   initializing argument 2 of 'void tp_SetNotifyCallback(void*, void (*)(void*, void*, TPCallbackEnum, int, TPFileStatus), void*)'
/home/koen/programs/amarok-svn/amarok/src/ktrm.cpp: In member function 'virtual void KTRMLookup::collision()':
/home/koen/programs/amarok-svn/amarok/src/ktrm.cpp:636: error: base operand of '->' has non-pointer type 'artistresult_t'
/home/koen/programs/amarok-svn/amarok/src/ktrm.cpp:637: error: base operand of '->' has non-pointer type 'albumresult_t'
/home/koen/programs/amarok-svn/amarok/src/ktrm.cpp:638: error: base operand of '->' has non-pointer type 'albumresult_t'
Error creating ./amarok/src/ktrm.lo. Exit status 1.

Compilation Failed!