All pastes #756256 Raw Edit

Unnamed

public text v1 · immutable
#756256 ·published 2007-10-31 10:20 UTC
rendered paste body
[mstf@notedux][12:17:24]
[~/Desktop/pokerth/pokerth-0.6b.1173-20071031]> qmake-qt4 pokerth.pro
[mstf@notedux][12:17:59]
[~/Desktop/pokerth/pokerth-0.6b.1173-20071031]> make
make -f Makefile.pokerth_lib
make[1]:`/home/mstf/Desktop/pokerth/pokerth-0.6b.1173-20071031' dizinine giriliyor
g++ -c -pipe -g -Wall -W -D_REENTRANT -fPIC -DDISABLE_IPV6 -I/usr/qt/4/mkspecs/linux-g++ -I. -I/usr/qt/4/include -I. -Isrc -Isrc/engine -Isrc/gui -Isrc/gui/qt -Isrc/gui/qt/qttools -Isrc/net -Isrc/engine/local_engine -Isrc/engine/network_engine -Isrc/config -Isrc/core/tinyxml -Isrc/core/libircclient/include -Isrc/core -Imocs -Iuics -o obj/avatarmanager.o src/core/common/avatarmanager.cpp
g++ -c -pipe -g -Wall -W -D_REENTRANT -fPIC -DDISABLE_IPV6 -I/usr/qt/4/mkspecs/linux-g++ -I. -I/usr/qt/4/include -I. -Isrc -Isrc/engine -Isrc/gui -Isrc/gui/qt -Isrc/gui/qt/qttools -Isrc/net -Isrc/engine/local_engine -Isrc/engine/network_engine -Isrc/config -Isrc/core/tinyxml -Isrc/core/libircclient/include -Isrc/core -Imocs -Iuics -o obj/localberoflop.o src/engine/local_engine/localberoflop.cpp
g++ -c -pipe -g -Wall -W -D_REENTRANT -fPIC -DDISABLE_IPV6 -I/usr/qt/4/mkspecs/linux-g++ -I. -I/usr/qt/4/include -I. -Isrc -Isrc/engine -Isrc/gui -Isrc/gui/qt -Isrc/gui/qt/qttools -Isrc/net -Isrc/engine/local_engine -Isrc/engine/network_engine -Isrc/config -Isrc/core/tinyxml -Isrc/core/libircclient/include -Isrc/core -Imocs -Iuics -o obj/localberoturn.o src/engine/local_engine/localberoturn.cpp
src/core/common/avatarmanager.cpp:24:32: boost/filesystem.hpp: No such file or directory
src/core/common/avatarmanager.cpp:51: error: `filesystem' is not a namespace-name
src/core/common/avatarmanager.cpp:51: error: expected namespace-name before ';' token
src/core/common/avatarmanager.cpp: In member function `bool AvatarManager::Init(const std::string&, const std::string&)':
src/core/common/avatarmanager.cpp:71: error: `path' was not declared in this scope
src/core/common/avatarmanager.cpp:71: error: expected `;' before "tmpCachePath"
src/core/common/avatarmanager.cpp:72: error: expected `;' before "tmpDataPath"
src/core/common/avatarmanager.cpp:75: error: `tmpCachePath' was not declared in this scope
src/core/common/avatarmanager.cpp:75: warning: unused variable 'tmpCachePath'
src/core/common/avatarmanager.cpp:79: error: `tmpDataPath' was not declared in this scope
src/core/common/avatarmanager.cpp:84: error: `tmpCachePath' was not declared in this scope
src/core/common/avatarmanager.cpp: At global scope:
src/core/common/avatarmanager.cpp:68: warning: unused parameter 'dataDir'
src/core/common/avatarmanager.cpp: In member function `boost::shared_ptr<AvatarFileState> AvatarManager::OpenAvatarFileForChunkRead(const std::string&, unsigned int&, AvatarFileType&)':
src/core/common/avatarmanager.cpp:104: error: `path' was not declared in this scope
src/core/common/avatarmanager.cpp:104: error: expected `;' before "filePath"
src/core/common/avatarmanager.cpp:105: error: `filePath' was not declared in this scope
src/core/common/avatarmanager.cpp:105: error: `extension' was not declared in this scope
src/core/common/avatarmanager.cpp:104: warning: unused variable 'path'
src/core/common/avatarmanager.cpp:105: warning: unused variable 'filePath'
src/core/common/avatarmanager.cpp:105: warning: unused variable 'extension'
src/core/common/avatarmanager.cpp: In member function `bool AvatarManager::GetHashForAvatar(const std::string&, MD5Buf&) const':
src/core/common/avatarmanager.cpp:218: error: `exists' was not declared in this scope
src/core/common/avatarmanager.cpp:218: warning: unused variable 'exists'
src/core/common/avatarmanager.cpp: In member function `bool AvatarManager::StoreAvatarInCache(const MD5Buf&, AvatarFileType, const unsigned char*, unsigned int)':
src/core/common/avatarmanager.cpp:328: error: `path' was not declared in this scope
src/core/common/avatarmanager.cpp:328: error: expected `;' before "tmpPath"
src/core/common/avatarmanager.cpp:329: error: `tmpPath' was not declared in this scope
src/core/common/avatarmanager.cpp:328: warning: unused variable 'path'
src/core/common/avatarmanager.cpp: In member function `void AvatarManager::RemoveOldAvatarCacheEntries()':
src/core/common/avatarmanager.cpp:395: error: `path' was not declared in this scope
src/core/common/avatarmanager.cpp:395: error: expected `;' before "cachePath"
src/core/common/avatarmanager.cpp:396: error: `cachePath' was not declared in this scope
src/core/common/avatarmanager.cpp:413: error: expected `;' before "filePath"
src/core/common/avatarmanager.cpp:414: error: `filePath' was not declared in this scope
src/core/common/avatarmanager.cpp:420: error: `exists' was not declared in this scope
src/core/common/avatarmanager.cpp:423: error: `last_write_time' was not declared in this scope
src/core/common/avatarmanager.cpp:423: warning: unused variable 'last_write_time'
src/core/common/avatarmanager.cpp:420: warning: unused variable 'exists'
src/core/common/avatarmanager.cpp:459: error: expected `;' before "tmpPath"
src/core/common/avatarmanager.cpp:460: error: `tmpPath' was not declared in this scope
src/core/common/avatarmanager.cpp:460: warning: unused variable 'tmpPath'
src/core/common/avatarmanager.cpp:477: error: expected `;' before "tmpPath"
src/core/common/avatarmanager.cpp:478: error: `tmpPath' was not declared in this scope
src/core/common/avatarmanager.cpp:478: warning: unused variable 'tmpPath'
src/core/common/avatarmanager.cpp:396: warning: unused variable 'cachePath'
src/core/common/avatarmanager.cpp: In member function `bool AvatarManager::InternalReadDirectory(const std::string&, std::map<MD5Buf, std::string, std::less<MD5Buf>, std::allocator<std::pair<const MD5Buf, std::string> > >&)':
src/core/common/avatarmanager.cpp:497: error: `directory_iterator' was not declared in this scope
src/core/common/avatarmanager.cpp:497: error: expected `;' before "i"
src/core/common/avatarmanager.cpp:498: error: expected `;' before "end"
src/core/common/avatarmanager.cpp:500: error: `i' was not declared in this scope
src/core/common/avatarmanager.cpp:500: error: `end' was not declared in this scope
src/core/common/avatarmanager.cpp:502: error: `is_regular' was not declared in this scope
src/core/common/avatarmanager.cpp:502: warning: unused variable 'is_regular'
src/core/common/avatarmanager.cpp:500: warning: unused variable 'end'
src/core/common/avatarmanager.cpp: At global scope:
src/core/common/avatarmanager.cpp:492: warning: unused parameter 'dir'
g++ -c -pipe -g -Wall -W -D_REENTRANT -fPIC -DDISABLE_IPV6 -I/usr/qt/4/mkspecs/linux-g++ -I. -I/usr/qt/4/include -I. -Isrc -Isrc/engine -Isrc/gui -Isrc/gui/qt -Isrc/gui/qt/qttools -Isrc/net -Isrc/engine/local_engine -Isrc/engine/network_engine -Isrc/config -Isrc/core/tinyxml -Isrc/core/libircclient/include -Isrc/core -Imocs -Iuics -o obj/localberoriver.o src/engine/local_engine/localberoriver.cpp
make[1]: *** [obj/avatarmanager.o] Hata 1
make[1]: *** Bitmemiş işler için bekliyor....
make[1]: `/home/mstf/Desktop/pokerth/pokerth-0.6b.1173-20071031' dizininden çıkılıyor
make: *** [sub-pokerth_lib-pro-make_default-ordered] Hata 2