All pastes #756085 Raw Edit

llvm-gcc error

public text v1 · immutable
#756085 ·published 2007-10-31 03:48 UTC
rendered paste body
phire@Osiris:~/hobbies/touch/iphone-dev/build/llvm-gcc-test$ make LLVM_VERSION_INFO=2.0-svn-iphone-dev-0.3-svn 
make[1]: Entering directory `/home/phire/hobbies/touch/iphone-dev/build/llvm-gcc-test/libiberty'
make[2]: Entering directory `/home/phire/hobbies/touch/iphone-dev/build/llvm-gcc-test/libiberty/testsuite'
make[2]: Nothing to be done for `all'.
make[2]: Leaving directory `/home/phire/hobbies/touch/iphone-dev/build/llvm-gcc-test/libiberty/testsuite'
make[1]: Leaving directory `/home/phire/hobbies/touch/iphone-dev/build/llvm-gcc-test/libiberty'
make[1]: Entering directory `/home/phire/hobbies/touch/iphone-dev/build/llvm-gcc-test/fixincludes'
make[1]: Nothing to be done for `all'.
make[1]: Leaving directory `/home/phire/hobbies/touch/iphone-dev/build/llvm-gcc-test/fixincludes'
make[1]: Entering directory `/home/phire/hobbies/touch/iphone-dev/build/llvm-gcc-test/intl'
make[1]: Nothing to be done for `all'.
make[1]: Leaving directory `/home/phire/hobbies/touch/iphone-dev/build/llvm-gcc-test/intl'
make[1]: Entering directory `/home/phire/hobbies/touch/iphone-dev/build/llvm-gcc-test/build-i686-pc-linux-gnu/libiberty'
make[2]: Entering directory `/home/phire/hobbies/touch/iphone-dev/build/llvm-gcc-test/build-i686-pc-linux-gnu/libiberty/testsuite'
make[2]: Nothing to be done for `all'.
make[2]: Leaving directory `/home/phire/hobbies/touch/iphone-dev/build/llvm-gcc-test/build-i686-pc-linux-gnu/libiberty/testsuite'
make[1]: Leaving directory `/home/phire/hobbies/touch/iphone-dev/build/llvm-gcc-test/build-i686-pc-linux-gnu/libiberty'
make[1]: Entering directory `/home/phire/hobbies/touch/iphone-dev/build/llvm-gcc-test/build-i686-pc-linux-gnu/fixincludes'
make[1]: Nothing to be done for `all'.
make[1]: Leaving directory `/home/phire/hobbies/touch/iphone-dev/build/llvm-gcc-test/build-i686-pc-linux-gnu/fixincludes'
make[1]: Entering directory `/home/phire/hobbies/touch/iphone-dev/build/llvm-gcc-test/libcpp'
make[1]: Nothing to be done for `all'.
make[1]: Leaving directory `/home/phire/hobbies/touch/iphone-dev/build/llvm-gcc-test/libcpp'
make[1]: Entering directory `/home/phire/hobbies/touch/iphone-dev/build/llvm-gcc-test/gcc'
make \
          CFLAGS="-g -O2  -W -Wall -Wwrite-strings -Wstrict-prototypes -Wmissing-prototypes -pedantic -Wno-long-long -Wno-variadic-macros -Wold-style-definition  " \
          CONFIG_H="config.h  auto-host.h ../../../llvm-gcc-testing/gcc/../include/ansidecl.h" \
          MAKEOVERRIDES= \
          -f libgcc.mk all
make[2]: Entering directory `/home/phire/hobbies/touch/iphone-dev/build/llvm-gcc-test/gcc'
make GCC_FOR_TARGET="/home/phire/hobbies/touch/iphone-dev/build/llvm-gcc-test/gcc/xgcc -B/home/phire/hobbies/touch/iphone-dev/build/llvm-gcc-test/gcc/ -B/usr/local/arm-apple-darwin/bin/ -B/usr/local/arm-apple-darwin/lib/ -isystem /usr/local/arm-apple-darwin/include -isystem /usr/local/arm-apple-darwin/sys-include" \
          AR_FOR_TARGET="arm-apple-darwin-ar" \
          AR_CREATE_FOR_TARGET="arm-apple-darwin-ar  rc" \
          AR_EXTRACT_FOR_TARGET="arm-apple-darwin-ar  x" \
          AR_FLAGS_FOR_TARGET="" \
          CC="gcc" CFLAGS="-g -O2  -W -Wall -Wwrite-strings -Wstrict-prototypes -Wmissing-prototypes -pedantic -Wno-long-long -Wno-variadic-macros -Wold-style-definition  " \
          BUILD_PREFIX="" \
          BUILD_PREFIX_1="loser-" \
          LANGUAGES="" \
          LIBGCC2_CFLAGS="-O2  -DIN_GCC -DCROSS_DIRECTORY_STRUCTURE   -W -Wall -Wwrite-strings -Wstrict-prototypes -Wmissing-prototypes -Wold-style-definition  -isystem ./include  -fPIC -pipe -g -DHAVE_GTHR_DEFAULT -DIN_LIBGCC2 -D__GCC_FLOAT_NOT_NEEDED -Dinhibit_libc "  \
          MULTILIB_CFLAGS="" T= crt3.o
make[3]: Entering directory `/home/phire/hobbies/touch/iphone-dev/build/llvm-gcc-test/gcc'
/home/phire/hobbies/touch/iphone-dev/build/llvm-gcc-test/gcc/xgcc -B/home/phire/hobbies/touch/iphone-dev/build/llvm-gcc-test/gcc/ -B/usr/local/arm-apple-darwin/bin/ -B/usr/local/arm-apple-darwin/lib/ -isystem /usr/local/arm-apple-darwin/include -isystem /usr/local/arm-apple-darwin/sys-include -DIN_GCC -DCROSS_DIRECTORY_STRUCTURE   -W -Wall -Wwrite-strings -Wstrict-prototypes -Wmissing-prototypes -Wold-style-definition  -isystem ./include  -I. -I. -I../../../llvm-gcc-testing/gcc -I../../../llvm-gcc-testing/gcc/. -I../../../llvm-gcc-testing/gcc/../include -I../../../llvm-gcc-testing/gcc/../libcpp/include  -I/home/phire/hobbies/touch/llvm-svn/include -I/home/phire/hobbies/touch/llvm-svn/include  \
         \
          -c ../../../llvm-gcc-testing/gcc/config/darwin-crt3.c -o crt3.o
cc1: RegisterScavenging.cpp:113: void llvm::RegScavenger::forward(): Assertion `false && "Using an undefined register!"' failed.
../../../llvm-gcc-testing/gcc/config/darwin-crt3.c:535: internal compiler error: Aborted
Please submit a full bug report,
with preprocessed source if appropriate.
See <URL:http://llvm.org/bugs> for instructions.
make[3]: *** [crt3.o] Error 1
make[3]: Leaving directory `/home/phire/hobbies/touch/iphone-dev/build/llvm-gcc-test/gcc'
make[2]: *** [extra] Error 2
make[2]: Leaving directory `/home/phire/hobbies/touch/iphone-dev/build/llvm-gcc-test/gcc'
make[1]: *** [stmp-multilib] Error 2
make[1]: Leaving directory `/home/phire/hobbies/touch/iphone-dev/build/llvm-gcc-test/gcc'
make: *** [all-gcc] Error 2