>>> Unpacking source...
>>> Unpacking gpm-1.20.1.tar.bz2 to /var/tmp/portage/sys-libs/gpm-1.20.1-r6/work
>>> Unpacking gpm-1.20.1-patches-1.4.tar.bz2 to /var/tmp/portage/sys-libs/gpm-1.20.1-r6/work
[32;01m*[0m Applying various patches (bugfixes/updates) ...
[32;01m*[0m 01_all_info.patch ...
[A[70C [34;01m[ [32;01mok[34;01m ][0m
[32;01m*[0m 03_all_DESTDIR.patch ...
[A[70C [34;01m[ [32;01mok[34;01m ][0m
[32;01m*[0m 04_all_root.patch ...
[A[70C [34;01m[ [32;01mok[34;01m ][0m
[32;01m*[0m 05_all_serialconsole.patch ...
[A[70C [34;01m[ [32;01mok[34;01m ][0m
[32;01m*[0m 08_all_nodebug.patch ...
[A[70C [34;01m[ [32;01mok[34;01m ][0m
[32;01m*[0m 09_all_logfillup.patch ...
[A[70C [34;01m[ [32;01mok[34;01m ][0m
[32;01m*[0m 10_all_link.patch ...
[A[70C [34;01m[ [32;01mok[34;01m ][0m
[32;01m*[0m 11_all_lib_segv.patch ...
[A[70C [34;01m[ [32;01mok[34;01m ][0m
[32;01m*[0m 12_all_linux26-dependcache.patch ...
[A[70C [34;01m[ [32;01mok[34;01m ][0m
[32;01m*[0m 20_all_gpm-1.20.1-subscript.patch ...
[A[70C [34;01m[ [32;01mok[34;01m ][0m
[32;01m*[0m 21_all_synps2-four-way-button.patch ...
[A[70C [34;01m[ [32;01mok[34;01m ][0m
[32;01m*[0m 25_all_gpm-mousewheel-support.patch ...
[A[70C [34;01m[ [32;01mok[34;01m ][0m
[32;01m*[0m 30_all_gpm-1.20.1-weak-wgetch.patch ...
[A[70C [34;01m[ [32;01mok[34;01m ][0m
[32;01m*[0m 60_all_parallel-build.patch ...
[A[70C [34;01m[ [32;01mok[34;01m ][0m
[32;01m*[0m Done with patching
[32;01m*[0m Applying gpm-configure-LANG.patch ...
[A[70C [34;01m[ [32;01mok[34;01m ][0m
[32;01m*[0m Applying gpm-daemon.patch ...
[A[70C [34;01m[ [32;01mok[34;01m ][0m
>>> Source unpacked.
>>> Compiling source in /var/tmp/portage/sys-libs/gpm-1.20.1-r6/work/gpm-1.20.1 ...
./configure --prefix=/usr --host=x86_64-pc-linux-gnu --mandir=/usr/share/man --infodir=/usr/share/info --datadir=/usr/share --sysconfdir=/etc --localstatedir=/var/lib --libdir=/lib64 --sysconfdir=/etc/gpm --build=x86_64-pc-linux-gnu
creating cache ./config.cache
checking for gcc... gcc
checking whether the C compiler (gcc -O2 -pipe -march=nocona ) works... yes
checking whether the C compiler (gcc -O2 -pipe -march=nocona ) is a cross-compiler... no
checking whether we are using GNU C... yes
checking whether gcc accepts -g... yes
checking for ranlib... ranlib
checking for a BSD compatible install... /usr/bin/install -c
checking for bison... bison -y
checking whether ln -s works... yes
checking for dvips... no
checking for texi2html... /usr/bin/texi2html
checking for tex... no
checking for texindex... /usr/bin/texindex
checking for makeinfo... /usr/bin/makeinfo
checking for diff... /usr/bin/diff
checking for sed... /bin/sed
checking for emacs... no
checking how to run the C preprocessor... gcc -E
checking for syslog.h... yes
checking for linux/input.h... yes
checking for linux/joystick.h... yes
checking for ncurses.h... yes
checking for ncurses/curses.h... no
checking for curses.h... yes
checking for sys/sysmacros.h... yes
checking for linux/major.h... yes
checking for linux/tty.h... yes
checking for __u32... yes
checking whether system is ELF... yes
checking for vsyslog... yes
checking for syslog... yes
checking for working alloca.h... yes
checking for alloca... yes
checking for tputs in -ltinfo... no
checking for tputs in -lncurses... yes
checking for wgetch in -lncurses... yes
updating cache ./config.cache
creating ./config.status
creating Makefile.include
creating Makefile
creating doc/Makefile
creating src/Makefile
creating contrib/Makefile
creating doc/doc.gpm
creating src/headers/config.h
make[1]: warning: jobserver unavailable: using -j1. Add `+' to parent make rule.
make[1]: warning: jobserver unavailable: using -j1. Add `+' to parent make rule.
mice.c:170: warning: type qualifiers ignored on function return type
mice.c: In function 'option_modem_lines':
mice.c:185: warning: pointer targets in initialization differ in signedness
mice.c:186: warning: pointer targets in initialization differ in signedness
mice.c:187: warning: pointer targets in initialization differ in signedness
mice.c: In function 'M_gunze':
mice.c:1323: warning: pointer targets in passing argument 1 of 'sscanf' differ in signedness
gpm.c: In function 'getMouseData':
gpm.c:380: warning: pointer targets in initialization differ in signedness
gpm.c:399: warning: pointer targets in return differ in signedness
gpm.c:430: warning: pointer targets in return differ in signedness
gpm.c: In function 'processMouse':
gpm.c:482: warning: pointer targets in passing argument 2 of 'which_mouse->m_type->fun' differ in signedness
gpm.c: In function 'processConn':
gpm.c:812: warning: passing argument 3 of 'accept' from incompatible pointer type
gpm.c: In function 'old_main':
gpm.c:1123: warning: value computed is not used
gpm.c: In function 'open_console':
gpm.c:172: warning: control reaches end of non-void function
gpm.c:165: warning: 'si.line' is used uninitialized in this function
special.c: In function 'processSpecial':
special.c:158: error: 'OPEN_MAX' undeclared (first use in this function)
special.c:158: error: (Each undeclared identifier is reported only once
special.c:158: error: for each function it appears in.)
distcc[13439] ERROR: compile special.c on 192.168.1.3 failed
gpm.c: In function 'get_console_size':
gpm.c:165: warning: 'si.line' is used uninitialized in this function
gpm.c: In function 'processMouse':
gpm.c:165: warning: 'si.line' is used uninitialized in this function
make[1]: *** [special.o] Error 1
make[1]: *** Waiting for unfinished jobs....
gpn.c: In function 'loadlut':
gpn.c:108: warning: pointer targets in passing argument 1 of 'getsym' differ in signedness
gpn.c:110: warning: pointer targets in passing argument 1 of 'getsym' differ in signedness
gpm.c: In function 'old_main':
gpm.c:165: warning: 'si.line' is used uninitialized in this function
twiddler.c: In function 'twiddler_mod_to_table':
twiddler.c:334: warning: operation on 'ptr' may be undefined
twiddler.c: In function 'twiddler_rest_to_value':
twiddler.c:441: warning: cast to pointer from integer of different size
make: *** [do-all] Error 1
[31;01m*[0m
[31;01m*[0m ERROR: sys-libs/gpm-1.20.1-r6 failed.
[31;01m*[0m Call stack:
[31;01m*[0m ebuild.sh, line 1695: Called dyn_compile
[31;01m*[0m ebuild.sh, line 1033: Called qa_call 'src_compile'
[31;01m*[0m ebuild.sh, line 44: Called src_compile
[31;01m*[0m gpm-1.20.1-r6.ebuild, line 44: Called die
[31;01m*[0m The specific snippet of code:
[31;01m*[0m emake \
[31;01m*[0m CC=$(tc-getCC) \
[31;01m*[0m AR=$(tc-getAR) \
[31;01m*[0m RANLIB=$(tc-getRANLIB) \
[31;01m*[0m EMACS=: \
[31;01m*[0m || die "emake failed"
[31;01m*[0m The die message:
[31;01m*[0m emake failed
[31;01m*[0m
[31;01m*[0m If you need support, post the topmost build error, and the call stack if relevant.
[31;01m*[0m A complete build log is located at '/var/tmp/portage/sys-libs/gpm-1.20.1-r6/temp/build.log'.
[31;01m*[0m