All pastes #756038 Raw Edit

splat

public text v1 · immutable
#756038 ·published 2007-10-31 02:45 UTC
rendered paste body
creating src/headers/config.h
make[1]: warning: jobserver unavailable: using -j1.  Add `+' to parent make rule.
make[1]: warning: jobserver unavailable: using -j1.  Add `+' to parent make rule.
mice.c:170: warning: type qualifiers ignored on function return type
mice.c: In function 'option_modem_lines':
mice.c:185: warning: pointer targets in initialization differ in signedness
mice.c:186: warning: pointer targets in initialization differ in signedness
mice.c:187: warning: pointer targets in initialization differ in signedness
mice.c: In function 'M_gunze':
mice.c:1323: warning: pointer targets in passing argument 1 of 'sscanf' differ in signedness
gpm.c: In function 'getMouseData':
gpm.c:380: warning: pointer targets in initialization differ in signedness
gpm.c:399: warning: pointer targets in return differ in signedness
gpm.c:430: warning: pointer targets in return differ in signedness
gpm.c: In function 'processMouse':
gpm.c:482: warning: pointer targets in passing argument 2 of 'which_mouse->m_type->fun' differ in signedness
gpm.c: In function 'processConn':
gpm.c:812: warning: passing argument 3 of 'accept' from incompatible pointer type
gpm.c: In function 'old_main':
gpm.c:1123: warning: value computed is not used
gpm.c: In function 'open_console':
gpm.c:172: warning: control reaches end of non-void function
gpm.c:165: warning: 'si.line' is used uninitialized in this function
special.c: In function 'processSpecial':
special.c:158: error: 'OPEN_MAX' undeclared (first use in this function)
special.c:158: error: (Each undeclared identifier is reported only once
special.c:158: error: for each function it appears in.)
distcc[13439] ERROR: compile special.c on 192.168.1.3 failed
gpm.c: In function 'get_console_size':
gpm.c:165: warning: 'si.line' is used uninitialized in this function
gpm.c: In function 'processMouse':
gpm.c:165: warning: 'si.line' is used uninitialized in this function
make[1]: *** [special.o] Error 1
make[1]: *** Waiting for unfinished jobs....
gpn.c: In function 'loadlut':
gpn.c:108: warning: pointer targets in passing argument 1 of 'getsym' differ in signedness
gpn.c:110: warning: pointer targets in passing argument 1 of 'getsym' differ in signedness
gpm.c: In function 'old_main':
gpm.c:165: warning: 'si.line' is used uninitialized in this function
twiddler.c: In function 'twiddler_mod_to_table':
twiddler.c:334: warning: operation on 'ptr' may be undefined
twiddler.c: In function 'twiddler_rest_to_value':
twiddler.c:441: warning: cast to pointer from integer of different size
make: *** [do-all] Error 1
 * 
 * ERROR: sys-libs/gpm-1.20.1-r6 failed.
 * Call stack:
 *              ebuild.sh, line 1695:  Called dyn_compile
 *              ebuild.sh, line 1033:  Called qa_call 'src_compile'
 *              ebuild.sh, line   44:  Called src_compile
 *   gpm-1.20.1-r6.ebuild, line   44:  Called die
 * The specific snippet of code:
 *      emake \
 *              CC=$(tc-getCC) \
 *              AR=$(tc-getAR) \
 *              RANLIB=$(tc-getRANLIB) \
 *              EMACS=: \
 *              || die "emake failed"
 *  The die message:
 *   emake failed
 * 
 * If you need support, post the topmost build error, and the call stack if relevant.
 * A complete build log is located at '/var/tmp/portage/sys-libs/gpm-1.20.1-r6/temp/build.log'.
 * 

 * Messages for package sys-libs/gpm-1.20.1-r6:

 * 
 * ERROR: sys-libs/gpm-1.20.1-r6 failed.
 * Call stack:
 *              ebuild.sh, line 1695:  Called dyn_compile
 *              ebuild.sh, line 1033:  Called qa_call 'src_compile'
 *              ebuild.sh, line   44:  Called src_compile
 *   gpm-1.20.1-r6.ebuild, line   44:  Called die
 * The specific snippet of code:
 *      emake \
 *              CC=$(tc-getCC) \
 *              AR=$(tc-getAR) \
 *              RANLIB=$(tc-getRANLIB) \
 *              EMACS=: \
 *              || die "emake failed"
 *  The die message:
 *   emake failed
 * 
 * If you need support, post the topmost build error, and the call stack if relevant.
 * A complete build log is located at '/var/tmp/portage/sys-libs/gpm-1.20.1-r6/temp/build.log'.
 *