All pastes #755778 Raw Edit

Etwas

public text v1 · immutable
#755778 ·published 2007-10-30 21:54 UTC
rendered paste body
linux:/home/user/ov51x-1.65-1.12-mark# LANG=C make
make -C /lib/modules/2.6.18-5-686/build M=/home/user/ov51x-1.65-1.12-mark modules
make[1]: Entering directory `/usr/src/linux-headers-2.6.18-5-686'
  CC [M]  /home/user/ov51x-1.65-1.12-mark/ov51x.o
/home/user/ov51x-1.65-1.12-mark/ov51x.c:207: error: expected ')' before string constant
/home/user/ov51x-1.65-1.12-mark/ov51x.c:209: error: expected ')' before string constant
/home/user/ov51x-1.65-1.12-mark/ov51x.c:211: error: expected ')' before string constant
/home/user/ov51x-1.65-1.12-mark/ov51x.c:213: error: expected ')' before string constant
/home/user/ov51x-1.65-1.12-mark/ov51x.c:216: error: expected ')' before string constant
/home/user/ov51x-1.65-1.12-mark/ov51x.c:220: error: expected ')' before string constant
/home/user/ov51x-1.65-1.12-mark/ov51x.c:223: error: expected ')' before string constant
/home/user/ov51x-1.65-1.12-mark/ov51x.c:227: error: expected ')' before string constant
/home/user/ov51x-1.65-1.12-mark/ov51x.c:229: error: expected ')' before string constant
/home/user/ov51x-1.65-1.12-mark/ov51x.c:231: error: expected ')' before string constant
/home/user/ov51x-1.65-1.12-mark/ov51x.c:234: error: expected ')' before string constant
/home/user/ov51x-1.65-1.12-mark/ov51x.c:236: error: expected ')' before string constant
/home/user/ov51x-1.65-1.12-mark/ov51x.c:239: error: expected ')' before string constant
/home/user/ov51x-1.65-1.12-mark/ov51x.c:242: error: expected ')' before string constant
/home/user/ov51x-1.65-1.12-mark/ov51x.c:244: error: expected ')' before string constant
/home/user/ov51x-1.65-1.12-mark/ov51x.c:246: error: expected ')' before string constant
/home/user/ov51x-1.65-1.12-mark/ov51x.c:248: error: expected ')' before string constant
/home/user/ov51x-1.65-1.12-mark/ov51x.c:250: error: expected ')' before string constant
/home/user/ov51x-1.65-1.12-mark/ov51x.c:252: error: expected ')' before string constant
/home/user/ov51x-1.65-1.12-mark/ov51x.c:254: error: expected ')' before string constant
/home/user/ov51x-1.65-1.12-mark/ov51x.c:256: error: expected ')' before string constant
/home/user/ov51x-1.65-1.12-mark/ov51x.c:258: error: expected ')' before string constant
/home/user/ov51x-1.65-1.12-mark/ov51x.c:260: error: expected ')' before string constant
/home/user/ov51x-1.65-1.12-mark/ov51x.c:262: error: expected ')' before string constant
/home/user/ov51x-1.65-1.12-mark/ov51x.c:264: error: expected ')' before string constant
/home/user/ov51x-1.65-1.12-mark/ov51x.c:267: error: expected ')' before string constant
/home/user/ov51x-1.65-1.12-mark/ov51x.c:270: error: expected ')' before string constant
/home/user/ov51x-1.65-1.12-mark/ov51x.c:272: error: expected ')' before string constant
/home/user/ov51x-1.65-1.12-mark/ov51x.c:274: error: expected ')' before string constant
/home/user/ov51x-1.65-1.12-mark/ov51x.c:276: error: expected ')' before string constant
/home/user/ov51x-1.65-1.12-mark/ov51x.c:278: error: expected ')' before string constant
/home/user/ov51x-1.65-1.12-mark/ov51x.c:280: error: expected ')' before string constant
/home/user/ov51x-1.65-1.12-mark/ov51x.c:282: error: expected ')' before string constant
/home/user/ov51x-1.65-1.12-mark/ov51x.c:285: error: expected ')' before string constant
/home/user/ov51x-1.65-1.12-mark/ov51x.c:288: error: expected ')' before string constant
/home/user/ov51x-1.65-1.12-mark/ov51x.c:290: error: expected ')' before string constant
/home/user/ov51x-1.65-1.12-mark/ov51x.c:292: error: expected ')' before string constant
/home/user/ov51x-1.65-1.12-mark/ov51x.c:294: error: expected ')' before string constant
/home/user/ov51x-1.65-1.12-mark/ov51x.c: In function 'ov51x_v4l1_open':
/home/user/ov51x-1.65-1.12-mark/ov51x.c:5705: warning: implicit declaration of function 'video_devdata'
/home/user/ov51x-1.65-1.12-mark/ov51x.c:5705: warning: initialization makes pointer from integer without a cast
/home/user/ov51x-1.65-1.12-mark/ov51x.c:5707: warning: implicit declaration of function 'video_get_drvdata'
/home/user/ov51x-1.65-1.12-mark/ov51x.c:5707: warning: initialization makes pointer from integer without a cast
/home/user/ov51x-1.65-1.12-mark/ov51x.c: In function 'ov51x_v4l1_close':
/home/user/ov51x-1.65-1.12-mark/ov51x.c:5784: warning: initialization makes pointer from integer without a cast
/home/user/ov51x-1.65-1.12-mark/ov51x.c: In function 'ov51x_v4l1_ioctl_internal':
/home/user/ov51x-1.65-1.12-mark/ov51x.c:5842: warning: initialization makes pointer from integer without a cast
/home/user/ov51x-1.65-1.12-mark/ov51x.c:6246: error: dereferencing pointer to incomplete type
/home/user/ov51x-1.65-1.12-mark/ov51x.c: In function 'ov51x_v4l1_ioctl':
/home/user/ov51x-1.65-1.12-mark/ov51x.c:6358: warning: initialization makes pointer from integer without a cast
/home/user/ov51x-1.65-1.12-mark/ov51x.c:6364: warning: implicit declaration of function 'video_usercopy'
/home/user/ov51x-1.65-1.12-mark/ov51x.c: In function 'ov51x_v4l1_read':
/home/user/ov51x-1.65-1.12-mark/ov51x.c:6384: warning: initialization makes pointer from integer without a cast
/home/user/ov51x-1.65-1.12-mark/ov51x.c: In function 'ov51x_v4l1_mmap':
/home/user/ov51x-1.65-1.12-mark/ov51x.c:6554: warning: initialization makes pointer from integer without a cast
/home/user/ov51x-1.65-1.12-mark/ov51x.c: At top level:
/home/user/ov51x-1.65-1.12-mark/ov51x.c:6625: error: variable 'vdev_template' has initializer but incomplete type
/home/user/ov51x-1.65-1.12-mark/ov51x.c:6626: error: unknown field 'owner' specified in initializer
/home/user/ov51x-1.65-1.12-mark/ov51x.c:6626: warning: excess elements in struct initializer
/home/user/ov51x-1.65-1.12-mark/ov51x.c:6626: warning: (near initialization for 'vdev_template')
/home/user/ov51x-1.65-1.12-mark/ov51x.c:6627: error: unknown field 'name' specified in initializer
/home/user/ov51x-1.65-1.12-mark/ov51x.c:6627: warning: excess elements in struct initializer
/home/user/ov51x-1.65-1.12-mark/ov51x.c:6627: warning: (near initialization for 'vdev_template')
/home/user/ov51x-1.65-1.12-mark/ov51x.c:6628: error: unknown field 'type' specified in initializer
/home/user/ov51x-1.65-1.12-mark/ov51x.c:6628: warning: excess elements in struct initializer
/home/user/ov51x-1.65-1.12-mark/ov51x.c:6628: warning: (near initialization for 'vdev_template')
/home/user/ov51x-1.65-1.12-mark/ov51x.c:6629: error: unknown field 'hardware' specified in initializer
/home/user/ov51x-1.65-1.12-mark/ov51x.c:6629: warning: excess elements in struct initializer
/home/user/ov51x-1.65-1.12-mark/ov51x.c:6629: warning: (near initialization for 'vdev_template')
/home/user/ov51x-1.65-1.12-mark/ov51x.c:6630: error: unknown field 'fops' specified in initializer
/home/user/ov51x-1.65-1.12-mark/ov51x.c:6630: warning: excess elements in struct initializer
/home/user/ov51x-1.65-1.12-mark/ov51x.c:6630: warning: (near initialization for 'vdev_template')
/home/user/ov51x-1.65-1.12-mark/ov51x.c:6632: error: unknown field 'release' specified in initializer
/home/user/ov51x-1.65-1.12-mark/ov51x.c:6632: error: 'video_device_release' undeclared here (not in a function)
/home/user/ov51x-1.65-1.12-mark/ov51x.c:6632: warning: excess elements in struct initializer
/home/user/ov51x-1.65-1.12-mark/ov51x.c:6632: warning: (near initialization for 'vdev_template')
/home/user/ov51x-1.65-1.12-mark/ov51x.c:6634: error: unknown field 'minor' specified in initializer
/home/user/ov51x-1.65-1.12-mark/ov51x.c:6634: warning: excess elements in struct initializer
/home/user/ov51x-1.65-1.12-mark/ov51x.c:6634: warning: (near initialization for 'vdev_template')
/home/user/ov51x-1.65-1.12-mark/ov51x.c: In function 'ov51x_probe':
/home/user/ov51x-1.65-1.12-mark/ov51x.c:8298: warning: implicit declaration of function 'video_device_alloc'
/home/user/ov51x-1.65-1.12-mark/ov51x.c:8298: warning: assignment makes pointer from integer without a cast
/home/user/ov51x-1.65-1.12-mark/ov51x.c:8302: error: dereferencing pointer to incomplete type
/home/user/ov51x-1.65-1.12-mark/ov51x.c:8302: error: dereferencing pointer to incomplete type
/home/user/ov51x-1.65-1.12-mark/ov51x.c:8302: error: dereferencing pointer to incomplete type
/home/user/ov51x-1.65-1.12-mark/ov51x.c:8304: error: dereferencing pointer to incomplete type
/home/user/ov51x-1.65-1.12-mark/ov51x.c:8306: warning: implicit declaration of function 'video_set_drvdata'
/home/user/ov51x-1.65-1.12-mark/ov51x.c:8314: warning: implicit declaration of function 'video_register_device'
/home/user/ov51x-1.65-1.12-mark/ov51x.c:8314: error: 'VFL_TYPE_GRABBER' undeclared (first use in this function)
/home/user/ov51x-1.65-1.12-mark/ov51x.c:8314: error: (Each undeclared identifier is reported only once
/home/user/ov51x-1.65-1.12-mark/ov51x.c:8314: error: for each function it appears in.)
/home/user/ov51x-1.65-1.12-mark/ov51x.c:8321: error: dereferencing pointer to incomplete type
/home/user/ov51x-1.65-1.12-mark/ov51x.c:8331: error: dereferencing pointer to incomplete type
/home/user/ov51x-1.65-1.12-mark/ov51x.c:8354: error: dereferencing pointer to incomplete type
/home/user/ov51x-1.65-1.12-mark/ov51x.c:8355: warning: implicit declaration of function 'video_device_release'
/home/user/ov51x-1.65-1.12-mark/ov51x.c:8357: warning: implicit declaration of function 'video_unregister_device'
/home/user/ov51x-1.65-1.12-mark/ov51x.c: At top level:
/home/user/ov51x-1.65-1.12-mark/ov51x.c:8464: error: unknown field 'owner' specified in initializer
/home/user/ov51x-1.65-1.12-mark/ov51x.c:8464: warning: initialization from incompatible pointer type
make[2]: *** [/home/user/ov51x-1.65-1.12-mark/ov51x.o] Error 1
make[1]: *** [_module_/home/user/ov51x-1.65-1.12-mark] Error 2
make[1]: Leaving directory `/usr/src/linux-headers-2.6.18-5-686'
make: *** [all] Error 2
linux:/home/user/ov51x-1.65-1.12-mark#