All pastes #755447 Raw Edit

Mine

public text v1 · immutable
#755447 ·published 2007-10-30 18:38 UTC
rendered paste body
This file contains any messages produced by compilers while
running configure, to aid debugging if configure makes a mistake.

It was created by glib configure 2.14.0, which was
generated by GNU Autoconf 2.60.  Invocation command line was

  $ ./configure --prefix=/usr

## --------- ##
## Platform. ##
## --------- ##

hostname = desktop
uname -m = i686
uname -r = 2.6.22-14-generic
uname -s = Linux
uname -v = #1 SMP Sun Oct 14 23:05:12 GMT 2007

/usr/bin/uname -p = unknown
/bin/uname -X     = unknown

/bin/arch              = unknown
/usr/bin/arch -k       = unknown
/usr/convex/getsysinfo = unknown
/usr/bin/hostinfo      = unknown
/bin/machine           = unknown
/usr/bin/oslevel       = unknown
/bin/universe          = unknown

PATH: /usr/local/sbin
PATH: /usr/local/bin
PATH: /usr/sbin
PATH: /usr/bin
PATH: /sbin
PATH: /bin
PATH: /usr/games


## ----------- ##
## Core tests. ##
## ----------- ##

configure:2109: checking for a BSD-compatible install
configure:2165: result: /usr/bin/install -c
configure:2176: checking whether build environment is sane
configure:2219: result: yes
configure:2252: checking for gawk
configure:2268: found /usr/bin/gawk
configure:2279: result: gawk
configure:2290: checking whether make sets $(MAKE)
configure:2311: result: yes
configure:2540: checking whether to enable maintainer-specific portions of Makefiles
configure:2549: result: no
configure:2571: checking build system type
configure:2589: result: i686-pc-linux-gnu
configure:2611: checking host system type
configure:2626: result: i686-pc-linux-gnu
configure:2649: checking for the BeOS
configure:2659: result: no
configure:2663: checking for Win32
configure:2691: result: no
configure:2695: checking for Mac OS X Carbon support
configure:2709: checking for style of include used by make
configure:2737: result: GNU
configure:2810: checking for gcc
configure:2826: found /usr/bin/gcc
configure:2837: result: gcc
configure:3075: checking for C compiler version
configure:3082: gcc --version >&5
gcc (GCC) 4.1.3 20070929 (prerelease) (Ubuntu 4.1.2-16ubuntu2)
Copyright (C) 2006 Free Software Foundation, Inc.
This is free software; see the source for copying conditions.  There is NO
warranty; not even for MERCHANTABILITY or FITNESS FOR A PARTICULAR PURPOSE.

configure:3085: $? = 0
configure:3092: gcc -v >&5
Using built-in specs.
Target: i486-linux-gnu
Configured with: ../src/configure -v --enable-languages=c,c++,fortran,objc,obj-c++,treelang --prefix=/usr --enable-shared --with-system-zlib --libexecdir=/usr/lib --without-included-gettext --enable-threads=posix --enable-nls --with-gxx-include-dir=/usr/include/c++/4.1.3 --program-suffix=-4.1 --enable-__cxa_atexit --enable-clocale=gnu --enable-libstdcxx-debug --enable-mpfr --enable-checking=release i486-linux-gnu
Thread model: posix
gcc version 4.1.3 20070929 (prerelease) (Ubuntu 4.1.2-16ubuntu2)
configure:3095: $? = 0
configure:3102: gcc -V >&5
gcc: '-V' option must have argument
configure:3105: $? = 1
configure:3128: checking for C compiler default output file name
configure:3155: gcc    conftest.c  >&5
configure:3158: $? = 0
configure:3204: result: a.out
configure:3209: checking whether the C compiler works
configure:3219: ./a.out
configure:3222: $? = 0
configure:3239: result: yes
configure:3246: checking whether we are cross compiling
configure:3248: result: no
configure:3251: checking for suffix of executables
configure:3258: gcc -o conftest    conftest.c  >&5
configure:3261: $? = 0
configure:3285: result: 
configure:3291: checking for suffix of object files
configure:3317: gcc -c   conftest.c >&5
configure:3320: $? = 0
configure:3343: result: o
configure:3347: checking whether we are using the GNU C compiler
configure:3376: gcc -c   conftest.c >&5
configure:3382: $? = 0
configure:3389: test -z "$ac_c_werror_flag" || test ! -s conftest.err
configure:3392: $? = 0
configure:3399: test -s conftest.o
configure:3402: $? = 0
configure:3416: result: yes
configure:3421: checking whether gcc accepts -g
configure:3451: gcc -c -g  conftest.c >&5
configure:3457: $? = 0
configure:3464: test -z "$ac_c_werror_flag" || test ! -s conftest.err
configure:3467: $? = 0
configure:3474: test -s conftest.o
configure:3477: $? = 0
configure:3607: result: yes
configure:3624: checking for gcc option to accept ISO C89
configure:3698: gcc  -c -g -O2  conftest.c >&5
configure:3704: $? = 0
configure:3711: test -z "$ac_c_werror_flag" || test ! -s conftest.err
configure:3714: $? = 0
configure:3721: test -s conftest.o
configure:3724: $? = 0
configure:3744: result: none needed
configure:3764: checking dependency style of gcc
configure:3847: result: gcc3
configure:3870: checking how to run the C preprocessor
configure:3910: gcc -E  conftest.c
configure:3916: $? = 0
configure:3954: gcc -E  conftest.c
conftest.c:13:28: error: ac_nonexistent.h: No such file or directory
configure:3960: $? = 1
configure: failed program was:
| /* confdefs.h.  */
| #define PACKAGE_NAME "glib"
| #define PACKAGE_TARNAME "glib"
| #define PACKAGE_VERSION "2.14.0"
| #define PACKAGE_STRING "glib 2.14.0"
| #define PACKAGE_BUGREPORT "http://bugzilla.gnome.org/enter_bug.cgi?product=glib"
| #define GLIB_MAJOR_VERSION 2
| #define GLIB_MINOR_VERSION 14
| #define GLIB_MICRO_VERSION 0
| #define GLIB_INTERFACE_AGE 0
| #define GLIB_BINARY_AGE 1400
| /* end confdefs.h.  */
| #include <ac_nonexistent.h>
configure:4000: result: gcc -E
configure:4029: gcc -E  conftest.c
configure:4035: $? = 0
configure:4073: gcc -E  conftest.c
conftest.c:13:28: error: ac_nonexistent.h: No such file or directory
configure:4079: $? = 1
configure: failed program was:
| /* confdefs.h.  */
| #define PACKAGE_NAME "glib"
| #define PACKAGE_TARNAME "glib"
| #define PACKAGE_VERSION "2.14.0"
| #define PACKAGE_STRING "glib 2.14.0"
| #define PACKAGE_BUGREPORT "http://bugzilla.gnome.org/enter_bug.cgi?product=glib"
| #define GLIB_MAJOR_VERSION 2
| #define GLIB_MINOR_VERSION 14
| #define GLIB_MICRO_VERSION 0
| #define GLIB_INTERFACE_AGE 0
| #define GLIB_BINARY_AGE 1400
| /* end confdefs.h.  */
| #include <ac_nonexistent.h>
configure:4140: gcc -E  conftest.c
conftest.c:14:27: error: Carbon/Carbon.h: No such file or directory
conftest.c:15:39: error: CoreServices/CoreServices.h: No such file or directory
configure:4146: $? = 1
configure: failed program was:
| /* confdefs.h.  */
| #define PACKAGE_NAME "glib"
| #define PACKAGE_TARNAME "glib"
| #define PACKAGE_VERSION "2.14.0"
| #define PACKAGE_STRING "glib 2.14.0"
| #define PACKAGE_BUGREPORT "http://bugzilla.gnome.org/enter_bug.cgi?product=glib"
| #define GLIB_MAJOR_VERSION 2
| #define GLIB_MINOR_VERSION 14
| #define GLIB_MICRO_VERSION 0
| #define GLIB_INTERFACE_AGE 0
| #define GLIB_BINARY_AGE 1400
| /* end confdefs.h.  */
| 
| #include <Carbon/Carbon.h>
| #include <CoreServices/CoreServices.h>
| 
configure:4168: result: no
configure:4640: checking whether to enable garbage collector friendliness
configure:4651: result: no
configure:4655: checking whether to disable memory pools
configure:4658: result: no
configure:4732: checking for gcc
configure:4759: result: gcc
configure:4997: checking for C compiler version
configure:5004: gcc --version >&5
gcc (GCC) 4.1.3 20070929 (prerelease) (Ubuntu 4.1.2-16ubuntu2)
Copyright (C) 2006 Free Software Foundation, Inc.
This is free software; see the source for copying conditions.  There is NO
warranty; not even for MERCHANTABILITY or FITNESS FOR A PARTICULAR PURPOSE.

configure:5007: $? = 0
configure:5014: gcc -v >&5
Using built-in specs.
Target: i486-linux-gnu
Configured with: ../src/configure -v --enable-languages=c,c++,fortran,objc,obj-c++,treelang --prefix=/usr --enable-shared --with-system-zlib --libexecdir=/usr/lib --without-included-gettext --enable-threads=posix --enable-nls --with-gxx-include-dir=/usr/include/c++/4.1.3 --program-suffix=-4.1 --enable-__cxa_atexit --enable-clocale=gnu --enable-libstdcxx-debug --enable-mpfr --enable-checking=release i486-linux-gnu
Thread model: posix
gcc version 4.1.3 20070929 (prerelease) (Ubuntu 4.1.2-16ubuntu2)
configure:5017: $? = 0
configure:5024: gcc -V >&5
gcc: '-V' option must have argument
configure:5027: $? = 1
configure:5030: checking whether we are using the GNU C compiler
configure:5099: result: yes
configure:5104: checking whether gcc accepts -g
configure:5290: result: yes
configure:5307: checking for gcc option to accept ISO C89
configure:5427: result: none needed
configure:5447: checking dependency style of gcc
configure:5530: result: gcc3
configure:5552: checking for c++
configure:5568: found /usr/bin/c++
configure:5579: result: c++
configure:5714: checking for C++ compiler version
configure:5721: c++ --version >&5
c++ (GCC) 4.1.3 20070929 (prerelease) (Ubuntu 4.1.2-16ubuntu2)
Copyright (C) 2006 Free Software Foundation, Inc.
This is free software; see the source for copying conditions.  There is NO
warranty; not even for MERCHANTABILITY or FITNESS FOR A PARTICULAR PURPOSE.

configure:5724: $? = 0
configure:5731: c++ -v >&5
Using built-in specs.
Target: i486-linux-gnu
Configured with: ../src/configure -v --enable-languages=c,c++,fortran,objc,obj-c++,treelang --prefix=/usr --enable-shared --with-system-zlib --libexecdir=/usr/lib --without-included-gettext --enable-threads=posix --enable-nls --with-gxx-include-dir=/usr/include/c++/4.1.3 --program-suffix=-4.1 --enable-__cxa_atexit --enable-clocale=gnu --enable-libstdcxx-debug --enable-mpfr --enable-checking=release i486-linux-gnu
Thread model: posix
gcc version 4.1.3 20070929 (prerelease) (Ubuntu 4.1.2-16ubuntu2)
configure:5734: $? = 0
configure:5741: c++ -V >&5
c++: '-V' option must have argument
configure:5744: $? = 1
configure:5747: checking whether we are using the GNU C++ compiler
configure:5776: c++ -c   conftest.cpp >&5
configure:5782: $? = 0
configure:5789: test -z "$ac_cxx_werror_flag" || test ! -s conftest.err
configure:5792: $? = 0
configure:5799: test -s conftest.o
configure:5802: $? = 0
configure:5816: result: yes
configure:5821: checking whether c++ accepts -g
configure:5851: c++ -c -g  conftest.cpp >&5
configure:5857: $? = 0
configure:5864: test -z "$ac_cxx_werror_flag" || test ! -s conftest.err
configure:5867: $? = 0
configure:5874: test -s conftest.o
configure:5877: $? = 0
configure:6007: result: yes
configure:6032: checking dependency style of c++
configure:6115: result: gcc3
configure:6154: c++ -c -g -O2  conftest.cpp >&5
configure:6160: $? = 0
configure:6167: test -z "$ac_cxx_werror_flag" || test ! -s conftest.err
configure:6170: $? = 0
configure:6177: test -s conftest.o
configure:6180: $? = 0
configure:6211: checking for gcc option to accept ANSI C
configure:6279: gcc  -c -g -O2  conftest.c >&5
configure:6285: $? = 0
configure:6292: test -z "$ac_c_werror_flag" || test ! -s conftest.err
configure:6295: $? = 0
configure:6302: test -s conftest.o
configure:6305: $? = 0
configure:6322: result: none needed
configure:6346: checking for a BSD-compatible install
configure:6402: result: /usr/bin/install -c
configure:6421: checking for special C compiler options needed for large files
configure:6548: result: no
configure:6554: checking for _FILE_OFFSET_BITS value needed for large files
configure:6590: gcc -c -g -O2  conftest.c >&5
conftest.c:20: warning: left shift count >= width of type
conftest.c:20: warning: left shift count >= width of type
conftest.c:22: error: size of array 'off_t_is_large' is negative
configure:6596: $? = 1
configure: failed program was:
| /* confdefs.h.  */
| #define PACKAGE_NAME "glib"
| #define PACKAGE_TARNAME "glib"
| #define PACKAGE_VERSION "2.14.0"
| #define PACKAGE_STRING "glib 2.14.0"
| #define PACKAGE_BUGREPORT "http://bugzilla.gnome.org/enter_bug.cgi?product=glib"
| #define GLIB_MAJOR_VERSION 2
| #define GLIB_MINOR_VERSION 14
| #define GLIB_MICRO_VERSION 0
| #define GLIB_INTERFACE_AGE 0
| #define GLIB_BINARY_AGE 1400
| #define G_COMPILED_WITH_DEBUGGING "minimum"
| /* end confdefs.h.  */
| #include <sys/types.h>
|  /* Check that off_t can represent 2**63 - 1 correctly.
|     We can't simply define LARGE_OFF_T to be 9223372036854775807,
|     since some C++ compilers masquerading as C compilers
|     incorrectly reject 9223372036854775807.  */
| #define LARGE_OFF_T (((off_t) 1 << 62) - 1 + ((off_t) 1 << 62))
|   int off_t_is_large[(LARGE_OFF_T % 2147483629 == 721
| 		       && LARGE_OFF_T % 2147483647 == 1)
| 		      ? 1 : -1];
| int
| main ()
| {
| 
|   ;
|   return 0;
| }
configure:6657: gcc -c -g -O2  conftest.c >&5
configure:6663: $? = 0
configure:6670: test -z "$ac_c_werror_flag" || test ! -s conftest.err
configure:6673: $? = 0
configure:6680: test -s conftest.o
configure:6683: $? = 0
configure:6697: result: 64
configure:6707: checking for _LARGE_FILES value needed for large files
configure:6743: gcc -c -g -O2  conftest.c >&5
configure:6749: $? = 0
configure:6756: test -z "$ac_c_werror_flag" || test ! -s conftest.err
configure:6759: $? = 0
configure:6766: test -s conftest.o
configure:6769: $? = 0
configure:6850: result: no
configure:6868: checking for pkg-config
configure:6886: found /usr/bin/pkg-config
configure:6899: result: /usr/bin/pkg-config
configure:6989: checking for gawk
configure:7016: result: gawk
configure:7031: checking for perl5
configure:7061: result: no
configure:7031: checking for perl
configure:7047: found /usr/bin/perl
configure:7058: result: perl
configure:7072: checking for indent
configure:7102: result: no
configure:7121: checking for perl
configure:7139: found /usr/bin/perl
configure:7151: result: /usr/bin/perl
configure:7179: checking for iconv_open
configure:7235: gcc -o conftest -g -O2   conftest.c  >&5
configure:7241: $? = 0
configure:7248: test -z "$ac_c_werror_flag" || test ! -s conftest.err
configure:7251: $? = 0
configure:7258: test -s conftest
configure:7261: $? = 0
configure:7274: result: yes
configure:7726: checking for grep that handles long lines and -e
configure:7800: result: /bin/grep
configure:7805: checking for egrep
configure:7883: result: /bin/grep -E
configure:7889: checking whether we are using the GNU C Library 2.1 or newer
configure:7920: result: yes
configure:7934: checking Whether to cache iconv descriptors
configure:7960: result: no
configure:7966: checking for ANSI C header files
configure:7996: gcc -c -g -O2  conftest.c >&5
configure:8002: $? = 0
configure:8009: test -z "$ac_c_werror_flag" || test ! -s conftest.err
configure:8012: $? = 0
configure:8019: test -s conftest.o
configure:8022: $? = 0
configure:8118: gcc -o conftest -g -O2   conftest.c  >&5
configure:8121: $? = 0
configure:8127: ./conftest
configure:8130: $? = 0
configure:8147: result: yes
configure:8171: checking for sys/types.h
configure:8192: gcc -c -g -O2  conftest.c >&5
configure:8198: $? = 0
configure:8205: test -z "$ac_c_werror_flag" || test ! -s conftest.err
configure:8208: $? = 0
configure:8215: test -s conftest.o
configure:8218: $? = 0
configure:8231: result: yes
configure:8171: checking for sys/stat.h
configure:8192: gcc -c -g -O2  conftest.c >&5
configure:8198: $? = 0
configure:8205: test -z "$ac_c_werror_flag" || test ! -s conftest.err
configure:8208: $? = 0
configure:8215: test -s conftest.o
configure:8218: $? = 0
configure:8231: result: yes
configure:8171: checking for stdlib.h
configure:8192: gcc -c -g -O2  conftest.c >&5
configure:8198: $? = 0
configure:8205: test -z "$ac_c_werror_flag" || test ! -s conftest.err
configure:8208: $? = 0
configure:8215: test -s conftest.o
configure:8218: $? = 0
configure:8231: result: yes
configure:8171: checking for string.h
configure:8192: gcc -c -g -O2  conftest.c >&5
configure:8198: $? = 0
configure:8205: test -z "$ac_c_werror_flag" || test ! -s conftest.err
configure:8208: $? = 0
configure:8215: test -s conftest.o
configure:8218: $? = 0
configure:8231: result: yes
configure:8171: checking for memory.h
configure:8192: gcc -c -g -O2  conftest.c >&5
configure:8198: $? = 0
configure:8205: test -z "$ac_c_werror_flag" || test ! -s conftest.err
configure:8208: $? = 0
configure:8215: test -s conftest.o
configure:8218: $? = 0
configure:8231: result: yes
configure:8171: checking for strings.h
configure:8192: gcc -c -g -O2  conftest.c >&5
configure:8198: $? = 0
configure:8205: test -z "$ac_c_werror_flag" || test ! -s conftest.err
configure:8208: $? = 0
configure:8215: test -s conftest.o
configure:8218: $? = 0
configure:8231: result: yes
configure:8171: checking for inttypes.h
configure:8192: gcc -c -g -O2  conftest.c >&5
configure:8198: $? = 0
configure:8205: test -z "$ac_c_werror_flag" || test ! -s conftest.err
configure:8208: $? = 0
configure:8215: test -s conftest.o
configure:8218: $? = 0
configure:8231: result: yes
configure:8171: checking for stdint.h
configure:8192: gcc -c -g -O2  conftest.c >&5
configure:8198: $? = 0
configure:8205: test -z "$ac_c_werror_flag" || test ! -s conftest.err
configure:8208: $? = 0
configure:8215: test -s conftest.o
configure:8218: $? = 0
configure:8231: result: yes
configure:8171: checking for unistd.h
configure:8192: gcc -c -g -O2  conftest.c >&5
configure:8198: $? = 0
configure:8205: test -z "$ac_c_werror_flag" || test ! -s conftest.err
configure:8208: $? = 0
configure:8215: test -s conftest.o
configure:8218: $? = 0
configure:8231: result: yes
configure:8259: checking locale.h usability
configure:8276: gcc -c -g -O2  conftest.c >&5
configure:8282: $? = 0
configure:8289: test -z "$ac_c_werror_flag" || test ! -s conftest.err
configure:8292: $? = 0
configure:8299: test -s conftest.o
configure:8302: $? = 0
configure:8313: result: yes
configure:8317: checking locale.h presence
configure:8332: gcc -E  conftest.c
configure:8338: $? = 0
configure:8359: result: yes
configure:8392: checking for locale.h
configure:8400: result: yes
configure:8414: checking for LC_MESSAGES
configure:8440: gcc -o conftest -g -O2   conftest.c  >&5
configure:8446: $? = 0
configure:8453: test -z "$ac_c_werror_flag" || test ! -s conftest.err
configure:8456: $? = 0
configure:8463: test -s conftest
configure:8466: $? = 0
configure:8479: result: yes
configure:8508: checking libintl.h usability
configure:8525: gcc -c -g -O2  conftest.c >&5
configure:8531: $? = 0
configure:8538: test -z "$ac_c_werror_flag" || test ! -s conftest.err
configure:8541: $? = 0
configure:8548: test -s conftest.o
configure:8551: $? = 0
configure:8562: result: yes
configure:8566: checking libintl.h presence
configure:8581: gcc -E  conftest.c
configure:8587: $? = 0
configure:8608: result: yes
configure:8641: checking for libintl.h
configure:8648: result: yes
configure:8659: checking for ngettext in libc
configure:8687: gcc -o conftest -g -O2   conftest.c  >&5
configure:8693: $? = 0
configure:8700: test -z "$ac_c_werror_flag" || test ! -s conftest.err
configure:8703: $? = 0
configure:8710: test -s conftest
configure:8713: $? = 0
configure:8727: result: yes
configure:8731: checking for dgettext in libc
configure:8759: gcc -o conftest -g -O2   conftest.c  >&5
configure:8765: $? = 0
configure:8772: test -z "$ac_c_werror_flag" || test ! -s conftest.err
configure:8775: $? = 0
configure:8782: test -s conftest
configure:8785: $? = 0
configure:8799: result: yes
configure:8808: checking for bind_textdomain_codeset
configure:8864: gcc -o conftest -g -O2   conftest.c  >&5
configure:8870: $? = 0
configure:8877: test -z "$ac_c_werror_flag" || test ! -s conftest.err
configure:8880: $? = 0
configure:8887: test -s conftest
configure:8890: $? = 0
configure:8904: result: yes
configure:9487: checking for msgfmt
configure:9514: result: /usr/bin/msgfmt
configure:9527: checking for dcgettext
configure:9583: gcc -o conftest -g -O2   conftest.c   >&5
conftest.c:52: warning: conflicting types for built-in function 'dcgettext'
configure:9589: $? = 0
configure:9596: test -z "$ac_c_werror_flag" || test ! -s conftest.err
configure:9599: $? = 0
configure:9606: test -s conftest
configure:9609: $? = 0
configure:9623: result: yes
configure:9634: checking if msgfmt accepts -c
configure:9649: $MSGFMT -c -o /dev/null conftest.foo
configure:9652: $? = 0
configure:9654: result: yes
configure:9664: checking for gmsgfmt
configure:9695: result: /usr/bin/msgfmt
configure:9705: checking for xgettext
configure:9732: result: /usr/bin/xgettext
configure:9761: gcc -o conftest -g -O2   conftest.c   >&5
configure:9767: $? = 0
configure:9774: test -z "$ac_c_werror_flag" || test ! -s conftest.err
configure:9777: $? = 0
configure:9784: test -s conftest
configure:9787: $? = 0
configure:9968: checking for catalogs to be installed
configure:9993: result:  am ar as az be be@latin bg bn bn_IN bs ca cs cy da de dz el en_CA en_GB eo es et eu fa fi fr ga gl gu he hi hr hu hy id is it ja ka kn ko ku lt lv mg mk ml mn ms nb ne nl nn or pa pl pt pt_BR ro ru rw sk sl sq sr sr@Latn sr@ije sv ta te th tl tr tt uk vi wa xh yi zh_CN zh_HK zh_TW
configure:10170: checking for a sed that does not truncate output
configure:10224: result: /bin/sed
configure:10238: checking for ld used by gcc
configure:10305: result: /usr/bin/ld
configure:10314: checking if the linker (/usr/bin/ld) is GNU ld
configure:10329: result: yes
configure:10334: checking for /usr/bin/ld option to reload object files
configure:10341: result: -r
configure:10359: checking for BSD-compatible nm
configure:10408: result: /usr/bin/nm -B
configure:10412: checking whether ln -s works
configure:10416: result: yes
configure:10423: checking how to recognise dependent libraries
configure:10599: result: pass_all
configure:11147: checking dlfcn.h usability
configure:11164: gcc -c -g -O2  conftest.c >&5
configure:11170: $? = 0
configure:11177: test -z "$ac_c_werror_flag" || test ! -s conftest.err
configure:11180: $? = 0
configure:11187: test -s conftest.o
configure:11190: $? = 0
configure:11201: result: yes
configure:11205: checking dlfcn.h presence
configure:11220: gcc -E  conftest.c
configure:11226: $? = 0
configure:11247: result: yes
configure:11280: checking for dlfcn.h
configure:11288: result: yes
configure:11311: checking how to run the C++ preprocessor
configure:11347: c++ -E  conftest.cpp
configure:11353: $? = 0
configure:11391: c++ -E  conftest.cpp
conftest.cpp:34:28: error: ac_nonexistent.h: No such file or directory
configure:11397: $? = 1
configure: failed program was:
| /* confdefs.h.  */
| #define PACKAGE_NAME "glib"
| #define PACKAGE_TARNAME "glib"
| #define PACKAGE_VERSION "2.14.0"
| #define PACKAGE_STRING "glib 2.14.0"
| #define PACKAGE_BUGREPORT "http://bugzilla.gnome.org/enter_bug.cgi?product=glib"
| #define GLIB_MAJOR_VERSION 2
| #define GLIB_MINOR_VERSION 14
| #define GLIB_MICRO_VERSION 0
| #define GLIB_INTERFACE_AGE 0
| #define GLIB_BINARY_AGE 1400
| #define G_COMPILED_WITH_DEBUGGING "minimum"
| #define _FILE_OFFSET_BITS 64
| #define STDC_HEADERS 1
| #define HAVE_SYS_TYPES_H 1
| #define HAVE_SYS_STAT_H 1
| #define HAVE_STDLIB_H 1
| #define HAVE_STRING_H 1
| #define HAVE_MEMORY_H 1
| #define HAVE_STRINGS_H 1
| #define HAVE_INTTYPES_H 1
| #define HAVE_STDINT_H 1
| #define HAVE_UNISTD_H 1
| #define HAVE_LOCALE_H 1
| #define HAVE_LC_MESSAGES 1
| #define HAVE_BIND_TEXTDOMAIN_CODESET 1
| #define HAVE_GETTEXT 1
| #define HAVE_DCGETTEXT 1
| #define ENABLE_NLS 1
| #define GETTEXT_PACKAGE "glib20"
| #define GLIB_LOCALE_DIR "/usr/share/locale"
| #define HAVE_DLFCN_H 1
| /* end confdefs.h.  */
| #include <ac_nonexistent.h>
configure:11437: result: c++ -E
configure:11466: c++ -E  conftest.cpp
configure:11472: $? = 0
configure:11510: c++ -E  conftest.cpp
conftest.cpp:34:28: error: ac_nonexistent.h: No such file or directory
configure:11516: $? = 1
configure: failed program was:
| /* confdefs.h.  */
| #define PACKAGE_NAME "glib"
| #define PACKAGE_TARNAME "glib"
| #define PACKAGE_VERSION "2.14.0"
| #define PACKAGE_STRING "glib 2.14.0"
| #define PACKAGE_BUGREPORT "http://bugzilla.gnome.org/enter_bug.cgi?product=glib"
| #define GLIB_MAJOR_VERSION 2
| #define GLIB_MINOR_VERSION 14
| #define GLIB_MICRO_VERSION 0
| #define GLIB_INTERFACE_AGE 0
| #define GLIB_BINARY_AGE 1400
| #define G_COMPILED_WITH_DEBUGGING "minimum"
| #define _FILE_OFFSET_BITS 64
| #define STDC_HEADERS 1
| #define HAVE_SYS_TYPES_H 1
| #define HAVE_SYS_STAT_H 1
| #define HAVE_STDLIB_H 1
| #define HAVE_STRING_H 1
| #define HAVE_MEMORY_H 1
| #define HAVE_STRINGS_H 1
| #define HAVE_INTTYPES_H 1
| #define HAVE_STDINT_H 1
| #define HAVE_UNISTD_H 1
| #define HAVE_LOCALE_H 1
| #define HAVE_LC_MESSAGES 1
| #define HAVE_BIND_TEXTDOMAIN_CODESET 1
| #define HAVE_GETTEXT 1
| #define HAVE_DCGETTEXT 1
| #define ENABLE_NLS 1
| #define GETTEXT_PACKAGE "glib20"
| #define GLIB_LOCALE_DIR "/usr/share/locale"
| #define HAVE_DLFCN_H 1
| /* end confdefs.h.  */
| #include <ac_nonexistent.h>
configure:11615: checking for g77
configure:11645: result: no
configure:11615: checking for f77
configure:11645: result: no
configure:11615: checking for xlf
configure:11645: result: no
configure:11615: checking for frt
configure:11645: result: no
configure:11615: checking for pgf77
configure:11645: result: no
configure:11615: checking for cf77
configure:11645: result: no
configure:11615: checking for fort77
configure:11645: result: no
configure:11615: checking for fl32
configure:11645: result: no
configure:11615: checking for af77
configure:11645: result: no
configure:11615: checking for f90
configure:11645: result: no
configure:11615: checking for xlf90
configure:11645: result: no
configure:11615: checking for pgf90
configure:11645: result: no
configure:11615: checking for pghpf
configure:11645: result: no
configure:11615: checking for epcf90
configure:11645: result: no
configure:11615: checking for gfortran
configure:11645: result: no
configure:11615: checking for g95
configure:11645: result: no
configure:11615: checking for f95
configure:11645: result: no
configure:11615: checking for fort
configure:11645: result: no
configure:11615: checking for xlf95
configure:11645: result: no
configure:11615: checking for ifort
configure:11645: result: no
configure:11615: checking for ifc
configure:11645: result: no
configure:11615: checking for efc
configure:11645: result: no
configure:11615: checking for pgf95
configure:11645: result: no
configure:11615: checking for lf95
configure:11645: result: no
configure:11615: checking for ftn
configure:11645: result: no
configure:11672: checking for Fortran 77 compiler version
configure:11679:  --version >&5
./configure: line 11680: --version: command not found
configure:11682: $? = 127
configure:11689:  -v >&5
./configure: line 11690: -v: command not found
configure:11692: $? = 127
configure:11699:  -V >&5
./configure: line 11700: -V: command not found
configure:11702: $? = 127
configure:11710: checking whether we are using the GNU Fortran 77 compiler
configure:11729:  -c  conftest.F >&5
./configure: line 11730: -c: command not found
configure:11735: $? = 127
configure: failed program was:
|       program main
| #ifndef __GNUC__
|        choke me
| #endif
| 
|       end
configure:11769: result: no
configure:11775: checking whether  accepts -g
configure:11792:  -c -g conftest.f >&5
./configure: line 11793: -c: command not found
configure:11798: $? = 127
configure: failed program was:
|       program main
| 
|       end
configure:11831: result: no
configure:11861: checking the maximum length of command line arguments
configure:11970: result: 32768
configure:11981: checking command to parse /usr/bin/nm -B output from gcc object
configure:12086: gcc -c -g -O2  conftest.c >&5
configure:12089: $? = 0
configure:12093: /usr/bin/nm -B conftest.o \| sed -n -e 's/^.*[ 	]\([ABCDGIRSTW][ABCDGIRSTW]*\)[ 	][ 	]*\([_A-Za-z][_A-Za-z0-9]*\)$/\1 \2 \2/p' \> conftest.nm
configure:12096: $? = 0
configure:12148: gcc -o conftest -g -O2   conftest.c conftstm.o >&5
configure:12151: $? = 0
configure:12189: result: ok
configure:12193: checking for objdir
configure:12208: result: .libs
configure:12300: checking for ar
configure:12316: found /usr/bin/ar
configure:12327: result: ar
configure:12396: checking for ranlib
configure:12412: found /usr/bin/ranlib
configure:12423: result: ranlib
configure:12492: checking for strip
configure:12508: found /usr/bin/strip
configure:12519: result: strip
configure:12805: checking if gcc supports -fno-rtti -fno-exceptions
configure:12823: gcc -c -g -O2  -fno-rtti -fno-exceptions conftest.c >&5
cc1: warning: command line option "-fno-rtti" is valid for C++/ObjC++ but not for C
configure:12827: $? = 0
configure:12840: result: no
configure:12855: checking for gcc option to produce PIC
configure:13065: result: -fPIC
configure:13073: checking if gcc PIC flag -fPIC works
configure:13091: gcc -c -g -O2  -fPIC -DPIC conftest.c >&5
configure:13095: $? = 0
configure:13108: result: yes
configure:13136: checking if gcc static flag -static works
configure:13164: result: yes
configure:13174: checking if gcc supports -c -o file.o
configure:13195: gcc -c -g -O2  -o out/conftest2.o conftest.c >&5
configure:13199: $? = 0
configure:13221: result: yes
configure:13247: checking whether the gcc linker (/usr/bin/ld) supports shared libraries
configure:14233: result: yes
configure:14254: checking whether -lc should be explicitly linked in
configure:14259: gcc -c -g -O2  conftest.c >&5
configure:14262: $? = 0
configure:14277: gcc -shared conftest.o  -v -Wl,-soname -Wl,conftest -o conftest 2\>\&1 \| grep  -lc  \>/dev/null 2\>\&1
configure:14280: $? = 0
configure:14292: result: no
configure:14300: checking dynamic linker characteristics
configure:14909: result: GNU/Linux ld.so
configure:14918: checking how to hardcode library paths into programs
configure:14943: result: immediate
configure:14957: checking whether stripping libraries is possible
configure:14962: result: yes
configure:15875: checking if libtool supports shared libraries
configure:15877: result: yes
configure:15880: checking whether to build shared libraries
configure:15901: result: yes
configure:15904: checking whether to build static libraries
configure:15908: result: no
configure:16000: creating libtool
configure:16588: checking for ld used by c++
configure:16655: result: /usr/bin/ld
configure:16664: checking if the linker (/usr/bin/ld) is GNU ld
configure:16679: result: yes
configure:16730: checking whether the c++ linker (/usr/bin/ld) supports shared libraries
configure:17696: result: yes
configure:17714: c++ -c -g -O2  conftest.cpp >&5
configure:17717: $? = 0
configure:17836: checking for c++ option to produce PIC
configure:18110: result: -fPIC
configure:18118: checking if c++ PIC flag -fPIC works
configure:18136: c++ -c -g -O2  -fPIC -DPIC conftest.cpp >&5
configure:18140: $? = 0
configure:18153: result: yes
configure:18181: checking if c++ static flag -static works
configure:18209: result: yes
configure:18219: checking if c++ supports -c -o file.o
configure:18240: c++ -c -g -O2  -o out/conftest2.o conftest.cpp >&5
configure:18244: $? = 0
configure:18266: result: yes
configure:18292: checking whether the c++ linker (/usr/bin/ld) supports shared libraries
configure:18317: result: yes
configure:18384: checking dynamic linker characteristics
configure:18993: result: GNU/Linux ld.so
configure:19002: checking how to hardcode library paths into programs
configure:19027: result: immediate
configure:25282: checking for extra flags to get ANSI library prototypes
configure:25308: gcc -o conftest -g -O2 -Wall   conftest.c   -lm >&5
configure:25311: $? = 0
configure:25317: ./conftest
configure:25320: $? = 0
configure:25322: result: none needed
configure:25396: checking for extra flags for POSIX compliance
configure:25419: gcc -c -g -O2 -Wall  conftest.c >&5
conftest.c: In function 'main':
conftest.c:38: warning: unused variable 'dir'
configure:25425: $? = 0
configure:25432: test -z "$ac_c_werror_flag" || test ! -s conftest.err
configure:25435: $? = 0
configure:25442: test -s conftest.o
configure:25445: $? = 0
configure:25447: result: none needed
configure:25523: checking for ANSI C header files
configure:25704: result: yes
configure:25720: checking for vprintf
configure:25776: gcc -o conftest -g -O2 -Wall   conftest.c   >&5
conftest.c:58: warning: conflicting types for built-in function 'vprintf'
configure:25782: $? = 0
configure:25789: test -z "$ac_c_werror_flag" || test ! -s conftest.err
configure:25792: $? = 0
configure:25799: test -s conftest
configure:25802: $? = 0
configure:25816: result: yes
configure:25823: checking for _doprnt
configure:25879: gcc -o conftest -g -O2 -Wall   conftest.c   >&5
/tmp/ccisv8jd.o: In function `main':
/home/rasmer/src/glib/2.14.0/glib-2.14.0/conftest.c:70: undefined reference to `_doprnt'
collect2: ld returned 1 exit status
configure:25885: $? = 1
configure: failed program was:
| /* confdefs.h.  */
| #define PACKAGE_NAME "glib"
| #define PACKAGE_TARNAME "glib"
| #define PACKAGE_VERSION "2.14.0"
| #define PACKAGE_STRING "glib 2.14.0"
| #define PACKAGE_BUGREPORT "http://bugzilla.gnome.org/enter_bug.cgi?product=glib"
| #define GLIB_MAJOR_VERSION 2
| #define GLIB_MINOR_VERSION 14
| #define GLIB_MICRO_VERSION 0
| #define GLIB_INTERFACE_AGE 0
| #define GLIB_BINARY_AGE 1400
| #define G_COMPILED_WITH_DEBUGGING "minimum"
| #define _FILE_OFFSET_BITS 64
| #define STDC_HEADERS 1
| #define HAVE_SYS_TYPES_H 1
| #define HAVE_SYS_STAT_H 1
| #define HAVE_STDLIB_H 1
| #define HAVE_STRING_H 1
| #define HAVE_MEMORY_H 1
| #define HAVE_STRINGS_H 1
| #define HAVE_INTTYPES_H 1
| #define HAVE_STDINT_H 1
| #define HAVE_UNISTD_H 1
| #define HAVE_LOCALE_H 1
| #define HAVE_LC_MESSAGES 1
| #define HAVE_BIND_TEXTDOMAIN_CODESET 1
| #define HAVE_GETTEXT 1
| #define HAVE_DCGETTEXT 1
| #define ENABLE_NLS 1
| #define GETTEXT_PACKAGE "glib20"
| #define GLIB_LOCALE_DIR "/usr/share/locale"
| #define HAVE_DLFCN_H 1
| #define STDC_HEADERS 1
| #define HAVE_VPRINTF 1
| /* end confdefs.h.  */
| /* Define _doprnt to an innocuous variant, in case <limits.h> declares _doprnt.
|    For example, HP-UX 11i <limits.h> declares gettimeofday.  */
| #define _doprnt innocuous__doprnt
| 
| /* System header to define __stub macros and hopefully few prototypes,
|     which can conflict with char _doprnt (); below.
|     Prefer <limits.h> to <assert.h> if __STDC__ is defined, since
|     <limits.h> exists even on freestanding compilers.  */
| 
| #ifdef __STDC__
| # include <limits.h>
| #else
| # include <assert.h>
| #endif
| 
| #undef _doprnt
| 
| /* Override any GCC internal prototype to avoid an error.
|    Use char because int might match the return type of a GCC
|    builtin and then its argument prototype would still apply.  */
| #ifdef __cplusplus
| extern "C"
| #endif
| char _doprnt ();
| /* The GNU C library defines this for functions which it implements
|     to always fail with ENOSYS.  Some functions are actually named
|     something starting with __ and the normal name is an alias.  */
| #if defined __stub__doprnt || defined __stub____doprnt
| choke me
| #endif
| 
| int
| main ()
| {
| return _doprnt ();
|   ;
|   return 0;
| }
configure:25918: result: no
configure:25938: checking for stdlib.h
configure:25944: result: yes
configure:25938: checking for unistd.h
configure:25944: result: yes
configure:26106: checking for getpagesize
configure:26162: gcc -o conftest -g -O2 -Wall   conftest.c   >&5
configure:26168: $? = 0
configure:26175: test -z "$ac_c_werror_flag" || test ! -s conftest.err
configure:26178: $? = 0
configure:26185: test -s conftest
configure:26188: $? = 0
configure:26202: result: yes
configure:26212: checking for working mmap
configure:26359: gcc -o conftest -g -O2 -Wall   conftest.c   >&5
configure:26362: $? = 0
configure:26368: ./conftest
configure:26371: $? = 0
configure:26387: result: yes
configure:26400: checking for working alloca.h
configure:26427: gcc -o conftest -g -O2 -Wall   conftest.c   >&5
configure:26433: $? = 0
configure:26440: test -z "$ac_c_werror_flag" || test ! -s conftest.err
configure:26443: $? = 0
configure:26450: test -s conftest
configure:26453: $? = 0
configure:26466: result: yes
configure:26476: checking for alloca
configure:26523: gcc -o conftest -g -O2 -Wall   conftest.c   >&5
configure:26529: $? = 0
configure:26536: test -z "$ac_c_werror_flag" || test ! -s conftest.err
configure:26539: $? = 0
configure:26546: test -s conftest
configure:26549: $? = 0
configure:26562: result: yes
configure:26809: checking for posix_memalign
configure:26865: gcc -o conftest -g -O2 -Wall   conftest.c   >&5
configure:26871: $? = 0
configure:26878: test -z "$ac_c_werror_flag" || test ! -s conftest.err
configure:26881: $? = 0
configure:26888: test -s conftest
configure:26891: $? = 0
configure:26905: result: yes
configure:26919: checking for memalign
configure:26975: gcc -o conftest -g -O2 -Wall   conftest.c   >&5
configure:26981: $? = 0
configure:26988: test -z "$ac_c_werror_flag" || test ! -s conftest.err
configure:26991: $? = 0
configure:26998: test -s conftest
configure:27001: $? = 0
configure:27015: result: yes
configure:27029: checking for valloc
configure:27085: gcc -o conftest -g -O2 -Wall   conftest.c   >&5
configure:27091: $? = 0
configure:27098: test -z "$ac_c_werror_flag" || test ! -s conftest.err
configure:27101: $? = 0
configure:27108: test -s conftest
configure:27111: $? = 0
configure:27125: result: yes
configure:27141: checking for atexit
configure:27197: gcc -o conftest -g -O2 -Wall   conftest.c   >&5
configure:27203: $? = 0
configure:27210: test -z "$ac_c_werror_flag" || test ! -s conftest.err
configure:27213: $? = 0
configure:27220: test -s conftest
configure:27223: $? = 0
configure:27237: result: yes
configure:27141: checking for on_exit
configure:27197: gcc -o conftest -g -O2 -Wall   conftest.c   >&5
configure:27203: $? = 0
configure:27210: test -z "$ac_c_werror_flag" || test ! -s conftest.err
configure:27213: $? = 0
configure:27220: test -s conftest
configure:27223: $? = 0
configure:27237: result: yes
configure:27252: checking for timegm
configure:27308: gcc -o conftest -g -O2 -Wall   conftest.c   >&5
configure:27314: $? = 0
configure:27321: test -z "$ac_c_werror_flag" || test ! -s conftest.err
configure:27324: $? = 0
configure:27331: test -s conftest
configure:27334: $? = 0
configure:27348: result: yes
configure:27359: checking for char
configure:27389: gcc -c -g -O2 -Wall  conftest.c >&5
configure:27395: $? = 0
configure:27402: test -z "$ac_c_werror_flag" || test ! -s conftest.err
configure:27405: $? = 0
configure:27412: test -s conftest.o
configure:27415: $? = 0
configure:27427: result: yes
configure:27430: checking size of char
configure:27818: gcc -o conftest -g -O2 -Wall   conftest.c   >&5
configure:27821: $? = 0
configure:27827: ./conftest
configure:27830: $? = 0
configure:27852: result: 1
configure:27859: checking for short
configure:27889: gcc -c -g -O2 -Wall  conftest.c >&5
configure:27895: $? = 0
configure:27902: test -z "$ac_c_werror_flag" || test ! -s conftest.err
configure:27905: $? = 0
configure:27912: test -s conftest.o
configure:27915: $? = 0
configure:27927: result: yes
configure:27930: checking size of short
configure:28318: gcc -o conftest -g -O2 -Wall   conftest.c   >&5
configure:28321: $? = 0
configure:28327: ./conftest
configure:28330: $? = 0
configure:28352: result: 2
configure:28359: checking for long
configure:28389: gcc -c -g -O2 -Wall  conftest.c >&5
configure:28395: $? = 0
configure:28402: test -z "$ac_c_werror_flag" || test ! -s conftest.err
configure:28405: $? = 0
configure:28412: test -s conftest.o
configure:28415: $? = 0
configure:28427: result: yes
configure:28430: checking size of long
configure:28818: gcc -o conftest -g -O2 -Wall   conftest.c   >&5
configure:28821: $? = 0
configure:28827: ./conftest
configure:28830: $? = 0
configure:28852: result: 4
configure:28859: checking for int
configure:28889: gcc -c -g -O2 -Wall  conftest.c >&5
configure:28895: $? = 0
configure:28902: test -z "$ac_c_werror_flag" || test ! -s conftest.err
configure:28905: $? = 0
configure:28912: test -s conftest.o
configure:28915: $? = 0
configure:28927: result: yes
configure:28930: checking size of int
configure:29318: gcc -o conftest -g -O2 -Wall   conftest.c   >&5
configure:29321: $? = 0
configure:29327: ./conftest
configure:29330: $? = 0
configure:29352: result: 4
configure:29359: checking for void *
configure:29389: gcc -c -g -O2 -Wall  conftest.c >&5
configure:29395: $? = 0
configure:29402: test -z "$ac_c_werror_flag" || test ! -s conftest.err
configure:29405: $? = 0
configure:29412: test -s conftest.o
configure:29415: $? = 0
configure:29427: result: yes
configure:29430: checking size of void *
configure:29818: gcc -o conftest -g -O2 -Wall   conftest.c   >&5
configure:29821: $? = 0
configure:29827: ./conftest
configure:29830: $? = 0
configure:29852: result: 4
configure:29859: checking for long long
configure:29889: gcc -c -g -O2 -Wall  conftest.c >&5
configure:29895: $? = 0
configure:29902: test -z "$ac_c_werror_flag" || test ! -s conftest.err
configure:29905: $? = 0
configure:29912: test -s conftest.o
configure:29915: $? = 0
configure:29927: result: yes
configure:29930: checking size of long long
configure:30318: gcc -o conftest -g -O2 -Wall   conftest.c   >&5
configure:30321: $? = 0
configure:30327: ./conftest
configure:30330: $? = 0
configure:30352: result: 8
configure:30359: checking for __int64
configure:30389: gcc -c -g -O2 -Wall  conftest.c >&5
conftest.c:87: error: expected '=', ',', ';', 'asm' or '__attribute__' before 'ac__type_new_'
conftest.c: In function 'main':
conftest.c:91: error: 'ac__type_new_' undeclared (first use in this function)
conftest.c:91: error: (Each undeclared identifier is reported only once
conftest.c:91: error: for each function it appears in.)
conftest.c:91: error: expected expression before ')' token
configure:30395: $? = 1
configure: failed program was:
| /* confdefs.h.  */
| #define PACKAGE_NAME "glib"
| #define PACKAGE_TARNAME "glib"
| #define PACKAGE_VERSION "2.14.0"
| #define PACKAGE_STRING "glib 2.14.0"
| #define PACKAGE_BUGREPORT "http://bugzilla.gnome.org/enter_bug.cgi?product=glib"
| #define GLIB_MAJOR_VERSION 2
| #define GLIB_MINOR_VERSION 14
| #define GLIB_MICRO_VERSION 0
| #define GLIB_INTERFACE_AGE 0
| #define GLIB_BINARY_AGE 1400
| #define G_COMPILED_WITH_DEBUGGING "minimum"
| #define _FILE_OFFSET_BITS 64
| #define STDC_HEADERS 1
| #define HAVE_SYS_TYPES_H 1
| #define HAVE_SYS_STAT_H 1
| #define HAVE_STDLIB_H 1
| #define HAVE_STRING_H 1
| #define HAVE_MEMORY_H 1
| #define HAVE_STRINGS_H 1
| #define HAVE_INTTYPES_H 1
| #define HAVE_STDINT_H 1
| #define HAVE_UNISTD_H 1
| #define HAVE_LOCALE_H 1
| #define HAVE_LC_MESSAGES 1
| #define HAVE_BIND_TEXTDOMAIN_CODESET 1
| #define HAVE_GETTEXT 1
| #define HAVE_DCGETTEXT 1
| #define ENABLE_NLS 1
| #define GETTEXT_PACKAGE "glib20"
| #define GLIB_LOCALE_DIR "/usr/share/locale"
| #define HAVE_DLFCN_H 1
| #define STDC_HEADERS 1
| #define HAVE_VPRINTF 1
| #define HAVE_STDLIB_H 1
| #define HAVE_UNISTD_H 1
| #define HAVE_GETPAGESIZE 1
| #define HAVE_MMAP 1
| #define HAVE_ALLOCA_H 1
| #define HAVE_ALLOCA 1
| #define HAVE_POSIX_MEMALIGN 1
| #define HAVE_MEMALIGN 1
| #define HAVE_VALLOC 1
| #define HAVE_ATEXIT 1
| #define HAVE_ON_EXIT 1
| #define HAVE_TIMEGM 1
| #define SIZEOF_CHAR 1
| #define SIZEOF_SHORT 2
| #define SIZEOF_LONG 4
| #define SIZEOF_INT 4
| #define SIZEOF_VOID_P 4
| #define SIZEOF_LONG_LONG 8
| /* end confdefs.h.  */
| #include <stdio.h>
| #if HAVE_SYS_TYPES_H
| # include <sys/types.h>
| #endif
| #if HAVE_SYS_STAT_H
| # include <sys/stat.h>
| #endif
| #if STDC_HEADERS
| # include <stdlib.h>
| # include <stddef.h>
| #else
| # if HAVE_STDLIB_H
| #  include <stdlib.h>
| # endif
| #endif
| #if HAVE_STRING_H
| # if !STDC_HEADERS && HAVE_MEMORY_H
| #  include <memory.h>
| # endif
| # include <string.h>
| #endif
| #if HAVE_STRINGS_H
| # include <strings.h>
| #endif
| #if HAVE_INTTYPES_H
| # include <inttypes.h>
| #endif
| #if HAVE_STDINT_H
| # include <stdint.h>
| #endif
| #if HAVE_UNISTD_H
| # include <unistd.h>
| #endif
| typedef __int64 ac__type_new_;
| int
| main ()
| {
| if ((ac__type_new_ *) 0)
|   return 0;
| if (sizeof (ac__type_new_))
|   return 0;
|   ;
|   return 0;
| }
configure:30427: result: no
configure:30430: checking size of __int64
configure:30852: result: 0
configure:30876: checking for format to printf and scanf a guint64
configure:30909: gcc -o conftest -g -O2 -Wall   conftest.c   >&5
conftest.c: In function 'main':
conftest.c:62: warning: implicit declaration of function 'exit'
conftest.c:62: warning: incompatible implicit declaration of built-in function 'exit'
configure:30912: $? = 0
configure:30918: ./conftest
configure:30921: $? = 0
configure:30939: result: %llu
configure:30977: checking for an ANSI C-conforming const
configure:31052: gcc -c -g -O2 -Wall  conftest.c >&5
conftest.c: In function 'main':
conftest.c:85: warning: 't' is used uninitialized in this function
conftest.c:101: warning: 'b' is used uninitialized in this function
conftest.c:107: warning: 'x[0]' is used uninitialized in this function
configure:31058: $? = 0
configure:31065: test -z "$ac_c_werror_flag" || test ! -s conftest.err
configure:31068: $? = 0
configure:31075: test -s conftest.o
configure:31078: $? = 0
configure:31090: result: yes
configure:31102: checking if malloc() and friends prototypes are gmem.h compatible
configure:31137: gcc -c -g -O2 -Wall -Werror  conftest.c >&5
configure:31143: $? = 0
configure:31150: test -z "$ac_c_werror_flag" || test ! -s conftest.err
configure:31153: $? = 0
configure:31160: test -s conftest.o
configure:31163: $? = 0
configure:31180: result: yes
configure:31184: checking for growing stack pointer
configure:31216: gcc -o conftest -g -O2 -Wall   conftest.c   >&5
configure:31219: $? = 0
configure:31225: ./conftest
configure:31228: $? = 0
configure:31247: result: no
configure:31250: checking for __inline
configure:31268: gcc -c -g -O2 -Wall  conftest.c >&5
configure:31274: $? = 0
configure:31281: test -z "$ac_c_werror_flag" || test ! -s conftest.err
configure:31284: $? = 0
configure:31291: test -s conftest.o
configure:31294: $? = 0
configure:31309: result: yes
configure:31318: checking for __inline__
configure:31336: gcc -c -g -O2 -Wall  conftest.c >&5
configure:31342: $? = 0
configure:31349: test -z "$ac_c_werror_flag" || test ! -s conftest.err
configure:31352: $? = 0
configure:31359: test -s conftest.o
configure:31362: $? = 0
configure:31377: result: yes
configure:31386: checking for inline
configure:31405: gcc -c -g -O2 -Wall  conftest.c >&5
configure:31411: $? = 0
configure:31418: test -z "$ac_c_werror_flag" || test ! -s conftest.err
configure:31421: $? = 0
configure:31428: test -s conftest.o
configure:31431: $? = 0
configure:31446: result: yes
configure:31457: checking if inline functions in headers work
configure:31491: gcc -o conftest -g -O2 -Wall   conftest.c   >&5
conftest.c: In function 'main':
conftest.c:23: warning: unused variable 'i'
conftest.c:24: warning: control reaches end of non-void function
configure:31497: $? = 0
configure:31504: test -z "$ac_c_werror_flag" || test ! -s conftest.err
configure:31507: $? = 0
configure:31514: test -s conftest
configure:31517: $? = 0
configure:31529: result: yes
configure:31532: checking for working do while(0) macros
configure:31563: gcc -c -g -O2 -Wall  conftest.c >&5
conftest.c: In function 'main':
conftest.c:68: warning: 'main' is normally a non-static function
configure:31569: $? = 0
configure:31576: test -z "$ac_c_werror_flag" || test ! -s conftest.err
configure:31579: $? = 0
configure:31586: test -s conftest.o
configure:31589: $? = 0
configure:31602: result: yes
configure:31613: checking for ISO C99 varargs macros in C
configure:31640: gcc -c -g -O2 -Wall  conftest.c >&5
configure:31646: $? = 0
configure:31653: test -z "$ac_c_werror_flag" || test ! -s conftest.err
configure:31656: $? = 0
configure:31663: test -s conftest.o
configure:31666: $? = 0
configure:31677: result: yes
configure:31680: checking for ISO C99 varargs macros in C++
configure:31716: c++ -c -g -O2  conftest.cpp >&5
configure:31722: $? = 0
configure:31729: test -z "$ac_cxx_werror_flag" || test ! -s conftest.err
configure:31732: $? = 0
configure:31739: test -s conftest.o
configure:31742: $? = 0
configure:31760: result: yes
configure:31763: checking for GNUC varargs macros
configure:31790: gcc -c -g -O2 -Wall  conftest.c >&5
configure:31796: $? = 0
configure:31803: test -z "$ac_c_werror_flag" || test ! -s conftest.err
configure:31806: $? = 0
configure:31813: test -s conftest.o
configure:31816: $? = 0
configure:31827: result: yes
configure:31831: checking for GNUC visibility attribute
configure:31868: gcc -c -g -O2 -Wall  conftest.c
configure:31874: $? = 0
configure:31877: (if test -s conftest.err; then false ; else true; fi)
configure:31880: $? = 0
configure:31890: result: yes
configure:31903: checking whether using Sun Studio C compiler
configure:31930: gcc -c -g -O2 -Wall  conftest.c >&5
conftest.c:63:43: error: error: this is not Sun Studio.: No such file or directory
configure:31936: $? = 1
configure: failed program was:
| /* confdefs.h.  */
| #define PACKAGE_NAME "glib"
| #define PACKAGE_TARNAME "glib"
| #define PACKAGE_VERSION "2.14.0"
| #define PACKAGE_STRING "glib 2.14.0"
| #define PACKAGE_BUGREPORT "http://bugzilla.gnome.org/enter_bug.cgi?product=glib"
| #define GLIB_MAJOR_VERSION 2
| #define GLIB_MINOR_VERSION 14
| #define GLIB_MICRO_VERSION 0
| #define GLIB_INTERFACE_AGE 0
| #define GLIB_BINARY_AGE 1400
| #define G_COMPILED_WITH_DEBUGGING "minimum"
| #define _FILE_OFFSET_BITS 64
| #define STDC_HEADERS 1
| #define HAVE_SYS_TYPES_H 1
| #define HAVE_SYS_STAT_H 1
| #define HAVE_STDLIB_H 1
| #define HAVE_STRING_H 1
| #define HAVE_MEMORY_H 1
| #define HAVE_STRINGS_H 1
| #define HAVE_INTTYPES_H 1
| #define HAVE_STDINT_H 1
| #define HAVE_UNISTD_H 1
| #define HAVE_LOCALE_H 1
| #define HAVE_LC_MESSAGES 1
| #define HAVE_BIND_TEXTDOMAIN_CODESET 1
| #define HAVE_GETTEXT 1
| #define HAVE_DCGETTEXT 1
| #define ENABLE_NLS 1
| #define GETTEXT_PACKAGE "glib20"
| #define GLIB_LOCALE_DIR "/usr/share/locale"
| #define HAVE_DLFCN_H 1
| #define STDC_HEADERS 1
| #define HAVE_VPRINTF 1
| #define HAVE_STDLIB_H 1
| #define HAVE_UNISTD_H 1
| #define HAVE_GETPAGESIZE 1
| #define HAVE_MMAP 1
| #define HAVE_ALLOCA_H 1
| #define HAVE_ALLOCA 1
| #define HAVE_POSIX_MEMALIGN 1
| #define HAVE_MEMALIGN 1
| #define HAVE_VALLOC 1
| #define HAVE_ATEXIT 1
| #define HAVE_ON_EXIT 1
| #define HAVE_TIMEGM 1
| #define SIZEOF_CHAR 1
| #define SIZEOF_SHORT 2
| #define SIZEOF_LONG 4
| #define SIZEOF_INT 4
| #define SIZEOF_VOID_P 4
| #define SIZEOF_LONG_LONG 8
| #define SIZEOF___INT64 0
| #define HAVE_LONG_LONG_FORMAT 1
| #define SANE_MALLOC_PROTOS 1
| #define G_HAVE___INLINE 1
| #define G_HAVE___INLINE__ 1
| #define G_HAVE_INLINE 1
| #define HAVE_DOWHILE_MACROS 1
| /* end confdefs.h.  */
| #if defined(__SUNPRO_C) || (__SUNPRO_C >= 0x550)
| #else
| # include "error: this is not Sun Studio."
| #endif
| 
| int
| main ()
| {
| 
|   ;
|   return 0;
| }
configure:31967: result: no
configure:31981: checking whether byte ordering is bigendian
configure:32013: gcc -c -g -O2 -Wall  conftest.c >&5
configure:32019: $? = 0
configure:32026: test -z "$ac_c_werror_flag" || test ! -s conftest.err
configure:32029: $? = 0
configure:32036: test -s conftest.o
configure:32039: $? = 0
configure:32068: gcc -c -g -O2 -Wall  conftest.c >&5
conftest.c: In function 'main':
conftest.c:68: error: 'not' undeclared (first use in this function)
conftest.c:68: error: (Each undeclared identifier is reported only once
conftest.c:68: error: for each function it appears in.)
conftest.c:68: error: expected ';' before 'big'
configure:32074: $? = 1
configure: failed program was:
| /* confdefs.h.  */
| #define PACKAGE_NAME "glib"
| #define PACKAGE_TARNAME "glib"
| #define PACKAGE_VERSION "2.14.0"
| #define PACKAGE_STRING "glib 2.14.0"
| #define PACKAGE_BUGREPORT "http://bugzilla.gnome.org/enter_bug.cgi?product=glib"
| #define GLIB_MAJOR_VERSION 2
| #define GLIB_MINOR_VERSION 14
| #define GLIB_MICRO_VERSION 0
| #define GLIB_INTERFACE_AGE 0
| #define GLIB_BINARY_AGE 1400
| #define G_COMPILED_WITH_DEBUGGING "minimum"
| #define _FILE_OFFSET_BITS 64
| #define STDC_HEADERS 1
| #define HAVE_SYS_TYPES_H 1
| #define HAVE_SYS_STAT_H 1
| #define HAVE_STDLIB_H 1
| #define HAVE_STRING_H 1
| #define HAVE_MEMORY_H 1
| #define HAVE_STRINGS_H 1
| #define HAVE_INTTYPES_H 1
| #define HAVE_STDINT_H 1
| #define HAVE_UNISTD_H 1
| #define HAVE_LOCALE_H 1
| #define HAVE_LC_MESSAGES 1
| #define HAVE_BIND_TEXTDOMAIN_CODESET 1
| #define HAVE_GETTEXT 1
| #define HAVE_DCGETTEXT 1
| #define ENABLE_NLS 1
| #define GETTEXT_PACKAGE "glib20"
| #define GLIB_LOCALE_DIR "/usr/share/locale"
| #define HAVE_DLFCN_H 1
| #define STDC_HEADERS 1
| #define HAVE_VPRINTF 1
| #define HAVE_STDLIB_H 1
| #define HAVE_UNISTD_H 1
| #define HAVE_GETPAGESIZE 1
| #define HAVE_MMAP 1
| #define HAVE_ALLOCA_H 1
| #define HAVE_ALLOCA 1
| #define HAVE_POSIX_MEMALIGN 1
| #define HAVE_MEMALIGN 1
| #define HAVE_VALLOC 1
| #define HAVE_ATEXIT 1
| #define HAVE_ON_EXIT 1
| #define HAVE_TIMEGM 1
| #define SIZEOF_CHAR 1
| #define SIZEOF_SHORT 2
| #define SIZEOF_LONG 4
| #define SIZEOF_INT 4
| #define SIZEOF_VOID_P 4
| #define SIZEOF_LONG_LONG 8
| #define SIZEOF___INT64 0
| #define HAVE_LONG_LONG_FORMAT 1
| #define SANE_MALLOC_PROTOS 1
| #define G_HAVE___INLINE 1
| #define G_HAVE___INLINE__ 1
| #define G_HAVE_INLINE 1
| #define HAVE_DOWHILE_MACROS 1
| /* end confdefs.h.  */
| #include <sys/types.h>
| #include <sys/param.h>
| 
| int
| main ()
| {
| #if BYTE_ORDER != BIG_ENDIAN
|  not big endian
| #endif
| 
|   ;
|   return 0;
| }
configure:32248: result: no
configure:32289: checking dirent.h usability
configure:32306: gcc -c -g -O2 -Wall  conftest.c >&5
configure:32312: $? = 0
configure:32319: test -z "$ac_c_werror_flag" || test ! -s conftest.err
configure:32322: $? = 0
configure:32329: test -s conftest.o
configure:32332: $? = 0
configure:32343: result: yes
configure:32347: checking dirent.h presence
configure:32362: gcc -E  conftest.c
configure:32368: $? = 0
configure:32389: result: yes
configure:32422: checking for dirent.h
configure:32430: result: yes
configure:32289: checking float.h usability
configure:32306: gcc -c -g -O2 -Wall  conftest.c >&5
configure:32312: $? = 0
configure:32319: test -z "$ac_c_werror_flag" || test ! -s conftest.err
configure:32322: $? = 0
configure:32329: test -s conftest.o
configure:32332: $? = 0
configure:32343: result: yes
configure:32347: checking float.h presence
configure:32362: gcc -E  conftest.c
configure:32368: $? = 0
configure:32389: result: yes
configure:32422: checking for float.h
configure:32430: result: yes
configure:32289: checking limits.h usability
configure:32306: gcc -c -g -O2 -Wall  conftest.c >&5
configure:32312: $? = 0
configure:32319: test -z "$ac_c_werror_flag" || test ! -s conftest.err
configure:32322: $? = 0
configure:32329: test -s conftest.o
configure:32332: $? = 0
configure:32343: result: yes
configure:32347: checking limits.h presence
configure:32362: gcc -E  conftest.c
configure:32368: $? = 0
configure:32389: result: yes
configure:32422: checking for limits.h
configure:32430: result: yes
configure:32289: checking pwd.h usability
configure:32306: gcc -c -g -O2 -Wall  conftest.c >&5
configure:32312: $? = 0
configure:32319: test -z "$ac_c_werror_flag" || test ! -s conftest.err
configure:32322: $? = 0
configure:32329: test -s conftest.o
configure:32332: $? = 0
configure:32343: result: yes
configure:32347: checking pwd.h presence
configure:32362: gcc -E  conftest.c
configure:32368: $? = 0
configure:32389: result: yes
configure:32422: checking for pwd.h
configure:32430: result: yes
configure:32289: checking sys/param.h usability
configure:32306: gcc -c -g -O2 -Wall  conftest.c >&5
configure:32312: $? = 0
configure:32319: test -z "$ac_c_werror_flag" || test ! -s conftest.err
configure:32322: $? = 0
configure:32329: test -s conftest.o
configure:32332: $? = 0
configure:32343: result: yes
configure:32347: checking sys/param.h presence
configure:32362: gcc -E  conftest.c
configure:32368: $? = 0
configure:32389: result: yes
configure:32422: checking for sys/param.h
configure:32430: result: yes
configure:32289: checking sys/poll.h usability
configure:32306: gcc -c -g -O2 -Wall  conftest.c >&5
configure:32312: $? = 0
configure:32319: test -z "$ac_c_werror_flag" || test ! -s conftest.err
configure:32322: $? = 0
configure:32329: test -s conftest.o
configure:32332: $? = 0
configure:32343: result: yes
configure:32347: checking sys/poll.h presence
configure:32362: gcc -E  conftest.c
configure:32368: $? = 0
configure:32389: result: yes
configure:32422: checking for sys/poll.h
configure:32430: result: yes
configure:32462: checking sys/time.h usability
configure:32479: gcc -c -g -O2 -Wall  conftest.c >&5
configure:32485: $? = 0
configure:32492: test -z "$ac_c_werror_flag" || test ! -s conftest.err
configure:32495: $? = 0
configure:32502: test -s conftest.o
configure:32505: $? = 0
configure:32516: result: yes
configure:32520: checking sys/time.h presence
configure:32535: gcc -E  conftest.c
configure:32541: $? = 0
configure:32562: result: yes
configure:32595: checking for sys/time.h
configure:32603: result: yes
configure:32462: checking sys/times.h usability
configure:32479: gcc -c -g -O2 -Wall  conftest.c >&5
configure:32485: $? = 0
configure:32492: test -z "$ac_c_werror_flag" || test ! -s conftest.err
configure:32495: $? = 0
configure:32502: test -s conftest.o
configure:32505: $? = 0
configure:32516: result: yes
configure:32520: checking sys/times.h presence
configure:32535: gcc -E  conftest.c
configure:32541: $? = 0
configure:32562: result: yes
configure:32595: checking for sys/times.h
configure:32603: result: yes
configure:32462: checking sys/wait.h usability
configure:32479: gcc -c -g -O2 -Wall  conftest.c >&5
configure:32485: $? = 0
configure:32492: test -z "$ac_c_werror_flag" || test ! -s conftest.err
configure:32495: $? = 0
configure:32502: test -s conftest.o
configure:32505: $? = 0
configure:32516: result: yes
configure:32520: checking sys/wait.h presence
configure:32535: gcc -E  conftest.c
configure:32541: $? = 0
configure:32562: result: yes
configure:32595: checking for sys/wait.h
configure:32603: result: yes
configure:32452: checking for unistd.h
configure:32458: result: yes
configure:32462: checking values.h usability
configure:32479: gcc -c -g -O2 -Wall  conftest.c >&5
configure:32485: $? = 0
configure:32492: test -z "$ac_c_werror_flag" || test ! -s conftest.err
configure:32495: $? = 0
configure:32502: test -s conftest.o
configure:32505: $? = 0
configure:32516: result: yes
configure:32520: checking values.h presence
configure:32535: gcc -E  conftest.c
configure:32541: $? = 0
configure:32562: result: yes
configure:32595: checking for values.h
configure:32603: result: yes
configure:32635: checking sys/select.h usability
configure:32652: gcc -c -g -O2 -Wall  conftest.c >&5
configure:32658: $? = 0
configure:32665: test -z "$ac_c_werror_flag" || test ! -s conftest.err
configure:32668: $? = 0
configure:32675: test -s conftest.o
configure:32678: $? = 0
configure:32689: result: yes
configure:32693: checking sys/select.h presence
configure:32708: gcc -E  conftest.c
configure:32714: $? = 0
configure:32735: result: yes
configure:32768: checking for sys/select.h
configure:32776: result: yes
configure:32625: checking for sys/types.h
configure:32631: result: yes
configure:32625: checking for stdint.h
configure:32631: result: yes
configure:32635: checking sched.h usability
configure:32652: gcc -c -g -O2 -Wall  conftest.c >&5
configure:32658: $? = 0
configure:32665: test -z "$ac_c_werror_flag" || test ! -s conftest.err
configure:32668: $? = 0
configure:32675: test -s conftest.o
configure:32678: $? = 0
configure:32689: result: yes
configure:32693: checking sched.h presence
configure:32708: gcc -E  conftest.c
configure:32714: $? = 0
configure:32735: result: yes
configure:32768: checking for sched.h
configure:32776: result: yes
configure:32635: checking malloc.h usability
configure:32652: gcc -c -g -O2 -Wall  conftest.c >&5
configure:32658: $? = 0
configure:32665: test -z "$ac_c_werror_flag" || test ! -s conftest.err
configure:32668: $? = 0
configure:32675: test -s conftest.o
configure:32678: $? = 0
configure:32689: result: yes
configure:32693: checking malloc.h presence
configure:32708: gcc -E  conftest.c
configure:32714: $? = 0
configure:32735: result: yes
configure:32768: checking for malloc.h
configure:32776: result: yes
configure:32807: checking langinfo.h usability
configure:32824: gcc -c -g -O2 -Wall  conftest.c >&5
configure:32830: $? = 0
configure:32837: test -z "$ac_c_werror_flag" || test ! -s conftest.err
configure:32840: $? = 0
configure:32847: test -s conftest.o
configure:32850: $? = 0
configure:32861: result: yes
configure:32865: checking langinfo.h presence
configure:32880: gcc -E  conftest.c
configure:32886: $? = 0
configure:32907: result: yes
configure:32940: checking for langinfo.h
configure:32948: result: yes
configure:32965: checking for nl_langinfo
configure:33021: gcc -o conftest -g -O2 -Wall   conftest.c   >&5
configure:33027: $? = 0
configure:33034: test -z "$ac_c_werror_flag" || test ! -s conftest.err
configure:33037: $? = 0
configure:33044: test -s conftest
configure:33047: $? = 0
configure:33061: result: yes
configure:33072: checking for nl_langinfo and CODESET
configure:33098: gcc -o conftest -g -O2 -Wall   conftest.c   >&5
conftest.c: In function 'main':
conftest.c:83: warning: unused variable 'cs'
configure:33104: $? = 0
configure:33111: test -z "$ac_c_werror_flag" || test ! -s conftest.err
configure:33114: $? = 0
configure:33121: test -s conftest
configure:33124: $? = 0
configure:33138: result: yes
configure:33149: checking whether we are using the GNU C Library 2.1 or newer
configure:33180: result: yes
configure:33203: checking stddef.h usability
configure:33220: gcc -c -g -O2 -Wall  conftest.c >&5
configure:33226: $? = 0
configure:33233: test -z "$ac_c_werror_flag" || test ! -s conftest.err
configure:33236: $? = 0
configure:33243: test -s conftest.o
configure:33246: $? = 0
configure:33257: result: yes
configure:33261: checking stddef.h presence
configure:33276: gcc -E  conftest.c
configure:33282: $? = 0
configure:33303: result: yes
configure:33336: checking for stddef.h
configure:33344: result: yes
configure:33193: checking for stdlib.h
configure:33199: result: yes
configure:33193: checking for string.h
configure:33199: result: yes
configure:33361: checking for setlocale
configure:33417: gcc -o conftest -g -O2 -Wall   conftest.c   >&5
configure:33423: $? = 0
configure:33430: test -z "$ac_c_werror_flag" || test ! -s conftest.err
configure:33433: $? = 0
configure:33440: test -s conftest
configure:33443: $? = 0
configure:33457: result: yes
configure:33469: checking for size_t
configure:33499: gcc -c -g -O2 -Wall  conftest.c >&5
configure:33505: $? = 0
configure:33512: test -z "$ac_c_werror_flag" || test ! -s conftest.err
configure:33515: $? = 0
configure:33522: test -s conftest.o
configure:33525: $? = 0
configure:33537: result: yes
configure:33540: checking size of size_t
configure:33928: gcc -o conftest -g -O2 -Wall   conftest.c   >&5
configure:33931: $? = 0
configure:33937: ./conftest
configure:33940: $? = 0
configure:33962: result: 4
configure:33970: checking for the appropriate definition for size_t
configure:34008: gcc -c -g -O2 -Wall  conftest.c
configure:34014: $? = 0
configure:34017: (if test -s conftest.err; then false ; else true; fi)
configure:34020: $? = 0
configure:34069: result: unsigned int
configure:34093: checking for lstat
configure:34149: gcc -o conftest -g -O2 -Wall   conftest.c   >&5
configure:34155: $? = 0
configure:34162: test -z "$ac_c_werror_flag" || test ! -s conftest.err
configure:34165: $? = 0
configure:34172: test -s conftest
configure:34175: $? = 0
configure:34189: result: yes
configure:34093: checking for strerror
configure:34149: gcc -o conftest -g -O2 -Wall   conftest.c   >&5
configure:34155: $? = 0
configure:34162: test -z "$ac_c_werror_flag" || test ! -s conftest.err
configure:34165: $? = 0
configure:34172: test -s conftest
configure:34175: $? = 0
configure:34189: result: yes
configure:34093: checking for strsignal
configure:34149: gcc -o conftest -g -O2 -Wall   conftest.c   >&5
configure:34155: $? = 0
configure:34162: test -z "$ac_c_werror_flag" || test ! -s conftest.err
configure:34165: $? = 0
configure:34172: test -s conftest
configure:34175: $? = 0
configure:34189: result: yes
configure:34093: checking for memmove
configure:34149: gcc -o conftest -g -O2 -Wall   conftest.c   >&5
conftest.c:111: warning: conflicting types for built-in function 'memmove'
configure:34155: $? = 0
configure:34162: test -z "$ac_c_werror_flag" || test ! -s conftest.err
configure:34165: $? = 0
configure:34172: test -s conftest
configure:34175: $? = 0
configure:34189: result: yes
configure:34093: checking for vsnprintf
configure:34149: gcc -o conftest -g -O2 -Wall   conftest.c   >&5
conftest.c:112: warning: conflicting types for built-in function 'vsnprintf'
configure:34155: $? = 0
configure:34162: test -z "$ac_c_werror_flag" || test ! -s conftest.err
configure:34165: $? = 0
configure:34172: test -s conftest
configure:34175: $? = 0
configure:34189: result: yes
configure:34093: checking for stpcpy
configure:34149: gcc -o conftest -g -O2 -Wall   conftest.c   >&5
conftest.c:113: warning: conflicting types for built-in function 'stpcpy'
configure:34155: $? = 0
configure:34162: test -z "$ac_c_werror_flag" || test ! -s conftest.err
configure:34165: $? = 0
configure:34172: test -s conftest
configure:34175: $? = 0
configure:34189: result: yes
configure:34093: checking for strcasecmp
configure:34149: gcc -o conftest -g -O2 -Wall   conftest.c   >&5
conftest.c:114: warning: conflicting types for built-in function 'strcasecmp'
configure:34155: $? = 0
configure:34162: test -z "$ac_c_werror_flag" || test ! -s conftest.err
configure:34165: $? = 0
configure:34172: test -s conftest
configure:34175: $? = 0
configure:34189: result: yes
configure:34093: checking for strncasecmp
configure:34149: gcc -o conftest -g -O2 -Wall   conftest.c   >&5
conftest.c:115: warning: conflicting types for built-in function 'strncasecmp'
configure:34155: $? = 0
configure:34162: test -z "$ac_c_werror_flag" || test ! -s conftest.err
configure:34165: $? = 0
configure:34172: test -s conftest
configure:34175: $? = 0
configure:34189: result: yes
configure:34093: checking for poll
configure:34149: gcc -o conftest -g -O2 -Wall   conftest.c   >&5
configure:34155: $? = 0
configure:34162: test -z "$ac_c_werror_flag" || test ! -s conftest.err
configure:34165: $? = 0
configure:34172: test -s conftest
configure:34175: $? = 0
configure:34189: result: yes
configure:34093: checking for getcwd
configure:34149: gcc -o conftest -g -O2 -Wall   conftest.c   >&5
configure:34155: $? = 0
configure:34162: test -z "$ac_c_werror_flag" || test ! -s conftest.err
configure:34165: $? = 0
configure:34172: test -s conftest
configure:34175: $? = 0
configure:34189: result: yes
configure:34093: checking for vasprintf
configure:34149: gcc -o conftest -g -O2 -Wall   conftest.c   >&5
configure:34155: $? = 0
configure:34162: test -z "$ac_c_werror_flag" || test ! -s conftest.err
configure:34165: $? = 0
configure:34172: test -s conftest
configure:34175: $? = 0
configure:34189: result: yes
configure:34093: checking for setenv
configure:34149: gcc -o conftest -g -O2 -Wall   conftest.c   >&5
configure:34155: $? = 0
configure:34162: test -z "$ac_c_werror_flag" || test ! -s conftest.err
configure:34165: $? = 0
configure:34172: test -s conftest
configure:34175: $? = 0
configure:34189: result: yes
configure:34093: checking for unsetenv
configure:34149: gcc -o conftest -g -O2 -Wall   conftest.c   >&5
configure:34155: $? = 0
configure:34162: test -z "$ac_c_werror_flag" || test ! -s conftest.err
configure:34165: $? = 0
configure:34172: test -s conftest
configure:34175: $? = 0
configure:34189: result: yes
configure:34093: checking for getc_unlocked
configure:34149: gcc -o conftest -g -O2 -Wall   conftest.c   >&5
configure:34155: $? = 0
configure:34162: test -z "$ac_c_werror_flag" || test ! -s conftest.err
configure:34165: $? = 0
configure:34172: test -s conftest
configure:34175: $? = 0
configure:34189: result: yes
configure:34093: checking for readlink
configure:34149: gcc -o conftest -g -O2 -Wall   conftest.c   >&5
configure:34155: $? = 0
configure:34162: test -z "$ac_c_werror_flag" || test ! -s conftest.err
configure:34165: $? = 0
configure:34172: test -s conftest
configure:34175: $? = 0
configure:34189: result: yes
configure:34093: checking for symlink
configure:34149: gcc -o conftest -g -O2 -Wall   conftest.c   >&5
configure:34155: $? = 0
configure:34162: test -z "$ac_c_werror_flag" || test ! -s conftest.err
configure:34165: $? = 0
configure:34172: test -s conftest
configure:34175: $? = 0
configure:34189: result: yes
configure:34093: checking for fdwalk
configure:34149: gcc -o conftest -g -O2 -Wall   conftest.c   >&5
/tmp/cc0lHrcK.o: In function `main':
/home/rasmer/src/glib/2.14.0/glib-2.14.0/conftest.c:135: undefined reference to `fdwalk'
collect2: ld returned 1 exit status
configure:34155: $? = 1
configure: failed program was:
| /* confdefs.h.  */
| #define PACKAGE_NAME "glib"
| #define PACKAGE_TARNAME "glib"
| #define PACKAGE_VERSION "2.14.0"
| #define PACKAGE_STRING "glib 2.14.0"
| #define PACKAGE_BUGREPORT "http://bugzilla.gnome.org/enter_bug.cgi?product=glib"
| #define GLIB_MAJOR_VERSION 2
| #define GLIB_MINOR_VERSION 14
| #define GLIB_MICRO_VERSION 0
| #define GLIB_INTERFACE_AGE 0
| #define GLIB_BINARY_AGE 1400
| #define G_COMPILED_WITH_DEBUGGING "minimum"
| #define _FILE_OFFSET_BITS 64
| #define STDC_HEADERS 1
| #define HAVE_SYS_TYPES_H 1
| #define HAVE_SYS_STAT_H 1
| #define HAVE_STDLIB_H 1
| #define HAVE_STRING_H 1
| #define HAVE_MEMORY_H 1
| #define HAVE_STRINGS_H 1
| #define HAVE_INTTYPES_H 1
| #define HAVE_STDINT_H 1
| #define HAVE_UNISTD_H 1
| #define HAVE_LOCALE_H 1
| #define HAVE_LC_MESSAGES 1
| #define HAVE_BIND_TEXTDOMAIN_CODESET 1
| #define HAVE_GETTEXT 1
| #define HAVE_DCGETTEXT 1
| #define ENABLE_NLS 1
| #define GETTEXT_PACKAGE "glib20"
| #define GLIB_LOCALE_DIR "/usr/share/locale"
| #define HAVE_DLFCN_H 1
| #define STDC_HEADERS 1
| #define HAVE_VPRINTF 1
| #define HAVE_STDLIB_H 1
| #define HAVE_UNISTD_H 1
| #define HAVE_GETPAGESIZE 1
| #define HAVE_MMAP 1
| #define HAVE_ALLOCA_H 1
| #define HAVE_ALLOCA 1
| #define HAVE_POSIX_MEMALIGN 1
| #define HAVE_MEMALIGN 1
| #define HAVE_VALLOC 1
| #define HAVE_ATEXIT 1
| #define HAVE_ON_EXIT 1
| #define HAVE_TIMEGM 1
| #define SIZEOF_CHAR 1
| #define SIZEOF_SHORT 2
| #define SIZEOF_LONG 4
| #define SIZEOF_INT 4
| #define SIZEOF_VOID_P 4
| #define SIZEOF_LONG_LONG 8
| #define SIZEOF___INT64 0
| #define HAVE_LONG_LONG_FORMAT 1
| #define SANE_MALLOC_PROTOS 1
| #define G_HAVE___INLINE 1
| #define G_HAVE___INLINE__ 1
| #define G_HAVE_INLINE 1
| #define HAVE_DOWHILE_MACROS 1
| #define HAVE_DIRENT_H 1
| #define HAVE_FLOAT_H 1
| #define HAVE_LIMITS_H 1
| #define HAVE_PWD_H 1
| #define HAVE_SYS_PARAM_H 1
| #define HAVE_SYS_POLL_H 1
| #define HAVE_SYS_TIME_H 1
| #define HAVE_SYS_TIMES_H 1
| #define HAVE_SYS_WAIT_H 1
| #define HAVE_UNISTD_H 1
| #define HAVE_VALUES_H 1
| #define HAVE_SYS_SELECT_H 1
| #define HAVE_SYS_TYPES_H 1
| #define HAVE_STDINT_H 1
| #define HAVE_SCHED_H 1
| #define HAVE_MALLOC_H 1
| #define HAVE_LANGINFO_H 1
| #define HAVE_NL_LANGINFO 1
| #define HAVE_LANGINFO_CODESET 1
| #define HAVE_STDDEF_H 1
| #define HAVE_STDLIB_H 1
| #define HAVE_STRING_H 1
| #define HAVE_SETLOCALE 1
| #define SIZEOF_SIZE_T 4
| #define HAVE_LSTAT 1
| #define HAVE_STRERROR 1
| #define HAVE_STRSIGNAL 1
| #define HAVE_MEMMOVE 1
| #define HAVE_VSNPRINTF 1
| #define HAVE_STPCPY 1
| #define HAVE_STRCASECMP 1
| #define HAVE_STRNCASECMP 1
| #define HAVE_POLL 1
| #define HAVE_GETCWD 1
| #define HAVE_VASPRINTF 1
| #define HAVE_SETENV 1
| #define HAVE_UNSETENV 1
| #define HAVE_GETC_UNLOCKED 1
| #define HAVE_READLINK 1
| #define HAVE_SYMLINK 1
| /* end confdefs.h.  */
| /* Define fdwalk to an innocuous variant, in case <limits.h> declares fdwalk.
|    For example, HP-UX 11i <limits.h> declares gettimeofday.  */
| #define fdwalk innocuous_fdwalk
| 
| /* System header to define __stub macros and hopefully few prototypes,
|     which can conflict with char fdwalk (); below.
|     Prefer <limits.h> to <assert.h> if __STDC__ is defined, since
|     <limits.h> exists even on freestanding compilers.  */
| 
| #ifdef __STDC__
| # include <limits.h>
| #else
| # include <assert.h>
| #endif
| 
| #undef fdwalk
| 
| /* Override any GCC internal prototype to avoid an error.
|    Use char because int might match the return type of a GCC
|    builtin and then its argument prototype would still apply.  */
| #ifdef __cplusplus
| extern "C"
| #endif
| char fdwalk ();
| /* The GNU C library defines this for functions which it implements
|     to always fail with ENOSYS.  Some functions are actually named
|     something starting with __ and the normal name is an alias.  */
| #if defined __stub_fdwalk || defined __stub___fdwalk
| choke me
| #endif
| 
| int
| main ()
| {
| return fdwalk ();
|   ;
|   return 0;
| }
configure:34189: result: no
configure:34205: checking for nanosleep
configure:34261: gcc -o conftest -g -O2 -Wall   conftest.c   >&5
configure:34267: $? = 0
configure:34274: test -z "$ac_c_werror_flag" || test ! -s conftest.err
configure:34277: $? = 0
configure:34284: test -s conftest
configure:34287: $? = 0
configure:34301: result: yes
configure:34205: checking for nsleep
configure:34261: gcc -o conftest -g -O2 -Wall   conftest.c   >&5
/tmp/cce9awZw.o: In function `main':
/home/rasmer/src/glib/2.14.0/glib-2.14.0/conftest.c:136: undefined reference to `nsleep'
collect2: ld returned 1 exit status
configure:34267: $? = 1
configure: failed program was:
| /* confdefs.h.  */
| #define PACKAGE_NAME "glib"
| #define PACKAGE_TARNAME "glib"
| #define PACKAGE_VERSION "2.14.0"
| #define PACKAGE_STRING "glib 2.14.0"
| #define PACKAGE_BUGREPORT "http://bugzilla.gnome.org/enter_bug.cgi?product=glib"
| #define GLIB_MAJOR_VERSION 2
| #define GLIB_MINOR_VERSION 14
| #define GLIB_MICRO_VERSION 0
| #define GLIB_INTERFACE_AGE 0
| #define GLIB_BINARY_AGE 1400
| #define G_COMPILED_WITH_DEBUGGING "minimum"
| #define _FILE_OFFSET_BITS 64
| #define STDC_HEADERS 1
| #define HAVE_SYS_TYPES_H 1
| #define HAVE_SYS_STAT_H 1
| #define HAVE_STDLIB_H 1
| #define HAVE_STRING_H 1
| #define HAVE_MEMORY_H 1
| #define HAVE_STRINGS_H 1
| #define HAVE_INTTYPES_H 1
| #define HAVE_STDINT_H 1
| #define HAVE_UNISTD_H 1
| #define HAVE_LOCALE_H 1
| #define HAVE_LC_MESSAGES 1
| #define HAVE_BIND_TEXTDOMAIN_CODESET 1
| #define HAVE_GETTEXT 1
| #define HAVE_DCGETTEXT 1
| #define ENABLE_NLS 1
| #define GETTEXT_PACKAGE "glib20"
| #define GLIB_LOCALE_DIR "/usr/share/locale"
| #define HAVE_DLFCN_H 1
| #define STDC_HEADERS 1
| #define HAVE_VPRINTF 1
| #define HAVE_STDLIB_H 1
| #define HAVE_UNISTD_H 1
| #define HAVE_GETPAGESIZE 1
| #define HAVE_MMAP 1
| #define HAVE_ALLOCA_H 1
| #define HAVE_ALLOCA 1
| #define HAVE_POSIX_MEMALIGN 1
| #define HAVE_MEMALIGN 1
| #define HAVE_VALLOC 1
| #define HAVE_ATEXIT 1
| #define HAVE_ON_EXIT 1
| #define HAVE_TIMEGM 1
| #define SIZEOF_CHAR 1
| #define SIZEOF_SHORT 2
| #define SIZEOF_LONG 4
| #define SIZEOF_INT 4
| #define SIZEOF_VOID_P 4
| #define SIZEOF_LONG_LONG 8
| #define SIZEOF___INT64 0
| #define HAVE_LONG_LONG_FORMAT 1
| #define SANE_MALLOC_PROTOS 1
| #define G_HAVE___INLINE 1
| #define G_HAVE___INLINE__ 1
| #define G_HAVE_INLINE 1
| #define HAVE_DOWHILE_MACROS 1
| #define HAVE_DIRENT_H 1
| #define HAVE_FLOAT_H 1
| #define HAVE_LIMITS_H 1
| #define HAVE_PWD_H 1
| #define HAVE_SYS_PARAM_H 1
| #define HAVE_SYS_POLL_H 1
| #define HAVE_SYS_TIME_H 1
| #define HAVE_SYS_TIMES_H 1
| #define HAVE_SYS_WAIT_H 1
| #define HAVE_UNISTD_H 1
| #define HAVE_VALUES_H 1
| #define HAVE_SYS_SELECT_H 1
| #define HAVE_SYS_TYPES_H 1
| #define HAVE_STDINT_H 1
| #define HAVE_SCHED_H 1
| #define HAVE_MALLOC_H 1
| #define HAVE_LANGINFO_H 1
| #define HAVE_NL_LANGINFO 1
| #define HAVE_LANGINFO_CODESET 1
| #define HAVE_STDDEF_H 1
| #define HAVE_STDLIB_H 1
| #define HAVE_STRING_H 1
| #define HAVE_SETLOCALE 1
| #define SIZEOF_SIZE_T 4
| #define HAVE_LSTAT 1
| #define HAVE_STRERROR 1
| #define HAVE_STRSIGNAL 1
| #define HAVE_MEMMOVE 1
| #define HAVE_VSNPRINTF 1
| #define HAVE_STPCPY 1
| #define HAVE_STRCASECMP 1
| #define HAVE_STRNCASECMP 1
| #define HAVE_POLL 1
| #define HAVE_GETCWD 1
| #define HAVE_VASPRINTF 1
| #define HAVE_SETENV 1
| #define HAVE_UNSETENV 1
| #define HAVE_GETC_UNLOCKED 1
| #define HAVE_READLINK 1
| #define HAVE_SYMLINK 1
| #define HAVE_NANOSLEEP 1
| /* end confdefs.h.  */
| /* Define nsleep to an innocuous variant, in case <limits.h> declares nsleep.
|    For example, HP-UX 11i <limits.h> declares gettimeofday.  */
| #define nsleep innocuous_nsleep
| 
| /* System header to define __stub macros and hopefully few prototypes,
|     which can conflict with char nsleep (); below.
|     Prefer <limits.h> to <assert.h> if __STDC__ is defined, since
|     <limits.h> exists even on freestanding compilers.  */
| 
| #ifdef __STDC__
| # include <limits.h>
| #else
| # include <assert.h>
| #endif
| 
| #undef nsleep
| 
| /* Override any GCC internal prototype to avoid an error.
|    Use char because int might match the return type of a GCC
|    builtin and then its argument prototype would still apply.  */
| #ifdef __cplusplus
| extern "C"
| #endif
| char nsleep ();
| /* The GNU C library defines this for functions which it implements
|     to always fail with ENOSYS.  Some functions are actually named
|     something starting with __ and the normal name is an alias.  */
| #if defined __stub_nsleep || defined __stub___nsleep
| choke me
| #endif
| 
| int
| main ()
| {
| return nsleep ();
|   ;
|   return 0;
| }
configure:34301: result: no
configure:34327: checking crt_externs.h usability
configure:34344: gcc -c -g -O2 -Wall  conftest.c >&5
conftest.c:135:25: error: crt_externs.h: No such file or directory
configure:34350: $? = 1
configure: failed program was:
| /* confdefs.h.  */
| #define PACKAGE_NAME "glib"
| #define PACKAGE_TARNAME "glib"
| #define PACKAGE_VERSION "2.14.0"
| #define PACKAGE_STRING "glib 2.14.0"
| #define PACKAGE_BUGREPORT "http://bugzilla.gnome.org/enter_bug.cgi?product=glib"
| #define GLIB_MAJOR_VERSION 2
| #define GLIB_MINOR_VERSION 14
| #define GLIB_MICRO_VERSION 0
| #define GLIB_INTERFACE_AGE 0
| #define GLIB_BINARY_AGE 1400
| #define G_COMPILED_WITH_DEBUGGING "minimum"
| #define _FILE_OFFSET_BITS 64
| #define STDC_HEADERS 1
| #define HAVE_SYS_TYPES_H 1
| #define HAVE_SYS_STAT_H 1
| #define HAVE_STDLIB_H 1
| #define HAVE_STRING_H 1
| #define HAVE_MEMORY_H 1
| #define HAVE_STRINGS_H 1
| #define HAVE_INTTYPES_H 1
| #define HAVE_STDINT_H 1
| #define HAVE_UNISTD_H 1
| #define HAVE_LOCALE_H 1
| #define HAVE_LC_MESSAGES 1
| #define HAVE_BIND_TEXTDOMAIN_CODESET 1
| #define HAVE_GETTEXT 1
| #define HAVE_DCGETTEXT 1
| #define ENABLE_NLS 1
| #define GETTEXT_PACKAGE "glib20"
| #define GLIB_LOCALE_DIR "/usr/share/locale"
| #define HAVE_DLFCN_H 1
| #define STDC_HEADERS 1
| #define HAVE_VPRINTF 1
| #define HAVE_STDLIB_H 1
| #define HAVE_UNISTD_H 1
| #define HAVE_GETPAGESIZE 1
| #define HAVE_MMAP 1
| #define HAVE_ALLOCA_H 1
| #define HAVE_ALLOCA 1
| #define HAVE_POSIX_MEMALIGN 1
| #define HAVE_MEMALIGN 1
| #define HAVE_VALLOC 1
| #define HAVE_ATEXIT 1
| #define HAVE_ON_EXIT 1
| #define HAVE_TIMEGM 1
| #define SIZEOF_CHAR 1
| #define SIZEOF_SHORT 2
| #define SIZEOF_LONG 4
| #define SIZEOF_INT 4
| #define SIZEOF_VOID_P 4
| #define SIZEOF_LONG_LONG 8
| #define SIZEOF___INT64 0
| #define HAVE_LONG_LONG_FORMAT 1
| #define SANE_MALLOC_PROTOS 1
| #define G_HAVE___INLINE 1
| #define G_HAVE___INLINE__ 1
| #define G_HAVE_INLINE 1
| #define HAVE_DOWHILE_MACROS 1
| #define HAVE_DIRENT_H 1
| #define HAVE_FLOAT_H 1
| #define HAVE_LIMITS_H 1
| #define HAVE_PWD_H 1
| #define HAVE_SYS_PARAM_H 1
| #define HAVE_SYS_POLL_H 1
| #define HAVE_SYS_TIME_H 1
| #define HAVE_SYS_TIMES_H 1
| #define HAVE_SYS_WAIT_H 1
| #define HAVE_UNISTD_H 1
| #define HAVE_VALUES_H 1
| #define HAVE_SYS_SELECT_H 1
| #define HAVE_SYS_TYPES_H 1
| #define HAVE_STDINT_H 1
| #define HAVE_SCHED_H 1
| #define HAVE_MALLOC_H 1
| #define HAVE_LANGINFO_H 1
| #define HAVE_NL_LANGINFO 1
| #define HAVE_LANGINFO_CODESET 1
| #define HAVE_STDDEF_H 1
| #define HAVE_STDLIB_H 1
| #define HAVE_STRING_H 1
| #define HAVE_SETLOCALE 1
| #define SIZEOF_SIZE_T 4
| #define HAVE_LSTAT 1
| #define HAVE_STRERROR 1
| #define HAVE_STRSIGNAL 1
| #define HAVE_MEMMOVE 1
| #define HAVE_VSNPRINTF 1
| #define HAVE_STPCPY 1
| #define HAVE_STRCASECMP 1
| #define HAVE_STRNCASECMP 1
| #define HAVE_POLL 1
| #define HAVE_GETCWD 1
| #define HAVE_VASPRINTF 1
| #define HAVE_SETENV 1
| #define HAVE_UNSETENV 1
| #define HAVE_GETC_UNLOCKED 1
| #define HAVE_READLINK 1
| #define HAVE_SYMLINK 1
| #define HAVE_NANOSLEEP 1
| /* end confdefs.h.  */
| #include <stdio.h>
| #if HAVE_SYS_TYPES_H
| # include <sys/types.h>
| #endif
| #if HAVE_SYS_STAT_H
| # include <sys/stat.h>
| #endif
| #if STDC_HEADERS
| # include <stdlib.h>
| # include <stddef.h>
| #else
| # if HAVE_STDLIB_H
| #  include <stdlib.h>
| # endif
| #endif
| #if HAVE_STRING_H
| # if !STDC_HEADERS && HAVE_MEMORY_H
| #  include <memory.h>
| # endif
| # include <string.h>
| #endif
| #if HAVE_STRINGS_H
| # include <strings.h>
| #endif
| #if HAVE_INTTYPES_H
| # include <inttypes.h>
| #endif
| #if HAVE_STDINT_H
| # include <stdint.h>
| #endif
| #if HAVE_UNISTD_H
| # include <unistd.h>
| #endif
| #include <crt_externs.h>
configure:34381: result: no
configure:34385: checking crt_externs.h presence
configure:34400: gcc -E  conftest.c
conftest.c:102:25: error: crt_externs.h: No such file or directory
configure:34406: $? = 1
configure: failed program was:
| /* confdefs.h.  */
| #define PACKAGE_NAME "glib"
| #define PACKAGE_TARNAME "glib"
| #define PACKAGE_VERSION "2.14.0"
| #define PACKAGE_STRING "glib 2.14.0"
| #define PACKAGE_BUGREPORT "http://bugzilla.gnome.org/enter_bug.cgi?product=glib"
| #define GLIB_MAJOR_VERSION 2
| #define GLIB_MINOR_VERSION 14
| #define GLIB_MICRO_VERSION 0
| #define GLIB_INTERFACE_AGE 0
| #define GLIB_BINARY_AGE 1400
| #define G_COMPILED_WITH_DEBUGGING "minimum"
| #define _FILE_OFFSET_BITS 64
| #define STDC_HEADERS 1
| #define HAVE_SYS_TYPES_H 1
| #define HAVE_SYS_STAT_H 1
| #define HAVE_STDLIB_H 1
| #define HAVE_STRING_H 1
| #define HAVE_MEMORY_H 1
| #define HAVE_STRINGS_H 1
| #define HAVE_INTTYPES_H 1
| #define HAVE_STDINT_H 1
| #define HAVE_UNISTD_H 1
| #define HAVE_LOCALE_H 1
| #define HAVE_LC_MESSAGES 1
| #define HAVE_BIND_TEXTDOMAIN_CODESET 1
| #define HAVE_GETTEXT 1
| #define HAVE_DCGETTEXT 1
| #define ENABLE_NLS 1
| #define GETTEXT_PACKAGE "glib20"
| #define GLIB_LOCALE_DIR "/usr/share/locale"
| #define HAVE_DLFCN_H 1
| #define STDC_HEADERS 1
| #define HAVE_VPRINTF 1
| #define HAVE_STDLIB_H 1
| #define HAVE_UNISTD_H 1
| #define HAVE_GETPAGESIZE 1
| #define HAVE_MMAP 1
| #define HAVE_ALLOCA_H 1
| #define HAVE_ALLOCA 1
| #define HAVE_POSIX_MEMALIGN 1
| #define HAVE_MEMALIGN 1
| #define HAVE_VALLOC 1
| #define HAVE_ATEXIT 1
| #define HAVE_ON_EXIT 1
| #define HAVE_TIMEGM 1
| #define SIZEOF_CHAR 1
| #define SIZEOF_SHORT 2
| #define SIZEOF_LONG 4
| #define SIZEOF_INT 4
| #define SIZEOF_VOID_P 4
| #define SIZEOF_LONG_LONG 8
| #define SIZEOF___INT64 0
| #define HAVE_LONG_LONG_FORMAT 1
| #define SANE_MALLOC_PROTOS 1
| #define G_HAVE___INLINE 1
| #define G_HAVE___INLINE__ 1
| #define G_HAVE_INLINE 1
| #define HAVE_DOWHILE_MACROS 1
| #define HAVE_DIRENT_H 1
| #define HAVE_FLOAT_H 1
| #define HAVE_LIMITS_H 1
| #define HAVE_PWD_H 1
| #define HAVE_SYS_PARAM_H 1
| #define HAVE_SYS_POLL_H 1
| #define HAVE_SYS_TIME_H 1
| #define HAVE_SYS_TIMES_H 1
| #define HAVE_SYS_WAIT_H 1
| #define HAVE_UNISTD_H 1
| #define HAVE_VALUES_H 1
| #define HAVE_SYS_SELECT_H 1
| #define HAVE_SYS_TYPES_H 1
| #define HAVE_STDINT_H 1
| #define HAVE_SCHED_H 1
| #define HAVE_MALLOC_H 1
| #define HAVE_LANGINFO_H 1
| #define HAVE_NL_LANGINFO 1
| #define HAVE_LANGINFO_CODESET 1
| #define HAVE_STDDEF_H 1
| #define HAVE_STDLIB_H 1
| #define HAVE_STRING_H 1
| #define HAVE_SETLOCALE 1
| #define SIZEOF_SIZE_T 4
| #define HAVE_LSTAT 1
| #define HAVE_STRERROR 1
| #define HAVE_STRSIGNAL 1
| #define HAVE_MEMMOVE 1
| #define HAVE_VSNPRINTF 1
| #define HAVE_STPCPY 1
| #define HAVE_STRCASECMP 1
| #define HAVE_STRNCASECMP 1
| #define HAVE_POLL 1
| #define HAVE_GETCWD 1
| #define HAVE_VASPRINTF 1
| #define HAVE_SETENV 1
| #define HAVE_UNSETENV 1
| #define HAVE_GETC_UNLOCKED 1
| #define HAVE_READLINK 1
| #define HAVE_SYMLINK 1
| #define HAVE_NANOSLEEP 1
| /* end confdefs.h.  */
| #include <crt_externs.h>
configure:34427: result: no
configure:34460: checking for crt_externs.h
configure:34468: result: no
configure:34485: checking for _NSGetEnviron
configure:34541: gcc -o conftest -g -O2 -Wall   conftest.c   >&5
/tmp/cc09601g.o: In function `main':
/home/rasmer/src/glib/2.14.0/glib-2.14.0/conftest.c:136: undefined reference to `_NSGetEnviron'
collect2: ld returned 1 exit status
configure:34547: $? = 1
configure: failed program was:
| /* confdefs.h.  */
| #define PACKAGE_NAME "glib"
| #define PACKAGE_TARNAME "glib"
| #define PACKAGE_VERSION "2.14.0"
| #define PACKAGE_STRING "glib 2.14.0"
| #define PACKAGE_BUGREPORT "http://bugzilla.gnome.org/enter_bug.cgi?product=glib"
| #define GLIB_MAJOR_VERSION 2
| #define GLIB_MINOR_VERSION 14
| #define GLIB_MICRO_VERSION 0
| #define GLIB_INTERFACE_AGE 0
| #define GLIB_BINARY_AGE 1400
| #define G_COMPILED_WITH_DEBUGGING "minimum"
| #define _FILE_OFFSET_BITS 64
| #define STDC_HEADERS 1
| #define HAVE_SYS_TYPES_H 1
| #define HAVE_SYS_STAT_H 1
| #define HAVE_STDLIB_H 1
| #define HAVE_STRING_H 1
| #define HAVE_MEMORY_H 1
| #define HAVE_STRINGS_H 1
| #define HAVE_INTTYPES_H 1
| #define HAVE_STDINT_H 1
| #define HAVE_UNISTD_H 1
| #define HAVE_LOCALE_H 1
| #define HAVE_LC_MESSAGES 1
| #define HAVE_BIND_TEXTDOMAIN_CODESET 1
| #define HAVE_GETTEXT 1
| #define HAVE_DCGETTEXT 1
| #define ENABLE_NLS 1
| #define GETTEXT_PACKAGE "glib20"
| #define GLIB_LOCALE_DIR "/usr/share/locale"
| #define HAVE_DLFCN_H 1
| #define STDC_HEADERS 1
| #define HAVE_VPRINTF 1
| #define HAVE_STDLIB_H 1
| #define HAVE_UNISTD_H 1
| #define HAVE_GETPAGESIZE 1
| #define HAVE_MMAP 1
| #define HAVE_ALLOCA_H 1
| #define HAVE_ALLOCA 1
| #define HAVE_POSIX_MEMALIGN 1
| #define HAVE_MEMALIGN 1
| #define HAVE_VALLOC 1
| #define HAVE_ATEXIT 1
| #define HAVE_ON_EXIT 1
| #define HAVE_TIMEGM 1
| #define SIZEOF_CHAR 1
| #define SIZEOF_SHORT 2
| #define SIZEOF_LONG 4
| #define SIZEOF_INT 4
| #define SIZEOF_VOID_P 4
| #define SIZEOF_LONG_LONG 8
| #define SIZEOF___INT64 0
| #define HAVE_LONG_LONG_FORMAT 1
| #define SANE_MALLOC_PROTOS 1
| #define G_HAVE___INLINE 1
| #define G_HAVE___INLINE__ 1
| #define G_HAVE_INLINE 1
| #define HAVE_DOWHILE_MACROS 1
| #define HAVE_DIRENT_H 1
| #define HAVE_FLOAT_H 1
| #define HAVE_LIMITS_H 1
| #define HAVE_PWD_H 1
| #define HAVE_SYS_PARAM_H 1
| #define HAVE_SYS_POLL_H 1
| #define HAVE_SYS_TIME_H 1
| #define HAVE_SYS_TIMES_H 1
| #define HAVE_SYS_WAIT_H 1
| #define HAVE_UNISTD_H 1
| #define HAVE_VALUES_H 1
| #define HAVE_SYS_SELECT_H 1
| #define HAVE_SYS_TYPES_H 1
| #define HAVE_STDINT_H 1
| #define HAVE_SCHED_H 1
| #define HAVE_MALLOC_H 1
| #define HAVE_LANGINFO_H 1
| #define HAVE_NL_LANGINFO 1
| #define HAVE_LANGINFO_CODESET 1
| #define HAVE_STDDEF_H 1
| #define HAVE_STDLIB_H 1
| #define HAVE_STRING_H 1
| #define HAVE_SETLOCALE 1
| #define SIZEOF_SIZE_T 4
| #define HAVE_LSTAT 1
| #define HAVE_STRERROR 1
| #define HAVE_STRSIGNAL 1
| #define HAVE_MEMMOVE 1
| #define HAVE_VSNPRINTF 1
| #define HAVE_STPCPY 1
| #define HAVE_STRCASECMP 1
| #define HAVE_STRNCASECMP 1
| #define HAVE_POLL 1
| #define HAVE_GETCWD 1
| #define HAVE_VASPRINTF 1
| #define HAVE_SETENV 1
| #define HAVE_UNSETENV 1
| #define HAVE_GETC_UNLOCKED 1
| #define HAVE_READLINK 1
| #define HAVE_SYMLINK 1
| #define HAVE_NANOSLEEP 1
| /* end confdefs.h.  */
| /* Define _NSGetEnviron to an innocuous variant, in case <limits.h> declares _NSGetEnviron.
|    For example, HP-UX 11i <limits.h> declares gettimeofday.  */
| #define _NSGetEnviron innocuous__NSGetEnviron
| 
| /* System header to define __stub macros and hopefully few prototypes,
|     which can conflict with char _NSGetEnviron (); below.
|     Prefer <limits.h> to <assert.h> if __STDC__ is defined, since
|     <limits.h> exists even on freestanding compilers.  */
| 
| #ifdef __STDC__
| # include <limits.h>
| #else
| # include <assert.h>
| #endif
| 
| #undef _NSGetEnviron
| 
| /* Override any GCC internal prototype to avoid an error.
|    Use char because int might match the return type of a GCC
|    builtin and then its argument prototype would still apply.  */
| #ifdef __cplusplus
| extern "C"
| #endif
| char _NSGetEnviron ();
| /* The GNU C library defines this for functions which it implements
|     to always fail with ENOSYS.  Some functions are actually named
|     something starting with __ and the normal name is an alias.  */
| #if defined __stub__NSGetEnviron || defined __stub____NSGetEnviron
| choke me
| #endif
| 
| int
| main ()
| {
| return _NSGetEnviron ();
|   ;
|   return 0;
| }
configure:34581: result: no
configure:34592: checking for C99 vsnprintf
configure:34649: gcc -o conftest -g -O2 -Wall   conftest.c   >&5
conftest.c: In function 'doit':
conftest.c:117: warning: implicit declaration of function 'exit'
conftest.c:117: warning: incompatible implicit declaration of built-in function 'exit'
conftest.c: In function 'main':
conftest.c:136: warning: incompatible implicit declaration of built-in function 'exit'
configure:34652: $? = 0
configure:34658: ./conftest
configure:34661: $? = 0
configure:34677: result: yes
configure:34687: checking whether printf supports positional parameters
configure:34720: gcc -o conftest -g -O2 -Wall   conftest.c   >&5
conftest.c: In function 'main':
conftest.c:111: warning: implicit declaration of function 'strcmp'
conftest.c:112: warning: implicit declaration of function 'exit'
conftest.c:112: warning: incompatible implicit declaration of built-in function 'exit'
configure:34723: $? = 0
configure:34729: ./conftest
configure:34732: $? = 0
configure:34748: result: yes
configure:34825: checking for signed
configure:34851: gcc -c -g -O2 -Wall  conftest.c >&5
conftest.c: In function 'main':
conftest.c:109: warning: unused variable 'x'
configure:34857: $? = 0
configure:34864: test -z "$ac_c_werror_flag" || test ! -s conftest.err
configure:34867: $? = 0
configure:34874: test -s conftest.o
configure:34877: $? = 0
configure:34889: result: yes
configure:34900: checking for long long
configure:34966: result: yes
configure:34977: checking for long double
configure:35050: result: yes
configure:35061: checking for wchar_t
configure:35088: gcc -c -g -O2 -Wall  conftest.c >&5
configure:35094: $? = 0
configure:35101: test -z "$ac_c_werror_flag" || test ! -s conftest.err
configure:35104: $? = 0
configure:35111: test -s conftest.o
configure:35114: $? = 0
configure:35126: result: yes
configure:35137: checking for wint_t
configure:35164: gcc -c -g -O2 -Wall  conftest.c >&5
configure:35170: $? = 0
configure:35177: test -z "$ac_c_werror_flag" || test ! -s conftest.err
configure:35180: $? = 0
configure:35187: test -s conftest.o
configure:35190: $? = 0
configure:35202: result: yes
configure:35212: checking for size_t
configure:35280: result: yes
configure:35292: checking for ptrdiff_t
configure:35322: gcc -c -g -O2 -Wall  conftest.c >&5
configure:35328: $? = 0
configure:35335: test -z "$ac_c_werror_flag" || test ! -s conftest.err
configure:35338: $? = 0
configure:35345: test -s conftest.o
configure:35348: $? = 0
configure:35360: result: yes
configure:35372: checking for inttypes.h
configure:35399: gcc -c -g -O2 -Wall  conftest.c >&5
conftest.c: In function 'main':
conftest.c:115: warning: unused variable 'i'
configure:35405: $? = 0
configure:35412: test -z "$ac_c_werror_flag" || test ! -s conftest.err
configure:35415: $? = 0
configure:35422: test -s conftest.o
configure:35425: $? = 0
configure:35437: result: yes
configure:35448: checking for stdint.h
configure:35475: gcc -c -g -O2 -Wall  conftest.c >&5
conftest.c: In function 'main':
conftest.c:116: warning: unused variable 'i'
configure:35481: $? = 0
configure:35488: test -z "$ac_c_werror_flag" || test ! -s conftest.err
configure:35491: $? = 0
configure:35498: test -s conftest.o
configure:35501: $? = 0
configure:35513: result: yes
configure:35549: checking for snprintf
configure:35605: gcc -o conftest -g -O2 -Wall   conftest.c   >&5
conftest.c:136: warning: conflicting types for built-in function 'snprintf'
configure:35611: $? = 0
configure:35618: test -z "$ac_c_werror_flag" || test ! -s conftest.err
configure:35621: $? = 0
configure:35628: test -s conftest
configure:35631: $? = 0
configure:35645: result: yes
configure:35549: checking for wcslen
configure:35605: gcc -o conftest -g -O2 -Wall   conftest.c   >&5
configure:35611: $? = 0
configure:35618: test -z "$ac_c_werror_flag" || test ! -s conftest.err
configure:35621: $? = 0
configure:35628: test -s conftest
configure:35631: $? = 0
configure:35645: result: yes
configure:35655: checking for C99 snprintf
configure:35710: gcc -o conftest -g -O2 -Wall   conftest.c   >&5
conftest.c: In function 'doit':
conftest.c:128: warning: implicit declaration of function 'exit'
conftest.c:128: warning: incompatible implicit declaration of built-in function 'exit'
conftest.c:122: warning: unused variable 'args'
conftest.c: In function 'main':
conftest.c:147: warning: incompatible implicit declaration of built-in function 'exit'
configure:35713: $? = 0
configure:35719: ./conftest
configure:35722: $? = 0
configure:35738: result: yes
configure:35840: checking for sys_errlist
configure:35867: gcc -o conftest -g -O2 -Wall   conftest.c   >&5
/tmp/ccKF7NIt.o: In function `main':
/home/rasmer/src/glib/2.14.0/glib-2.14.0/conftest.c:123: warning: `sys_errlist' is deprecated; use `strerror' or `strerror_r' instead
/home/rasmer/src/glib/2.14.0/glib-2.14.0/conftest.c:123: warning: `sys_nerr' is deprecated; use `strerror' or `strerror_r' instead
configure:35873: $? = 0
configure:35880: test -z "$ac_c_werror_flag" || test ! -s conftest.err
configure:35883: $? = 0
configure:35890: test -s conftest
configure:35893: $? = 0
configure:35905: result: yes
configure:35916: checking for sys_siglist
configure:35942: gcc -o conftest -g -O2 -Wall   conftest.c   >&5
conftest.c: In function 'main':
conftest.c:122: warning: implicit declaration of function 'exit'
conftest.c:122: warning: incompatible implicit declaration of built-in function 'exit'
conftest.c:122: warning: passing argument 1 of 'exit' makes integer from pointer without a cast
configure:35948: $? = 0
configure:35955: test -z "$ac_c_werror_flag" || test ! -s conftest.err
configure:35958: $? = 0
configure:35965: test -s conftest
configure:35968: $? = 0
configure:35980: result: yes
configure:35991: checking for sys_siglist declaration
configure:36016: gcc -c -g -O2 -Wall  conftest.c >&5
conftest.c: In function 'main':
conftest.c:121: warning: implicit declaration of function 'strlen'
conftest.c:121: warning: incompatible implicit declaration of built-in function 'strlen'
conftest.c:121: warning: statement with no effect
configure:36022: $? = 0
configure:36029: test -z "$ac_c_werror_flag" || test ! -s conftest.err
configure:36032: $? = 0
configure:36039: test -s conftest.o
configure:36042: $? = 0
configure:36053: result: yes
configure:36064: checking for fd_set
configure:36087: gcc -c -g -O2 -Wall  conftest.c >&5
conftest.c: In function 'main':
conftest.c:120: warning: unused variable 'writeMask'
conftest.c:120: warning: unused variable 'readMask'
configure:36093: $? = 0
configure:36100: test -z "$ac_c_werror_flag" || test ! -s conftest.err
configure:36103: $? = 0
configure:36110: test -s conftest.o
configure:36113: $? = 0
configure:36125: result: yes, found in sys/types.h
configure:36163: checking whether realloc (NULL,) will work
configure:36189: gcc -o conftest -g -O2 -Wall   conftest.c   >&5
configure:36192: $? = 0
configure:36198: ./conftest
configure:36201: $? = 0
configure:36218: result: yes
configure:36228: checking for nl_langinfo (CODESET)
configure:36255: gcc -c -g -O2 -Wall  conftest.c >&5
conftest.c: In function 'main':
conftest.c:121: warning: unused variable 'codeset'
configure:36261: $? = 0
configure:36268: test -z "$ac_c_werror_flag" || test ! -s conftest.err
configure:36271: $? = 0
configure:36278: test -s conftest.o
configure:36281: $? = 0
configure:36293: result: yes
configure:36303: checking for a compliant posix_memalign() implementation
configure:36351: gcc -o conftest -g -O2 -Wall   conftest.c   >&5
configure:36354: $? = 0
configure:36360: ./conftest
configure:36363: $? = 0
configure:36382: result: yes
configure:36396: checking for OpenBSD strlcpy/strlcat
configure:36427: gcc -o conftest -g -O2 -Wall   conftest.c   >&5
conftest.c: In function 'main':
conftest.c:123: warning: implicit declaration of function 'strlcpy'
conftest.c:124: warning: implicit declaration of function 'strlcat'
/tmp/ccCXGl4h.o: In function `main':
/home/rasmer/src/glib/2.14.0/glib-2.14.0/conftest.c:123: undefined reference to `strlcpy'
/home/rasmer/src/glib/2.14.0/glib-2.14.0/conftest.c:124: undefined reference to `strlcat'
collect2: ld returned 1 exit status
configure:36430: $? = 1
configure: program exited with status 1
configure: failed program was:
| /* confdefs.h.  */
| #define PACKAGE_NAME "glib"
| #define PACKAGE_TARNAME "glib"
| #define PACKAGE_VERSION "2.14.0"
| #define PACKAGE_STRING "glib 2.14.0"
| #define PACKAGE_BUGREPORT "http://bugzilla.gnome.org/enter_bug.cgi?product=glib"
| #define GLIB_MAJOR_VERSION 2
| #define GLIB_MINOR_VERSION 14
| #define GLIB_MICRO_VERSION 0
| #define GLIB_INTERFACE_AGE 0
| #define GLIB_BINARY_AGE 1400
| #define G_COMPILED_WITH_DEBUGGING "minimum"
| #define _FILE_OFFSET_BITS 64
| #define STDC_HEADERS 1
| #define HAVE_SYS_TYPES_H 1
| #define HAVE_SYS_STAT_H 1
| #define HAVE_STDLIB_H 1
| #define HAVE_STRING_H 1
| #define HAVE_MEMORY_H 1
| #define HAVE_STRINGS_H 1
| #define HAVE_INTTYPES_H 1
| #define HAVE_STDINT_H 1
| #define HAVE_UNISTD_H 1
| #define HAVE_LOCALE_H 1
| #define HAVE_LC_MESSAGES 1
| #define HAVE_BIND_TEXTDOMAIN_CODESET 1
| #define HAVE_GETTEXT 1
| #define HAVE_DCGETTEXT 1
| #define ENABLE_NLS 1
| #define GETTEXT_PACKAGE "glib20"
| #define GLIB_LOCALE_DIR "/usr/share/locale"
| #define HAVE_DLFCN_H 1
| #define STDC_HEADERS 1
| #define HAVE_VPRINTF 1
| #define HAVE_STDLIB_H 1
| #define HAVE_UNISTD_H 1
| #define HAVE_GETPAGESIZE 1
| #define HAVE_MMAP 1
| #define HAVE_ALLOCA_H 1
| #define HAVE_ALLOCA 1
| #define HAVE_POSIX_MEMALIGN 1
| #define HAVE_MEMALIGN 1
| #define HAVE_VALLOC 1
| #define HAVE_ATEXIT 1
| #define HAVE_ON_EXIT 1
| #define HAVE_TIMEGM 1
| #define SIZEOF_CHAR 1
| #define SIZEOF_SHORT 2
| #define SIZEOF_LONG 4
| #define SIZEOF_INT 4
| #define SIZEOF_VOID_P 4
| #define SIZEOF_LONG_LONG 8
| #define SIZEOF___INT64 0
| #define HAVE_LONG_LONG_FORMAT 1
| #define SANE_MALLOC_PROTOS 1
| #define G_HAVE___INLINE 1
| #define G_HAVE___INLINE__ 1
| #define G_HAVE_INLINE 1
| #define HAVE_DOWHILE_MACROS 1
| #define HAVE_DIRENT_H 1
| #define HAVE_FLOAT_H 1
| #define HAVE_LIMITS_H 1
| #define HAVE_PWD_H 1
| #define HAVE_SYS_PARAM_H 1
| #define HAVE_SYS_POLL_H 1
| #define HAVE_SYS_TIME_H 1
| #define HAVE_SYS_TIMES_H 1
| #define HAVE_SYS_WAIT_H 1
| #define HAVE_UNISTD_H 1
| #define HAVE_VALUES_H 1
| #define HAVE_SYS_SELECT_H 1
| #define HAVE_SYS_TYPES_H 1
| #define HAVE_STDINT_H 1
| #define HAVE_SCHED_H 1
| #define HAVE_MALLOC_H 1
| #define HAVE_LANGINFO_H 1
| #define HAVE_NL_LANGINFO 1
| #define HAVE_LANGINFO_CODESET 1
| #define HAVE_STDDEF_H 1
| #define HAVE_STDLIB_H 1
| #define HAVE_STRING_H 1
| #define HAVE_SETLOCALE 1
| #define SIZEOF_SIZE_T 4
| #define HAVE_LSTAT 1
| #define HAVE_STRERROR 1
| #define HAVE_STRSIGNAL 1
| #define HAVE_MEMMOVE 1
| #define HAVE_VSNPRINTF 1
| #define HAVE_STPCPY 1
| #define HAVE_STRCASECMP 1
| #define HAVE_STRNCASECMP 1
| #define HAVE_POLL 1
| #define HAVE_GETCWD 1
| #define HAVE_VASPRINTF 1
| #define HAVE_SETENV 1
| #define HAVE_UNSETENV 1
| #define HAVE_GETC_UNLOCKED 1
| #define HAVE_READLINK 1
| #define HAVE_SYMLINK 1
| #define HAVE_NANOSLEEP 1
| #define HAVE_C99_VSNPRINTF 1
| #define HAVE_UNIX98_PRINTF 1
| #define HAVE_GOOD_PRINTF 1
| #define HAVE_LONG_LONG 1
| #define HAVE_LONG_DOUBLE 1
| #define HAVE_WCHAR_T 1
| #define HAVE_WINT_T 1
| #define HAVE_PTRDIFF_T 1
| #define HAVE_INTTYPES_H_WITH_UINTMAX 1
| #define HAVE_STDINT_H_WITH_UINTMAX 1
| #define HAVE_INTMAX_T 1
| #define HAVE_SNPRINTF 1
| #define HAVE_WCSLEN 1
| #define HAVE_C99_SNPRINTF 1
| #define REALLOC_0_WORKS 1
| #define HAVE_CODESET 1
| #define POSIX_MEMALIGN_WITH_COMPLIANT_ALLOCS 1
| /* end confdefs.h.  */
| #include <stdlib.h>
| #include <string.h>
| int main() {
|   char p[10];
|   (void) strlcpy (p, "hi", 10);
|   if (strlcat (p, "bye", 0) != 3)
|     return 1;
|   return 0;
| }
configure:36455: result: no
configure:36466: checking for an implementation of va_copy()
configure:36494: gcc -o conftest -g -O2 -Wall   conftest.c   >&5
configure:36500: $? = 0
configure:36507: test -z "$ac_c_werror_flag" || test ! -s conftest.err
configure:36510: $? = 0
configure:36517: test -s conftest
configure:36520: $? = 0
configure:36534: result: yes
configure:36536: checking for an implementation of __va_copy()
configure:36564: gcc -o conftest -g -O2 -Wall   conftest.c   >&5
configure:36570: $? = 0
configure:36577: test -z "$ac_c_werror_flag" || test ! -s conftest.err
configure:36580: $? = 0
configure:36587: test -s conftest
configure:36590: $? = 0
configure:36604: result: yes
configure:36622: checking whether va_lists can be copied by value
configure:36658: gcc -o conftest -g -O2 -Wall   conftest.c   >&5
configure:36661: $? = 0
configure:36667: ./conftest
configure:36670: $? = 0
configure:36687: result: yes
configure:36721: checking for dlopen
configure:36777: gcc -o conftest -g -O2 -Wall   conftest.c   >&5
/tmp/ccSFFHZx.o: In function `main':
/home/rasmer/src/glib/2.14.0/glib-2.14.0/conftest.c:154: undefined reference to `dlopen'
collect2: ld returned 1 exit status
configure:36783: $? = 1
configure: failed program was:
| /* confdefs.h.  */
| #define PACKAGE_NAME "glib"
| #define PACKAGE_TARNAME "glib"
| #define PACKAGE_VERSION "2.14.0"
| #define PACKAGE_STRING "glib 2.14.0"
| #define PACKAGE_BUGREPORT "http://bugzilla.gnome.org/enter_bug.cgi?product=glib"
| #define GLIB_MAJOR_VERSION 2
| #define GLIB_MINOR_VERSION 14
| #define GLIB_MICRO_VERSION 0
| #define GLIB_INTERFACE_AGE 0
| #define GLIB_BINARY_AGE 1400
| #define G_COMPILED_WITH_DEBUGGING "minimum"
| #define _FILE_OFFSET_BITS 64
| #define STDC_HEADERS 1
| #define HAVE_SYS_TYPES_H 1
| #define HAVE_SYS_STAT_H 1
| #define HAVE_STDLIB_H 1
| #define HAVE_STRING_H 1
| #define HAVE_MEMORY_H 1
| #define HAVE_STRINGS_H 1
| #define HAVE_INTTYPES_H 1
| #define HAVE_STDINT_H 1
| #define HAVE_UNISTD_H 1
| #define HAVE_LOCALE_H 1
| #define HAVE_LC_MESSAGES 1
| #define HAVE_BIND_TEXTDOMAIN_CODESET 1
| #define HAVE_GETTEXT 1
| #define HAVE_DCGETTEXT 1
| #define ENABLE_NLS 1
| #define GETTEXT_PACKAGE "glib20"
| #define GLIB_LOCALE_DIR "/usr/share/locale"
| #define HAVE_DLFCN_H 1
| #define STDC_HEADERS 1
| #define HAVE_VPRINTF 1
| #define HAVE_STDLIB_H 1
| #define HAVE_UNISTD_H 1
| #define HAVE_GETPAGESIZE 1
| #define HAVE_MMAP 1
| #define HAVE_ALLOCA_H 1
| #define HAVE_ALLOCA 1
| #define HAVE_POSIX_MEMALIGN 1
| #define HAVE_MEMALIGN 1
| #define HAVE_VALLOC 1
| #define HAVE_ATEXIT 1
| #define HAVE_ON_EXIT 1
| #define HAVE_TIMEGM 1
| #define SIZEOF_CHAR 1
| #define SIZEOF_SHORT 2
| #define SIZEOF_LONG 4
| #define SIZEOF_INT 4
| #define SIZEOF_VOID_P 4
| #define SIZEOF_LONG_LONG 8
| #define SIZEOF___INT64 0
| #define HAVE_LONG_LONG_FORMAT 1
| #define SANE_MALLOC_PROTOS 1
| #define G_HAVE___INLINE 1
| #define G_HAVE___INLINE__ 1
| #define G_HAVE_INLINE 1
| #define HAVE_DOWHILE_MACROS 1
| #define HAVE_DIRENT_H 1
| #define HAVE_FLOAT_H 1
| #define HAVE_LIMITS_H 1
| #define HAVE_PWD_H 1
| #define HAVE_SYS_PARAM_H 1
| #define HAVE_SYS_POLL_H 1
| #define HAVE_SYS_TIME_H 1
| #define HAVE_SYS_TIMES_H 1
| #define HAVE_SYS_WAIT_H 1
| #define HAVE_UNISTD_H 1
| #define HAVE_VALUES_H 1
| #define HAVE_SYS_SELECT_H 1
| #define HAVE_SYS_TYPES_H 1
| #define HAVE_STDINT_H 1
| #define HAVE_SCHED_H 1
| #define HAVE_MALLOC_H 1
| #define HAVE_LANGINFO_H 1
| #define HAVE_NL_LANGINFO 1
| #define HAVE_LANGINFO_CODESET 1
| #define HAVE_STDDEF_H 1
| #define HAVE_STDLIB_H 1
| #define HAVE_STRING_H 1
| #define HAVE_SETLOCALE 1
| #define SIZEOF_SIZE_T 4
| #define HAVE_LSTAT 1
| #define HAVE_STRERROR 1
| #define HAVE_STRSIGNAL 1
| #define HAVE_MEMMOVE 1
| #define HAVE_VSNPRINTF 1
| #define HAVE_STPCPY 1
| #define HAVE_STRCASECMP 1
| #define HAVE_STRNCASECMP 1
| #define HAVE_POLL 1
| #define HAVE_GETCWD 1
| #define HAVE_VASPRINTF 1
| #define HAVE_SETENV 1
| #define HAVE_UNSETENV 1
| #define HAVE_GETC_UNLOCKED 1
| #define HAVE_READLINK 1
| #define HAVE_SYMLINK 1
| #define HAVE_NANOSLEEP 1
| #define HAVE_C99_VSNPRINTF 1
| #define HAVE_UNIX98_PRINTF 1
| #define HAVE_GOOD_PRINTF 1
| #define HAVE_LONG_LONG 1
| #define HAVE_LONG_DOUBLE 1
| #define HAVE_WCHAR_T 1
| #define HAVE_WINT_T 1
| #define HAVE_PTRDIFF_T 1
| #define HAVE_INTTYPES_H_WITH_UINTMAX 1
| #define HAVE_STDINT_H_WITH_UINTMAX 1
| #define HAVE_INTMAX_T 1
| #define HAVE_SNPRINTF 1
| #define HAVE_WCSLEN 1
| #define HAVE_C99_SNPRINTF 1
| #define REALLOC_0_WORKS 1
| #define HAVE_CODESET 1
| #define POSIX_MEMALIGN_WITH_COMPLIANT_ALLOCS 1
| #define G_VA_COPY va_copy
| /* end confdefs.h.  */
| /* Define dlopen to an innocuous variant, in case <limits.h> declares dlopen.
|    For example, HP-UX 11i <limits.h> declares gettimeofday.  */
| #define dlopen innocuous_dlopen
| 
| /* System header to define __stub macros and hopefully few prototypes,
|     which can conflict with char dlopen (); below.
|     Prefer <limits.h> to <assert.h> if __STDC__ is defined, since
|     <limits.h> exists even on freestanding compilers.  */
| 
| #ifdef __STDC__
| # include <limits.h>
| #else
| # include <assert.h>
| #endif
| 
| #undef dlopen
| 
| /* Override any GCC internal prototype to avoid an error.
|    Use char because int might match the return type of a GCC
|    builtin and then its argument prototype would still apply.  */
| #ifdef __cplusplus
| extern "C"
| #endif
| char dlopen ();
| /* The GNU C library defines this for functions which it implements
|     to always fail with ENOSYS.  Some functions are actually named
|     something starting with __ and the normal name is an alias.  */
| #if defined __stub_dlopen || defined __stub___dlopen
| choke me
| #endif
| 
| int
| main ()
| {
| return dlopen ();
|   ;
|   return 0;
| }
configure:36816: result: no
configure:37010: checking for NSLinkModule
configure:37066: gcc -o conftest -g -O2 -Wall   conftest.c   >&5
/tmp/ccCKSFTO.o: In function `main':
/home/rasmer/src/glib/2.14.0/glib-2.14.0/conftest.c:154: undefined reference to `NSLinkModule'
collect2: ld returned 1 exit status
configure:37072: $? = 1
configure: failed program was:
| /* confdefs.h.  */
| #define PACKAGE_NAME "glib"
| #define PACKAGE_TARNAME "glib"
| #define PACKAGE_VERSION "2.14.0"
| #define PACKAGE_STRING "glib 2.14.0"
| #define PACKAGE_BUGREPORT "http://bugzilla.gnome.org/enter_bug.cgi?product=glib"
| #define GLIB_MAJOR_VERSION 2
| #define GLIB_MINOR_VERSION 14
| #define GLIB_MICRO_VERSION 0
| #define GLIB_INTERFACE_AGE 0
| #define GLIB_BINARY_AGE 1400
| #define G_COMPILED_WITH_DEBUGGING "minimum"
| #define _FILE_OFFSET_BITS 64
| #define STDC_HEADERS 1
| #define HAVE_SYS_TYPES_H 1
| #define HAVE_SYS_STAT_H 1
| #define HAVE_STDLIB_H 1
| #define HAVE_STRING_H 1
| #define HAVE_MEMORY_H 1
| #define HAVE_STRINGS_H 1
| #define HAVE_INTTYPES_H 1
| #define HAVE_STDINT_H 1
| #define HAVE_UNISTD_H 1
| #define HAVE_LOCALE_H 1
| #define HAVE_LC_MESSAGES 1
| #define HAVE_BIND_TEXTDOMAIN_CODESET 1
| #define HAVE_GETTEXT 1
| #define HAVE_DCGETTEXT 1
| #define ENABLE_NLS 1
| #define GETTEXT_PACKAGE "glib20"
| #define GLIB_LOCALE_DIR "/usr/share/locale"
| #define HAVE_DLFCN_H 1
| #define STDC_HEADERS 1
| #define HAVE_VPRINTF 1
| #define HAVE_STDLIB_H 1
| #define HAVE_UNISTD_H 1
| #define HAVE_GETPAGESIZE 1
| #define HAVE_MMAP 1
| #define HAVE_ALLOCA_H 1
| #define HAVE_ALLOCA 1
| #define HAVE_POSIX_MEMALIGN 1
| #define HAVE_MEMALIGN 1
| #define HAVE_VALLOC 1
| #define HAVE_ATEXIT 1
| #define HAVE_ON_EXIT 1
| #define HAVE_TIMEGM 1
| #define SIZEOF_CHAR 1
| #define SIZEOF_SHORT 2
| #define SIZEOF_LONG 4
| #define SIZEOF_INT 4
| #define SIZEOF_VOID_P 4
| #define SIZEOF_LONG_LONG 8
| #define SIZEOF___INT64 0
| #define HAVE_LONG_LONG_FORMAT 1
| #define SANE_MALLOC_PROTOS 1
| #define G_HAVE___INLINE 1
| #define G_HAVE___INLINE__ 1
| #define G_HAVE_INLINE 1
| #define HAVE_DOWHILE_MACROS 1
| #define HAVE_DIRENT_H 1
| #define HAVE_FLOAT_H 1
| #define HAVE_LIMITS_H 1
| #define HAVE_PWD_H 1
| #define HAVE_SYS_PARAM_H 1
| #define HAVE_SYS_POLL_H 1
| #define HAVE_SYS_TIME_H 1
| #define HAVE_SYS_TIMES_H 1
| #define HAVE_SYS_WAIT_H 1
| #define HAVE_UNISTD_H 1
| #define HAVE_VALUES_H 1
| #define HAVE_SYS_SELECT_H 1
| #define HAVE_SYS_TYPES_H 1
| #define HAVE_STDINT_H 1
| #define HAVE_SCHED_H 1
| #define HAVE_MALLOC_H 1
| #define HAVE_LANGINFO_H 1
| #define HAVE_NL_LANGINFO 1
| #define HAVE_LANGINFO_CODESET 1
| #define HAVE_STDDEF_H 1
| #define HAVE_STDLIB_H 1
| #define HAVE_STRING_H 1
| #define HAVE_SETLOCALE 1
| #define SIZEOF_SIZE_T 4
| #define HAVE_LSTAT 1
| #define HAVE_STRERROR 1
| #define HAVE_STRSIGNAL 1
| #define HAVE_MEMMOVE 1
| #define HAVE_VSNPRINTF 1
| #define HAVE_STPCPY 1
| #define HAVE_STRCASECMP 1
| #define HAVE_STRNCASECMP 1
| #define HAVE_POLL 1
| #define HAVE_GETCWD 1
| #define HAVE_VASPRINTF 1
| #define HAVE_SETENV 1
| #define HAVE_UNSETENV 1
| #define HAVE_GETC_UNLOCKED 1
| #define HAVE_READLINK 1
| #define HAVE_SYMLINK 1
| #define HAVE_NANOSLEEP 1
| #define HAVE_C99_VSNPRINTF 1
| #define HAVE_UNIX98_PRINTF 1
| #define HAVE_GOOD_PRINTF 1
| #define HAVE_LONG_LONG 1
| #define HAVE_LONG_DOUBLE 1
| #define HAVE_WCHAR_T 1
| #define HAVE_WINT_T 1
| #define HAVE_PTRDIFF_T 1
| #define HAVE_INTTYPES_H_WITH_UINTMAX 1
| #define HAVE_STDINT_H_WITH_UINTMAX 1
| #define HAVE_INTMAX_T 1
| #define HAVE_SNPRINTF 1
| #define HAVE_WCSLEN 1
| #define HAVE_C99_SNPRINTF 1
| #define REALLOC_0_WORKS 1
| #define HAVE_CODESET 1
| #define POSIX_MEMALIGN_WITH_COMPLIANT_ALLOCS 1
| #define G_VA_COPY va_copy
| /* end confdefs.h.  */
| /* Define NSLinkModule to an innocuous variant, in case <limits.h> declares NSLinkModule.
|    For example, HP-UX 11i <limits.h> declares gettimeofday.  */
| #define NSLinkModule innocuous_NSLinkModule
| 
| /* System header to define __stub macros and hopefully few prototypes,
|     which can conflict with char NSLinkModule (); below.
|     Prefer <limits.h> to <assert.h> if __STDC__ is defined, since
|     <limits.h> exists even on freestanding compilers.  */
| 
| #ifdef __STDC__
| # include <limits.h>
| #else
| # include <assert.h>
| #endif
| 
| #undef NSLinkModule
| 
| /* Override any GCC internal prototype to avoid an error.
|    Use char because int might match the return type of a GCC
|    builtin and then its argument prototype would still apply.  */
| #ifdef __cplusplus
| extern "C"
| #endif
| char NSLinkModule ();
| /* The GNU C library defines this for functions which it implements
|     to always fail with ENOSYS.  Some functions are actually named
|     something starting with __ and the normal name is an alias.  */
| #if defined __stub_NSLinkModule || defined __stub___NSLinkModule
| choke me
| #endif
| 
| int
| main ()
| {
| return NSLinkModule ();
|   ;
|   return 0;
| }
configure:37105: result: no
configure:37114: checking for dlopen in -ldl
configure:37149: gcc -o conftest -g -O2 -Wall   conftest.c -ldl    >&5
configure:37155: $? = 0
configure:37162: test -z "$ac_c_werror_flag" || test ! -s conftest.err
configure:37165: $? = 0
configure:37172: test -s conftest
configure:37175: $? = 0
configure:37189: result: yes
configure:37192: checking for dlsym in -ldl
configure:37227: gcc -o conftest -g -O2 -Wall   conftest.c -ldl    >&5
configure:37233: $? = 0
configure:37240: test -z "$ac_c_werror_flag" || test ! -s conftest.err
configure:37243: $? = 0
configure:37250: test -s conftest
configure:37253: $? = 0
configure:37267: result: yes
configure:37369: checking for RTLD_GLOBAL brokenness
configure:37408: gcc -o conftest -g -O2 -Wall   -Wl,--export-dynamic conftest.c -ldl   >&5
configure:37411: $? = 0
configure:37417: ./conftest
configure:37420: $? = 0
configure:37439: result: no
configure:37446: checking for preceeding underscore in symbols
configure:37482: gcc -o conftest -g -O2 -Wall   -Wl,--export-dynamic conftest.c -ldl   >&5
configure:37485: $? = 0
configure:37491: ./conftest
configure:37494: $? = 1
configure: program exited with status 1
configure: failed program was:
| /* confdefs.h.  */
| #define PACKAGE_NAME "glib"
| #define PACKAGE_TARNAME "glib"
| #define PACKAGE_VERSION "2.14.0"
| #define PACKAGE_STRING "glib 2.14.0"
| #define PACKAGE_BUGREPORT "http://bugzilla.gnome.org/enter_bug.cgi?product=glib"
| #define GLIB_MAJOR_VERSION 2
| #define GLIB_MINOR_VERSION 14
| #define GLIB_MICRO_VERSION 0
| #define GLIB_INTERFACE_AGE 0
| #define GLIB_BINARY_AGE 1400
| #define G_COMPILED_WITH_DEBUGGING "minimum"
| #define _FILE_OFFSET_BITS 64
| #define STDC_HEADERS 1
| #define HAVE_SYS_TYPES_H 1
| #define HAVE_SYS_STAT_H 1
| #define HAVE_STDLIB_H 1
| #define HAVE_STRING_H 1
| #define HAVE_MEMORY_H 1
| #define HAVE_STRINGS_H 1
| #define HAVE_INTTYPES_H 1
| #define HAVE_STDINT_H 1
| #define HAVE_UNISTD_H 1
| #define HAVE_LOCALE_H 1
| #define HAVE_LC_MESSAGES 1
| #define HAVE_BIND_TEXTDOMAIN_CODESET 1
| #define HAVE_GETTEXT 1
| #define HAVE_DCGETTEXT 1
| #define ENABLE_NLS 1
| #define GETTEXT_PACKAGE "glib20"
| #define GLIB_LOCALE_DIR "/usr/share/locale"
| #define HAVE_DLFCN_H 1
| #define STDC_HEADERS 1
| #define HAVE_VPRINTF 1
| #define HAVE_STDLIB_H 1
| #define HAVE_UNISTD_H 1
| #define HAVE_GETPAGESIZE 1
| #define HAVE_MMAP 1
| #define HAVE_ALLOCA_H 1
| #define HAVE_ALLOCA 1
| #define HAVE_POSIX_MEMALIGN 1
| #define HAVE_MEMALIGN 1
| #define HAVE_VALLOC 1
| #define HAVE_ATEXIT 1
| #define HAVE_ON_EXIT 1
| #define HAVE_TIMEGM 1
| #define SIZEOF_CHAR 1
| #define SIZEOF_SHORT 2
| #define SIZEOF_LONG 4
| #define SIZEOF_INT 4
| #define SIZEOF_VOID_P 4
| #define SIZEOF_LONG_LONG 8
| #define SIZEOF___INT64 0
| #define HAVE_LONG_LONG_FORMAT 1
| #define SANE_MALLOC_PROTOS 1
| #define G_HAVE___INLINE 1
| #define G_HAVE___INLINE__ 1
| #define G_HAVE_INLINE 1
| #define HAVE_DOWHILE_MACROS 1
| #define HAVE_DIRENT_H 1
| #define HAVE_FLOAT_H 1
| #define HAVE_LIMITS_H 1
| #define HAVE_PWD_H 1
| #define HAVE_SYS_PARAM_H 1
| #define HAVE_SYS_POLL_H 1
| #define HAVE_SYS_TIME_H 1
| #define HAVE_SYS_TIMES_H 1
| #define HAVE_SYS_WAIT_H 1
| #define HAVE_UNISTD_H 1
| #define HAVE_VALUES_H 1
| #define HAVE_SYS_SELECT_H 1
| #define HAVE_SYS_TYPES_H 1
| #define HAVE_STDINT_H 1
| #define HAVE_SCHED_H 1
| #define HAVE_MALLOC_H 1
| #define HAVE_LANGINFO_H 1
| #define HAVE_NL_LANGINFO 1
| #define HAVE_LANGINFO_CODESET 1
| #define HAVE_STDDEF_H 1
| #define HAVE_STDLIB_H 1
| #define HAVE_STRING_H 1
| #define HAVE_SETLOCALE 1
| #define SIZEOF_SIZE_T 4
| #define HAVE_LSTAT 1
| #define HAVE_STRERROR 1
| #define HAVE_STRSIGNAL 1
| #define HAVE_MEMMOVE 1
| #define HAVE_VSNPRINTF 1
| #define HAVE_STPCPY 1
| #define HAVE_STRCASECMP 1
| #define HAVE_STRNCASECMP 1
| #define HAVE_POLL 1
| #define HAVE_GETCWD 1
| #define HAVE_VASPRINTF 1
| #define HAVE_SETENV 1
| #define HAVE_UNSETENV 1
| #define HAVE_GETC_UNLOCKED 1
| #define HAVE_READLINK 1
| #define HAVE_SYMLINK 1
| #define HAVE_NANOSLEEP 1
| #define HAVE_C99_VSNPRINTF 1
| #define HAVE_UNIX98_PRINTF 1
| #define HAVE_GOOD_PRINTF 1
| #define HAVE_LONG_LONG 1
| #define HAVE_LONG_DOUBLE 1
| #define HAVE_WCHAR_T 1
| #define HAVE_WINT_T 1
| #define HAVE_PTRDIFF_T 1
| #define HAVE_INTTYPES_H_WITH_UINTMAX 1
| #define HAVE_STDINT_H_WITH_UINTMAX 1
| #define HAVE_INTMAX_T 1
| #define HAVE_SNPRINTF 1
| #define HAVE_WCSLEN 1
| #define HAVE_C99_SNPRINTF 1
| #define REALLOC_0_WORKS 1
| #define HAVE_CODESET 1
| #define POSIX_MEMALIGN_WITH_COMPLIANT_ALLOCS 1
| #define G_VA_COPY va_copy
| /* end confdefs.h.  */
| #include <dlfcn.h>
|                 int glib_underscore_test (void) { return 42; }
| 		int main() {
| 		  void *f1 = (void*)0, *f2 = (void*)0, *handle;
| 		  handle = dlopen ((void*)0, 0);
| 		  if (handle) {
| 		    f1 = dlsym (handle, "glib_underscore_test");
| 		    f2 = dlsym (handle, "_glib_underscore_test");
| 		  } return (!f2 || f1);
| 		}
configure:37512: result: no
configure:37527: checking for dlerror
configure:37583: gcc -o conftest -g -O2 -Wall   conftest.c -ldl   >&5
configure:37589: $? = 0
configure:37596: test -z "$ac_c_werror_flag" || test ! -s conftest.err
configure:37599: $? = 0
configure:37606: test -s conftest
configure:37609: $? = 0
configure:37622: result: yes
configure:37639: checking for the suffix of shared libraries
configure:37647: result: .so
configure:37668: checking for gspawn implementation
configure:37678: result: gspawn.lo
configure:37683: checking for GIOChannel implementation
configure:37693: result: giounix.lo
configure:37698: checking for platform-dependent source
configure:37708: result: 
configure:37712: checking whether to compile timeloop
configure:37722: result: yes
configure:37735: checking if building for some Win32 platform
configure:37745: result: no
configure:37850: gcc -c -g -O2 -Wall  -D_POSIX4_DRAFT_SOURCE -D_POSIX4A_DRAFT10_SOURCE -U_OSF_SOURCE conftest.c >&5
conftest.c: In function 'main':
conftest.c:124: warning: unused variable 'm'
configure:37856: $? = 0
configure:37863: test -z "$ac_c_werror_flag" || test ! -s conftest.err
configure:37866: $? = 0
configure:37873: test -s conftest.o
configure:37876: $? = 0
configure:38024: checking for thread implementation
configure:38033: result: posix
configure:38152: gcc -o conftest -g -O2 -Wall -pthread   conftest.c   >&5
configure:38155: $? = 0
configure:38161: ./conftest
configure:38164: $? = 0
configure:38284: checking thread related cflags
configure:38286: result: -pthread
configure:38465: checking for sched_get_priority_min
configure:38544: gcc -o conftest -g -O2 -Wall  -pthread -D_POSIX4_DRAFT_SOURCE -D_POSIX4A_DRAFT10_SOURCE -U_OSF_SOURCE  conftest.c    >&5
configure:38547: $? = 0
configure:38553: ./conftest
configure:38556: $? = 0
configure:38571: result: yes
configure:38622: checking thread related libraries
configure:38624: result: -pthread 
configure:38637: checking for localtime_r
configure:38693: gcc -o conftest -g -O2 -Wall  -pthread  conftest.c   >&5
configure:38699: $? = 0
configure:38706: test -z "$ac_c_werror_flag" || test ! -s conftest.err
configure:38709: $? = 0
configure:38716: test -s conftest
configure:38719: $? = 0
configure:38733: result: yes
configure:38744: checking for posix getpwuid_r
configure:38782: gcc -o conftest -g -O2 -Wall  -pthread  conftest.c   >&5
configure:38785: $? = 0
configure:38791: ./conftest
configure:38794: $? = 0
configure:38810: result: yes
configure:38914: checking size of pthread_t
configure:39299: gcc -o conftest -g -O2 -Wall  -pthread -D_POSIX4_DRAFT_SOURCE -D_POSIX4A_DRAFT10_SOURCE -U_OSF_SOURCE  conftest.c -pthread    >&5
configure:39302: $? = 0
configure:39308: ./conftest
configure:39311: $? = 0
configure:39329: result: 4
configure:39338: checking for pthread_attr_setstacksize
configure:39361: gcc -o conftest -g -O2 -Wall  -pthread -D_POSIX4_DRAFT_SOURCE -D_POSIX4A_DRAFT10_SOURCE -U_OSF_SOURCE  conftest.c -pthread    >&5
configure:39367: $? = 0
configure:39374: test -z "$ac_c_werror_flag" || test ! -s conftest.err
configure:39377: $? = 0
configure:39384: test -s conftest
configure:39387: $? = 0
configure:39389: result: yes
configure:39406: checking for minimal/maximal thread priority
configure:39480: result: sched_get_priority_min(SCHED_OTHER)/sched_get_priority_max(SCHED_OTHER)
configure:39482: checking for pthread_setschedparam
configure:39505: gcc -o conftest -g -O2 -Wall  -pthread -D_POSIX4_DRAFT_SOURCE -D_POSIX4A_DRAFT10_SOURCE -U_OSF_SOURCE  conftest.c -pthread    >&5
conftest.c: In function 'main':
conftest.c:128: warning: null argument where non-null required (argument 3)
conftest.c:128: warning: 't' is used uninitialized in this function
configure:39511: $? = 0
configure:39518: test -z "$ac_c_werror_flag" || test ! -s conftest.err
configure:39521: $? = 0
configure:39528: test -s conftest
configure:39531: $? = 0
configure:39533: result: yes
configure:39559: checking for posix yield function
configure:39584: gcc -o conftest -g -O2 -Wall  -pthread -D_POSIX4_DRAFT_SOURCE -D_POSIX4A_DRAFT10_SOURCE -U_OSF_SOURCE  conftest.c -pthread    >&5
configure:39590: $? = 0
configure:39597: test -z "$ac_c_werror_flag" || test ! -s conftest.err
configure:39600: $? = 0
configure:39607: test -s conftest
configure:39610: $? = 0
configure:39631: result: sched_yield
configure:40526: checking size of pthread_mutex_t
configure:40911: gcc -o conftest -g -O2 -Wall  -pthread -D_POSIX4_DRAFT_SOURCE -D_POSIX4A_DRAFT10_SOURCE -U_OSF_SOURCE  conftest.c -pthread    >&5
configure:40914: $? = 0
configure:40920: ./conftest
configure:40923: $? = 0
configure:40941: result: 24
configure:40948: checking byte contents of PTHREAD_MUTEX_INITIALIZER
configure:40983: gcc -o conftest -g -O2 -Wall  -pthread -D_POSIX4_DRAFT_SOURCE -D_POSIX4A_DRAFT10_SOURCE -U_OSF_SOURCE  conftest.c -pthread    >&5
conftest.c:132: warning: return type defaults to 'int'
conftest.c: In function 'main':
conftest.c:137: warning: implicit declaration of function 'exit'
conftest.c:137: warning: incompatible implicit declaration of built-in function 'exit'
configure:40986: $? = 0
configure:40992: ./conftest
configure:40995: $? = 0
configure:41011: result: 0,0,0,0,0,0,0,0,0,0,0,0,0,0,0,0,0,0,0,0,0,0,0,0
configure:41030: checking for clock_gettime
configure:41086: gcc -o conftest -g -O2 -Wall  -pthread  conftest.c   >&5
/tmp/ccIRERbb.o: In function `main':
/home/rasmer/src/glib/2.14.0/glib-2.14.0/conftest.c:164: undefined reference to `clock_gettime'
collect2: ld returned 1 exit status
configure:41092: $? = 1
configure: failed program was:
| /* confdefs.h.  */
| #define PACKAGE_NAME "glib"
| #define PACKAGE_TARNAME "glib"
| #define PACKAGE_VERSION "2.14.0"
| #define PACKAGE_STRING "glib 2.14.0"
| #define PACKAGE_BUGREPORT "http://bugzilla.gnome.org/enter_bug.cgi?product=glib"
| #define GLIB_MAJOR_VERSION 2
| #define GLIB_MINOR_VERSION 14
| #define GLIB_MICRO_VERSION 0
| #define GLIB_INTERFACE_AGE 0
| #define GLIB_BINARY_AGE 1400
| #define G_COMPILED_WITH_DEBUGGING "minimum"
| #define _FILE_OFFSET_BITS 64
| #define STDC_HEADERS 1
| #define HAVE_SYS_TYPES_H 1
| #define HAVE_SYS_STAT_H 1
| #define HAVE_STDLIB_H 1
| #define HAVE_STRING_H 1
| #define HAVE_MEMORY_H 1
| #define HAVE_STRINGS_H 1
| #define HAVE_INTTYPES_H 1
| #define HAVE_STDINT_H 1
| #define HAVE_UNISTD_H 1
| #define HAVE_LOCALE_H 1
| #define HAVE_LC_MESSAGES 1
| #define HAVE_BIND_TEXTDOMAIN_CODESET 1
| #define HAVE_GETTEXT 1
| #define HAVE_DCGETTEXT 1
| #define ENABLE_NLS 1
| #define GETTEXT_PACKAGE "glib20"
| #define GLIB_LOCALE_DIR "/usr/share/locale"
| #define HAVE_DLFCN_H 1
| #define STDC_HEADERS 1
| #define HAVE_VPRINTF 1
| #define HAVE_STDLIB_H 1
| #define HAVE_UNISTD_H 1
| #define HAVE_GETPAGESIZE 1
| #define HAVE_MMAP 1
| #define HAVE_ALLOCA_H 1
| #define HAVE_ALLOCA 1
| #define HAVE_POSIX_MEMALIGN 1
| #define HAVE_MEMALIGN 1
| #define HAVE_VALLOC 1
| #define HAVE_ATEXIT 1
| #define HAVE_ON_EXIT 1
| #define HAVE_TIMEGM 1
| #define SIZEOF_CHAR 1
| #define SIZEOF_SHORT 2
| #define SIZEOF_LONG 4
| #define SIZEOF_INT 4
| #define SIZEOF_VOID_P 4
| #define SIZEOF_LONG_LONG 8
| #define SIZEOF___INT64 0
| #define HAVE_LONG_LONG_FORMAT 1
| #define SANE_MALLOC_PROTOS 1
| #define G_HAVE___INLINE 1
| #define G_HAVE___INLINE__ 1
| #define G_HAVE_INLINE 1
| #define HAVE_DOWHILE_MACROS 1
| #define HAVE_DIRENT_H 1
| #define HAVE_FLOAT_H 1
| #define HAVE_LIMITS_H 1
| #define HAVE_PWD_H 1
| #define HAVE_SYS_PARAM_H 1
| #define HAVE_SYS_POLL_H 1
| #define HAVE_SYS_TIME_H 1
| #define HAVE_SYS_TIMES_H 1
| #define HAVE_SYS_WAIT_H 1
| #define HAVE_UNISTD_H 1
| #define HAVE_VALUES_H 1
| #define HAVE_SYS_SELECT_H 1
| #define HAVE_SYS_TYPES_H 1
| #define HAVE_STDINT_H 1
| #define HAVE_SCHED_H 1
| #define HAVE_MALLOC_H 1
| #define HAVE_LANGINFO_H 1
| #define HAVE_NL_LANGINFO 1
| #define HAVE_LANGINFO_CODESET 1
| #define HAVE_STDDEF_H 1
| #define HAVE_STDLIB_H 1
| #define HAVE_STRING_H 1
| #define HAVE_SETLOCALE 1
| #define SIZEOF_SIZE_T 4
| #define HAVE_LSTAT 1
| #define HAVE_STRERROR 1
| #define HAVE_STRSIGNAL 1
| #define HAVE_MEMMOVE 1
| #define HAVE_VSNPRINTF 1
| #define HAVE_STPCPY 1
| #define HAVE_STRCASECMP 1
| #define HAVE_STRNCASECMP 1
| #define HAVE_POLL 1
| #define HAVE_GETCWD 1
| #define HAVE_VASPRINTF 1
| #define HAVE_SETENV 1
| #define HAVE_UNSETENV 1
| #define HAVE_GETC_UNLOCKED 1
| #define HAVE_READLINK 1
| #define HAVE_SYMLINK 1
| #define HAVE_NANOSLEEP 1
| #define HAVE_C99_VSNPRINTF 1
| #define HAVE_UNIX98_PRINTF 1
| #define HAVE_GOOD_PRINTF 1
| #define HAVE_LONG_LONG 1
| #define HAVE_LONG_DOUBLE 1
| #define HAVE_WCHAR_T 1
| #define HAVE_WINT_T 1
| #define HAVE_PTRDIFF_T 1
| #define HAVE_INTTYPES_H_WITH_UINTMAX 1
| #define HAVE_STDINT_H_WITH_UINTMAX 1
| #define HAVE_INTMAX_T 1
| #define HAVE_SNPRINTF 1
| #define HAVE_WCSLEN 1
| #define HAVE_C99_SNPRINTF 1
| #define REALLOC_0_WORKS 1
| #define HAVE_CODESET 1
| #define POSIX_MEMALIGN_WITH_COMPLIANT_ALLOCS 1
| #define G_VA_COPY va_copy
| #define HAVE_LOCALTIME_R 1
| #define HAVE_POSIX_GETPWUID_R 1
| #define GLIB_SIZEOF_SYSTEM_THREAD 4
| #define HAVE_PTHREAD_ATTR_SETSTACKSIZE 1
| #define POSIX_MIN_PRIORITY sched_get_priority_min(SCHED_OTHER)
| #define POSIX_MAX_PRIORITY sched_get_priority_max(SCHED_OTHER)
| #define POSIX_YIELD_FUNC sched_yield()
| #define G_THREAD_SOURCE "gthread-posix.c"
| #define GLIB_SIZEOF_GMUTEX 24
| #define GLIB_BYTE_CONTENTS_GMUTEX 0,0,0,0,0,0,0,0,0,0,0,0,0,0,0,0,0,0,0,0,0,0,0,0
| /* end confdefs.h.  */
| /* Define clock_gettime to an innocuous variant, in case <limits.h> declares clock_gettime.
|    For example, HP-UX 11i <limits.h> declares gettimeofday.  */
| #define clock_gettime innocuous_clock_gettime
| 
| /* System header to define __stub macros and hopefully few prototypes,
|     which can conflict with char clock_gettime (); below.
|     Prefer <limits.h> to <assert.h> if __STDC__ is defined, since
|     <limits.h> exists even on freestanding compilers.  */
| 
| #ifdef __STDC__
| # include <limits.h>
| #else
| # include <assert.h>
| #endif
| 
| #undef clock_gettime
| 
| /* Override any GCC internal prototype to avoid an error.
|    Use char because int might match the return type of a GCC
|    builtin and then its argument prototype would still apply.  */
| #ifdef __cplusplus
| extern "C"
| #endif
| char clock_gettime ();
| /* The GNU C library defines this for functions which it implements
|     to always fail with ENOSYS.  Some functions are actually named
|     something starting with __ and the normal name is an alias.  */
| #if defined __stub_clock_gettime || defined __stub___clock_gettime
| choke me
| #endif
| 
| int
| main ()
| {
| return clock_gettime ();
|   ;
|   return 0;
| }
configure:41126: result: no
configure:41135: checking for clock_gettime in -lrt
configure:41170: gcc -o conftest -g -O2 -Wall  -pthread  conftest.c -lrt    >&5
configure:41176: $? = 0
configure:41183: test -z "$ac_c_werror_flag" || test ! -s conftest.err
configure:41186: $? = 0
configure:41193: test -s conftest
configure:41196: $? = 0
configure:41210: result: yes
configure:41228: checking for monotonic clocks
configure:41256: gcc -c -g -O2 -Wall  -pthread conftest.c >&5
configure:41262: $? = 0
configure:41269: test -z "$ac_c_werror_flag" || test ! -s conftest.err
configure:41272: $? = 0
configure:41279: test -s conftest.o
configure:41282: $? = 0
configure:41294: result: yes
configure:41306: checking whether to use assembler code for atomic operations
configure:41317: result: i486
configure:41464: checking value of POLLIN
configure:41837: gcc -o conftest -g -O2 -Wall  -pthread  conftest.c   >&5
configure:41840: $? = 0
configure:41846: ./conftest
configure:41849: $? = 0
configure:41864: result: 1
configure:41867: checking value of POLLOUT
configure:42240: gcc -o conftest -g -O2 -Wall  -pthread  conftest.c   >&5
configure:42243: $? = 0
configure:42249: ./conftest
configure:42252: $? = 0
configure:42267: result: 4
configure:42270: checking value of POLLPRI
configure:42643: gcc -o conftest -g -O2 -Wall  -pthread  conftest.c   >&5
configure:42646: $? = 0
configure:42652: ./conftest
configure:42655: $? = 0
configure:42670: result: 2
configure:42673: checking value of POLLERR
configure:43046: gcc -o conftest -g -O2 -Wall  -pthread  conftest.c   >&5
configure:43049: $? = 0
configure:43055: ./conftest
configure:43058: $? = 0
configure:43073: result: 8
configure:43076: checking value of POLLHUP
configure:43449: gcc -o conftest -g -O2 -Wall  -pthread  conftest.c   >&5
configure:43452: $? = 0
configure:43458: ./conftest
configure:43461: $? = 0
configure:43476: result: 16
configure:43479: checking value of POLLNVAL
configure:43852: gcc -o conftest -g -O2 -Wall  -pthread  conftest.c   >&5
configure:43855: $? = 0
configure:43861: ./conftest
configure:43864: $? = 0
configure:43879: result: 32
configure:43896: checking for broken poll
configure:43933: gcc -o conftest -g -O2 -Wall  -pthread  conftest.c   >&5
configure:43936: $? = 0
configure:43942: ./conftest
configure:43945: $? = 0
configure:43965: result: no
configure:44327: checking whether compiler understands -Wno-pointer-sign
configure:44352: gcc -c -g -O2 -Wall -Wno-pointer-sign  -pthread conftest.c >&5
configure:44358: $? = 0
configure:44365: test -z "$ac_c_werror_flag" || test ! -s conftest.err
configure:44368: $? = 0
configure:44375: test -s conftest.o
configure:44378: $? = 0
configure:44381: result: yes
configure:44424: checking for EILSEQ
configure:44451: gcc -c -g -O2 -Wall  -pthread conftest.c >&5
conftest.c: In function 'main':
conftest.c:140: warning: unused variable 'error'
configure:44457: $? = 0
configure:44464: test -z "$ac_c_werror_flag" || test ! -s conftest.err
configure:44467: $? = 0
configure:44474: test -s conftest.o
configure:44477: $? = 0
configure:44488: result: yes
configure:44588: checking whether to build gtk-doc documentation
configure:44590: result: no
configure:45070: creating ./config.status

## ---------------------- ##
## Running config.status. ##
## ---------------------- ##

This file was extended by glib config.status 2.14.0, which was
generated by GNU Autoconf 2.60.  Invocation command line was

  CONFIG_FILES    = 
  CONFIG_HEADERS  = 
  CONFIG_LINKS    = 
  CONFIG_COMMANDS = 
  $ ./config.status 

on desktop

config.status:1101: creating glib-2.0.pc
config.status:1101: creating glib-2.0-uninstalled.pc
config.status:1101: creating gmodule-2.0.pc
config.status:1101: creating gmodule-export-2.0.pc
config.status:1101: creating gmodule-no-export-2.0.pc
config.status:1101: creating gmodule-2.0-uninstalled.pc
config.status:1101: creating gmodule-no-export-2.0-uninstalled.pc
config.status:1101: creating gthread-2.0.pc
config.status:1101: creating gthread-2.0-uninstalled.pc
config.status:1101: creating gobject-2.0.pc
config.status:1101: creating gobject-2.0-uninstalled.pc
config.status:1101: creating glib-zip
config.status:1101: creating glib-gettextize
config.status:1101: creating Makefile
config.status:1101: creating build/Makefile
config.status:1101: creating build/win32/Makefile
config.status:1101: creating build/win32/dirent/Makefile
config.status:1101: creating build/win32/vs8/Makefile
config.status:1101: creating glib/Makefile
config.status:1101: creating glib/libcharset/Makefile
config.status:1101: creating glib/gnulib/Makefile
config.status:1101: creating glib/pcre/Makefile
config.status:1101: creating glib/update-pcre/Makefile
config.status:1101: creating gmodule/Makefile
config.status:1101: creating gmodule/gmoduleconf.h
config.status:1101: creating gobject/Makefile
config.status:1101: creating gobject/glib-mkenums
config.status:1101: creating gthread/Makefile
config.status:1101: creating po/Makefile.in
config.status:1101: creating docs/Makefile
config.status:1101: creating docs/reference/Makefile
config.status:1101: creating docs/reference/glib/Makefile
config.status:1101: creating docs/reference/glib/version.xml
config.status:1101: creating docs/reference/gobject/Makefile
config.status:1101: creating docs/reference/gobject/version.xml
config.status:1101: creating tests/Makefile
config.status:1101: creating tests/gobject/Makefile
config.status:1101: creating tests/refcount/Makefile
config.status:1101: creating m4macros/Makefile
config.status:1101: creating config.h
config.status:1496: executing depfiles commands
config.status:1496: executing default-1 commands
config.status:1496: executing glibconfig.h commands
config.status:1496: executing chmod-scripts commands

## ---------------- ##
## Cache variables. ##
## ---------------- ##

ac_cv_build=i686-pc-linux-gnu
ac_cv_c_bigendian=no
ac_cv_c_compiler_gnu=yes
ac_cv_c_const=yes
ac_cv_cxx_compiler_gnu=yes
ac_cv_env_CCC_set=
ac_cv_env_CCC_value=
ac_cv_env_CC_set=
ac_cv_env_CC_value=
ac_cv_env_CFLAGS_set=
ac_cv_env_CFLAGS_value=
ac_cv_env_CPPFLAGS_set=
ac_cv_env_CPPFLAGS_value=
ac_cv_env_CPP_set=
ac_cv_env_CPP_value=
ac_cv_env_CXXCPP_set=
ac_cv_env_CXXCPP_value=
ac_cv_env_CXXFLAGS_set=
ac_cv_env_CXXFLAGS_value=
ac_cv_env_CXX_set=
ac_cv_env_CXX_value=
ac_cv_env_F77_set=
ac_cv_env_F77_value=
ac_cv_env_FFLAGS_set=
ac_cv_env_FFLAGS_value=
ac_cv_env_LDFLAGS_set=
ac_cv_env_LDFLAGS_value=
ac_cv_env_PCRE_CFLAGS_set=
ac_cv_env_PCRE_CFLAGS_value=
ac_cv_env_PCRE_LIBS_set=
ac_cv_env_PCRE_LIBS_value=
ac_cv_env_PKG_CONFIG_set=
ac_cv_env_PKG_CONFIG_value=
ac_cv_env_build_alias_set=
ac_cv_env_build_alias_value=
ac_cv_env_host_alias_set=
ac_cv_env_host_alias_value=
ac_cv_env_target_alias_set=
ac_cv_env_target_alias_value=
ac_cv_f77_compiler_gnu=no
ac_cv_func_NSLinkModule=no
ac_cv_func__NSGetEnviron=no
ac_cv_func__doprnt=no
ac_cv_func_alloca_works=yes
ac_cv_func_atexit=yes
ac_cv_func_bind_textdomain_codeset=yes
ac_cv_func_clock_gettime=no
ac_cv_func_dcgettext=yes
ac_cv_func_dlerror=yes
ac_cv_func_dlopen=no
ac_cv_func_fdwalk=no
ac_cv_func_getc_unlocked=yes
ac_cv_func_getcwd=yes
ac_cv_func_getpagesize=yes
ac_cv_func_iconv_open=yes
ac_cv_func_localtime_r=yes
ac_cv_func_lstat=yes
ac_cv_func_memalign=yes
ac_cv_func_memmove=yes
ac_cv_func_mmap_fixed_mapped=yes
ac_cv_func_nanosleep=yes
ac_cv_func_nl_langinfo=yes
ac_cv_func_nsleep=no
ac_cv_func_on_exit=yes
ac_cv_func_poll=yes
ac_cv_func_posix_getpwuid_r=yes
ac_cv_func_posix_memalign=yes
ac_cv_func_printf_unix98=yes
ac_cv_func_readlink=yes
ac_cv_func_setenv=yes
ac_cv_func_setlocale=yes
ac_cv_func_snprintf=yes
ac_cv_func_snprintf_c99=yes
ac_cv_func_stpcpy=yes
ac_cv_func_strcasecmp=yes
ac_cv_func_strerror=yes
ac_cv_func_strncasecmp=yes
ac_cv_func_strsignal=yes
ac_cv_func_symlink=yes
ac_cv_func_timegm=yes
ac_cv_func_unsetenv=yes
ac_cv_func_valloc=yes
ac_cv_func_vasprintf=yes
ac_cv_func_vprintf=yes
ac_cv_func_vsnprintf=yes
ac_cv_func_vsnprintf_c99=yes
ac_cv_func_wcslen=yes
ac_cv_gnu_library_2_1=yes
ac_cv_header_crt_externs_h=no
ac_cv_header_dirent_h=yes
ac_cv_header_dlfcn_h=yes
ac_cv_header_float_h=yes
ac_cv_header_inttypes_h=yes
ac_cv_header_langinfo_h=yes
ac_cv_header_libintl_h=yes
ac_cv_header_limits_h=yes
ac_cv_header_locale_h=yes
ac_cv_header_malloc_h=yes
ac_cv_header_memory_h=yes
ac_cv_header_pwd_h=yes
ac_cv_header_sched_h=yes
ac_cv_header_stdc=yes
ac_cv_header_stddef_h=yes
ac_cv_header_stdint_h=yes
ac_cv_header_stdlib_h=yes
ac_cv_header_string_h=yes
ac_cv_header_strings_h=yes
ac_cv_header_sys_param_h=yes
ac_cv_header_sys_poll_h=yes
ac_cv_header_sys_select_h=yes
ac_cv_header_sys_stat_h=yes
ac_cv_header_sys_time_h=yes
ac_cv_header_sys_times_h=yes
ac_cv_header_sys_types_h=yes
ac_cv_header_sys_wait_h=yes
ac_cv_header_unistd_h=yes
ac_cv_header_values_h=yes
ac_cv_host=i686-pc-linux-gnu
ac_cv_lib_dl_dlopen=yes
ac_cv_lib_dl_dlsym=yes
ac_cv_lib_rt_clock_gettime=yes
ac_cv_objext=o
ac_cv_path_EGREP='/bin/grep -E'
ac_cv_path_GMSGFMT=/usr/bin/msgfmt
ac_cv_path_GREP=/bin/grep
ac_cv_path_MSGFMT=/usr/bin/msgfmt
ac_cv_path_PERL_PATH=/usr/bin/perl
ac_cv_path_PKG_CONFIG=/usr/bin/pkg-config
ac_cv_path_XGETTEXT=/usr/bin/xgettext
ac_cv_path_install='/usr/bin/install -c'
ac_cv_prog_AWK=gawk
ac_cv_prog_CPP='gcc -E'
ac_cv_prog_CXX=c++
ac_cv_prog_CXXCPP='c++ -E'
ac_cv_prog_PERL=perl
ac_cv_prog_ac_ct_AR=ar
ac_cv_prog_ac_ct_CC=gcc
ac_cv_prog_ac_ct_RANLIB=ranlib
ac_cv_prog_ac_ct_STRIP=strip
ac_cv_prog_cc_c89=
ac_cv_prog_cc_g=yes
ac_cv_prog_cxx_g=yes
ac_cv_prog_f77_g=no
ac_cv_prog_make_make_set=yes
ac_cv_sizeof___int64=0
ac_cv_sizeof_char=1
ac_cv_sizeof_int=4
ac_cv_sizeof_long=4
ac_cv_sizeof_long_long=8
ac_cv_sizeof_short=2
ac_cv_sizeof_size_t=4
ac_cv_sizeof_void_p=4
ac_cv_sys_file_offset_bits=64
ac_cv_sys_large_files=no
ac_cv_sys_largefile_CC=no
ac_cv_type___int64=no
ac_cv_type_char=yes
ac_cv_type_int=yes
ac_cv_type_long=yes
ac_cv_type_long_long=yes
ac_cv_type_ptrdiff_t=yes
ac_cv_type_short=yes
ac_cv_type_size_t=yes
ac_cv_type_void_p=yes
ac_cv_working_alloca_h=yes
am_cv_CC_dependencies_compiler_type=gcc3
am_cv_CXX_dependencies_compiler_type=gcc3
am_cv_prog_cc_stdc=
am_cv_val_LC_MESSAGES=yes
bh_cv_c_signed=yes
glib_cv___va_copy=yes
glib_cv_byte_contents_gmutex=0,0,0,0,0,0,0,0,0,0,0,0,0,0,0,0,0,0,0,0,0,0,0,0
glib_cv_compliant_posix_memalign=1
glib_cv_has__inline=yes
glib_cv_has__inline__=yes
glib_cv_hasinline=yes
glib_cv_have_strlcpy=no
glib_cv_langinfo_codeset=yes
glib_cv_long_long_format=ll
glib_cv_monotonic_clock=yes
glib_cv_rtldglobal_broken=no
glib_cv_sane_realloc=yes
glib_cv_sizeof_gmutex=24
glib_cv_sizeof_system_thread=4
glib_cv_stack_grows=no
glib_cv_uscore=no
glib_cv_va_copy=yes
glib_cv_va_val_copy=yes
glib_cv_value_POLLERR=8
glib_cv_value_POLLHUP=16
glib_cv_value_POLLIN=1
glib_cv_value_POLLNVAL=32
glib_cv_value_POLLOUT=4
glib_cv_value_POLLPRI=2
gt_cv_c_long_double=yes
gt_cv_c_wchar_t=yes
gt_cv_c_wint_t=yes
gt_cv_func_dgettext_libc=yes
gt_cv_func_dgettext_libintl=no
gt_cv_func_ngettext_libc=yes
gt_cv_have_gettext=yes
jm_ac_cv_header_inttypes_h=yes
jm_ac_cv_header_stdint_h=yes
jm_cv_langinfo_codeset=yes
lt_cv_deplibs_check_method=pass_all
lt_cv_file_magic_cmd='$MAGIC_CMD'
lt_cv_file_magic_test_file=
lt_cv_ld_reload_flag=-r
lt_cv_objdir=.libs
lt_cv_path_LD=/usr/bin/ld
lt_cv_path_LDCXX=/usr/bin/ld
lt_cv_path_NM='/usr/bin/nm -B'
lt_cv_path_SED=/bin/sed
lt_cv_prog_compiler_c_o=yes
lt_cv_prog_compiler_c_o_CXX=yes
lt_cv_prog_compiler_rtti_exceptions=no
lt_cv_prog_gnu_ld=yes
lt_cv_prog_gnu_ldcxx=yes
lt_cv_sys_global_symbol_pipe='sed -n -e '\''s/^.*[ 	]\([ABCDGIRSTW][ABCDGIRSTW]*\)[ 	][ 	]*\([_A-Za-z][_A-Za-z0-9]*\)$/\1 \2 \2/p'\'''
lt_cv_sys_global_symbol_to_c_name_address='sed -n -e '\''s/^: \([^ ]*\) $/  {\"\1\", (lt_ptr) 0},/p'\'' -e '\''s/^[BCDEGRST] \([^ ]*\) \([^ ]*\)$/  {"\2", (lt_ptr) \&\2},/p'\'''
lt_cv_sys_global_symbol_to_cdecl='sed -n -e '\''s/^. .* \(.*\)$/extern int \1;/p'\'''
lt_cv_sys_max_cmd_len=32768
lt_lt_cv_prog_compiler_c_o='"yes"'
lt_lt_cv_prog_compiler_c_o_CXX='"yes"'
lt_lt_cv_sys_global_symbol_pipe='"sed -n -e '\''s/^.*[ 	]\\([ABCDGIRSTW][ABCDGIRSTW]*\\)[ 	][ 	]*\\([_A-Za-z][_A-Za-z0-9]*\\)\$/\\1 \\2 \\2/p'\''"'
lt_lt_cv_sys_global_symbol_to_c_name_address='"sed -n -e '\''s/^: \\([^ ]*\\) \$/  {\\\"\\1\\\", (lt_ptr) 0},/p'\'' -e '\''s/^[BCDEGRST] \\([^ ]*\\) \\([^ ]*\\)\$/  {\"\\2\", (lt_ptr) \\&\\2},/p'\''"'
lt_lt_cv_sys_global_symbol_to_cdecl='"sed -n -e '\''s/^. .* \\(.*\\)\$/extern int \\1;/p'\''"'

## ----------------- ##
## Output variables. ##
## ----------------- ##

ACLOCAL='${SHELL} /home/rasmer/src/glib/2.14.0/glib-2.14.0/missing --run aclocal-1.7'
ALLOCA=''
AMDEPBACKSLASH='\'
AMDEP_FALSE='#'
AMDEP_TRUE=''
AMTAR='${SHELL} /home/rasmer/src/glib/2.14.0/glib-2.14.0/missing --run tar'
AR='ar'
AS='as'
AUTOCONF='${SHELL} /home/rasmer/src/glib/2.14.0/glib-2.14.0/missing --run autoconf'
AUTOHEADER='${SHELL} /home/rasmer/src/glib/2.14.0/glib-2.14.0/missing --run autoheader'
AUTOMAKE='${SHELL} /home/rasmer/src/glib/2.14.0/glib-2.14.0/missing --run automake-1.7'
AWK='gawk'
CATALOGS=' am.gmo ar.gmo as.gmo az.gmo be.gmo be@latin.gmo bg.gmo bn.gmo bn_IN.gmo bs.gmo ca.gmo cs.gmo cy.gmo da.gmo de.gmo dz.gmo el.gmo en_CA.gmo en_GB.gmo eo.gmo es.gmo et.gmo eu.gmo fa.gmo fi.gmo fr.gmo ga.gmo gl.gmo gu.gmo he.gmo hi.gmo hr.gmo hu.gmo hy.gmo id.gmo is.gmo it.gmo ja.gmo ka.gmo kn.gmo ko.gmo ku.gmo lt.gmo lv.gmo mg.gmo mk.gmo ml.gmo mn.gmo ms.gmo nb.gmo ne.gmo nl.gmo nn.gmo or.gmo pa.gmo pl.gmo pt.gmo pt_BR.gmo ro.gmo ru.gmo rw.gmo sk.gmo sl.gmo sq.gmo sr.gmo sr@Latn.gmo sr@ije.gmo sv.gmo ta.gmo te.gmo th.gmo tl.gmo tr.gmo tt.gmo uk.gmo vi.gmo wa.gmo xh.gmo yi.gmo zh_CN.gmo zh_HK.gmo zh_TW.gmo'
CATOBJEXT='.gmo'
CC='gcc'
CCDEPMODE='depmode=gcc3'
CFLAGS='-g -O2 -Wall'
CPP='gcc -E'
CPPFLAGS=' -pthread'
CROSS_COMPILING_FALSE=''
CROSS_COMPILING_TRUE='#'
CXX='c++'
CXXCPP='c++ -E'
CXXDEPMODE='depmode=gcc3'
CXXFLAGS='-g -O2'
CYGPATH_W='echo'
DATADIRNAME='share'
DEFS='-DHAVE_CONFIG_H'
DEPDIR='.deps'
DISABLE_MEM_POOLS=''
DLLTOOL='dlltool'
ECHO='echo'
ECHO_C=''
ECHO_N='-n'
ECHO_T=''
EGREP='/bin/grep -E'
ENABLE_GTK_DOC_FALSE=''
ENABLE_GTK_DOC_TRUE='#'
ENABLE_MAN_FALSE=''
ENABLE_MAN_TRUE='#'
ENABLE_REGEX_FALSE='#'
ENABLE_REGEX_TRUE=''
ENABLE_TIMELOOP_FALSE='#'
ENABLE_TIMELOOP_TRUE=''
EXEEXT=''
F77=''
FFLAGS=''
GETTEXT_PACKAGE='glib20'
GIO='giounix.lo'
GLIBC21='yes'
GLIB_BINARY_AGE='1400'
GLIB_DEBUG_FLAGS='-DG_DISABLE_CAST_CHECKS'
GLIB_DEF=''
GLIB_GENMARSHAL=''
GLIB_INTERFACE_AGE='0'
GLIB_MAJOR_VERSION='2'
GLIB_MICRO_VERSION='0'
GLIB_MINOR_VERSION='14'
GLIB_VERSION='2.14.0'
GMODULE_DEF=''
GMOFILES=' am.gmo ar.gmo as.gmo az.gmo be.gmo be@latin.gmo bg.gmo bn.gmo bn_IN.gmo bs.gmo ca.gmo cs.gmo cy.gmo da.gmo de.gmo dz.gmo el.gmo en_CA.gmo en_GB.gmo eo.gmo es.gmo et.gmo eu.gmo fa.gmo fi.gmo fr.gmo ga.gmo gl.gmo gu.gmo he.gmo hi.gmo hr.gmo hu.gmo hy.gmo id.gmo is.gmo it.gmo ja.gmo ka.gmo kn.gmo ko.gmo ku.gmo lt.gmo lv.gmo mg.gmo mk.gmo ml.gmo mn.gmo ms.gmo nb.gmo ne.gmo nl.gmo nn.gmo or.gmo pa.gmo pl.gmo pt.gmo pt_BR.gmo ro.gmo ru.gmo rw.gmo sk.gmo sl.gmo sq.gmo sr.gmo sr@Latn.gmo sr@ije.gmo sv.gmo ta.gmo te.gmo th.gmo tl.gmo tr.gmo tt.gmo uk.gmo vi.gmo wa.gmo xh.gmo yi.gmo zh_CN.gmo zh_HK.gmo zh_TW.gmo'
GMSGFMT='/usr/bin/msgfmt'
GOBJECT_DEF=''
GREP='/bin/grep'
GSPAWN='gspawn.lo'
GTHREAD_COMPILE_IMPL_DEFINES='-D_POSIX4_DRAFT_SOURCE -D_POSIX4A_DRAFT10_SOURCE -U_OSF_SOURCE'
GTHREAD_DEF=''
GTK_DOC_USE_LIBTOOL_FALSE='#'
GTK_DOC_USE_LIBTOOL_TRUE=''
G_LIBS_EXTRA=''
G_MODULE_BROKEN_RTLD_GLOBAL='0'
G_MODULE_HAVE_DLERROR='1'
G_MODULE_IMPL='G_MODULE_IMPL_DL'
G_MODULE_LDFLAGS='-Wl,--export-dynamic'
G_MODULE_LIBS='-ldl'
G_MODULE_LIBS_EXTRA=''
G_MODULE_NEED_USCORE='0'
G_MODULE_PLUGIN_LIBS=''
G_MODULE_SUPPORTED='true'
G_THREAD_CFLAGS='-pthread'
G_THREAD_LIBS='-pthread  -lrt'
G_THREAD_LIBS_EXTRA=''
G_THREAD_LIBS_FOR_GTHREAD='-lpthread -lrt'
HAVE_CXX_FALSE='#'
HAVE_CXX_TRUE=''
HAVE_GNUC_VISIBILITY_FALSE='#'
HAVE_GNUC_VISIBILITY_TRUE=''
HAVE_GOOD_PRINTF_FALSE='#'
HAVE_GOOD_PRINTF_TRUE=''
HAVE_SUNSTUDIO_VISIBILITY_FALSE=''
HAVE_SUNSTUDIO_VISIBILITY_TRUE='#'
HTML_DIR='${datadir}/gtk-doc/html'
ICONV_LIBS=''
INDENT=''
INSTALL_DATA='${INSTALL} -m 644'
INSTALL_PROGRAM='${INSTALL}'
INSTALL_SCRIPT='${INSTALL}'
INSTALL_STRIP_PROGRAM='${SHELL} $(install_sh) -c -s'
INSTOBJEXT='.mo'
INTLLIBS=''
LDFLAGS=''
LIBOBJS=''
LIBS=' '
LIBTOOL='$(SHELL) $(top_builddir)/libtool'
LIBTOOL_EXPORT_OPTIONS='-export-symbols-regex "^g.*"'
LN_S='ln -s'
LTLIBOBJS=''
LT_AGE='1400'
LT_CURRENT='1400'
LT_CURRENT_MINUS_AGE='0'
LT_RELEASE='2.14'
LT_REVISION='0'
MAINT='#'
MAINTAINER_MODE_FALSE=''
MAINTAINER_MODE_TRUE='#'
MAKEINFO='${SHELL} /home/rasmer/src/glib/2.14.0/glib-2.14.0/missing --run makeinfo'
MKINSTALLDIRS='./mkinstalldirs'
MSGFMT='/usr/bin/msgfmt'
MSGFMT_OPTS='-c'
MS_LIB_AVAILABLE_FALSE=''
MS_LIB_AVAILABLE_TRUE='#'
NM='/usr/bin/nm -B'
OBJDUMP='objdump'
OBJEXT='o'
OS_CARBON_FALSE=''
OS_CARBON_TRUE='#'
OS_LINUX_FALSE='#'
OS_LINUX_TRUE=''
OS_UNIX_FALSE='#'
OS_UNIX_TRUE=''
OS_WIN32_FALSE=''
OS_WIN32_TRUE='#'
PACKAGE='glib'
PACKAGE_BUGREPORT='http://bugzilla.gnome.org/enter_bug.cgi?product=glib'
PACKAGE_NAME='glib'
PACKAGE_STRING='glib 2.14.0'
PACKAGE_TARNAME='glib'
PACKAGE_VERSION='2.14.0'
PATH_SEPARATOR=':'
PCRE_CFLAGS=''
PCRE_LIBS=''
PCRE_WARN_CFLAGS=' -Wno-pointer-sign'
PERL='perl'
PERL_PATH='/usr/bin/perl'
PKG_CONFIG='/usr/bin/pkg-config'
PLATFORMDEP=''
PLATFORM_WIN32_FALSE=''
PLATFORM_WIN32_TRUE='#'
POFILES=' am.po ar.po as.po az.po be.po be@latin.po bg.po bn.po bn_IN.po bs.po ca.po cs.po cy.po da.po de.po dz.po el.po en_CA.po en_GB.po eo.po es.po et.po eu.po fa.po fi.po fr.po ga.po gl.po gu.po he.po hi.po hr.po hu.po hy.po id.po is.po it.po ja.po ka.po kn.po ko.po ku.po lt.po lv.po mg.po mk.po ml.po mn.po ms.po nb.po ne.po nl.po nn.po or.po pa.po pl.po pt.po pt_BR.po ro.po ru.po rw.po sk.po sl.po sq.po sr.po sr@Latn.po sr@ije.po sv.po ta.po te.po th.po tl.po tr.po tt.po uk.po vi.po wa.po xh.po yi.po zh_CN.po zh_HK.po zh_TW.po'
POSUB='po'
PO_IN_DATADIR_FALSE=''
PO_IN_DATADIR_TRUE=''
RANLIB='ranlib'
REBUILD=''
SET_MAKE=''
SHELL='/bin/bash'
STRIP='strip'
TESTGMODULE_EXP=''
USE_NLS='yes'
USE_SYSTEM_PCRE_FALSE=''
USE_SYSTEM_PCRE_TRUE='#'
VERSION='2.14.0'
WINDRES=''
XGETTEXT='/usr/bin/xgettext'
XMLCATALOG=''
XML_CATALOG_FILE=''
XSLTPROC=''
ac_ct_CC='gcc'
ac_ct_CXX=''
ac_ct_F77=''
am__fastdepCC_FALSE='#'
am__fastdepCC_TRUE=''
am__fastdepCXX_FALSE='#'
am__fastdepCXX_TRUE=''
am__include='include'
am__leading_dot='.'
am__quote=''
bindir='${exec_prefix}/bin'
build='i686-pc-linux-gnu'
build_alias=''
build_cpu='i686'
build_os='linux-gnu'
build_vendor='pc'
datadir='${datarootdir}'
datarootdir='${prefix}/share'
docdir='${datarootdir}/doc/${PACKAGE_TARNAME}'
dvidir='${docdir}'
exec_prefix='${prefix}'
host='i686-pc-linux-gnu'
host_alias=''
host_cpu='i686'
host_os='linux-gnu'
host_vendor='pc'
htmldir='${docdir}'
includedir='${prefix}/include'
infodir='${datarootdir}/info'
install_sh='/home/rasmer/src/glib/2.14.0/glib-2.14.0/install-sh'
libdir='${exec_prefix}/lib'
libexecdir='${exec_prefix}/libexec'
localedir='/usr/share/locale'
localstatedir='${prefix}/var'
mandir='${datarootdir}/man'
ms_librarian=''
oldincludedir='/usr/include'
pdfdir='${docdir}'
prefix='/usr'
program_transform_name='s,x,x,'
psdir='${docdir}'
sbindir='${exec_prefix}/sbin'
sharedstatedir='${prefix}/com'
sysconfdir='${prefix}/etc'
target_alias=''

## ----------- ##
## confdefs.h. ##
## ----------- ##

#define PACKAGE_NAME "glib"
#define PACKAGE_TARNAME "glib"
#define PACKAGE_VERSION "2.14.0"
#define PACKAGE_STRING "glib 2.14.0"
#define PACKAGE_BUGREPORT "http://bugzilla.gnome.org/enter_bug.cgi?product=glib"
#define GLIB_MAJOR_VERSION 2
#define GLIB_MINOR_VERSION 14
#define GLIB_MICRO_VERSION 0
#define GLIB_INTERFACE_AGE 0
#define GLIB_BINARY_AGE 1400
#define G_COMPILED_WITH_DEBUGGING "minimum"
#define _FILE_OFFSET_BITS 64
#define STDC_HEADERS 1
#define HAVE_SYS_TYPES_H 1
#define HAVE_SYS_STAT_H 1
#define HAVE_STDLIB_H 1
#define HAVE_STRING_H 1
#define HAVE_MEMORY_H 1
#define HAVE_STRINGS_H 1
#define HAVE_INTTYPES_H 1
#define HAVE_STDINT_H 1
#define HAVE_UNISTD_H 1
#define HAVE_LOCALE_H 1
#define HAVE_LC_MESSAGES 1
#define HAVE_BIND_TEXTDOMAIN_CODESET 1
#define HAVE_GETTEXT 1
#define HAVE_DCGETTEXT 1
#define ENABLE_NLS 1
#define GETTEXT_PACKAGE "glib20"
#define GLIB_LOCALE_DIR "/usr/share/locale"
#define HAVE_DLFCN_H 1
#define STDC_HEADERS 1
#define HAVE_VPRINTF 1
#define HAVE_STDLIB_H 1
#define HAVE_UNISTD_H 1
#define HAVE_GETPAGESIZE 1
#define HAVE_MMAP 1
#define HAVE_ALLOCA_H 1
#define HAVE_ALLOCA 1
#define HAVE_POSIX_MEMALIGN 1
#define HAVE_MEMALIGN 1
#define HAVE_VALLOC 1
#define HAVE_ATEXIT 1
#define HAVE_ON_EXIT 1
#define HAVE_TIMEGM 1
#define SIZEOF_CHAR 1
#define SIZEOF_SHORT 2
#define SIZEOF_LONG 4
#define SIZEOF_INT 4
#define SIZEOF_VOID_P 4
#define SIZEOF_LONG_LONG 8
#define SIZEOF___INT64 0
#define HAVE_LONG_LONG_FORMAT 1
#define SANE_MALLOC_PROTOS 1
#define G_HAVE___INLINE 1
#define G_HAVE___INLINE__ 1
#define G_HAVE_INLINE 1
#define HAVE_DOWHILE_MACROS 1
#define HAVE_DIRENT_H 1
#define HAVE_FLOAT_H 1
#define HAVE_LIMITS_H 1
#define HAVE_PWD_H 1
#define HAVE_SYS_PARAM_H 1
#define HAVE_SYS_POLL_H 1
#define HAVE_SYS_TIME_H 1
#define HAVE_SYS_TIMES_H 1
#define HAVE_SYS_WAIT_H 1
#define HAVE_UNISTD_H 1
#define HAVE_VALUES_H 1
#define HAVE_SYS_SELECT_H 1
#define HAVE_SYS_TYPES_H 1
#define HAVE_STDINT_H 1
#define HAVE_SCHED_H 1
#define HAVE_MALLOC_H 1
#define HAVE_LANGINFO_H 1
#define HAVE_NL_LANGINFO 1
#define HAVE_LANGINFO_CODESET 1
#define HAVE_STDDEF_H 1
#define HAVE_STDLIB_H 1
#define HAVE_STRING_H 1
#define HAVE_SETLOCALE 1
#define SIZEOF_SIZE_T 4
#define HAVE_LSTAT 1
#define HAVE_STRERROR 1
#define HAVE_STRSIGNAL 1
#define HAVE_MEMMOVE 1
#define HAVE_VSNPRINTF 1
#define HAVE_STPCPY 1
#define HAVE_STRCASECMP 1
#define HAVE_STRNCASECMP 1
#define HAVE_POLL 1
#define HAVE_GETCWD 1
#define HAVE_VASPRINTF 1
#define HAVE_SETENV 1
#define HAVE_UNSETENV 1
#define HAVE_GETC_UNLOCKED 1
#define HAVE_READLINK 1
#define HAVE_SYMLINK 1
#define HAVE_NANOSLEEP 1
#define HAVE_C99_VSNPRINTF 1
#define HAVE_UNIX98_PRINTF 1
#define HAVE_GOOD_PRINTF 1
#define HAVE_LONG_LONG 1
#define HAVE_LONG_DOUBLE 1
#define HAVE_WCHAR_T 1
#define HAVE_WINT_T 1
#define HAVE_PTRDIFF_T 1
#define HAVE_INTTYPES_H_WITH_UINTMAX 1
#define HAVE_STDINT_H_WITH_UINTMAX 1
#define HAVE_INTMAX_T 1
#define HAVE_SNPRINTF 1
#define HAVE_WCSLEN 1
#define HAVE_C99_SNPRINTF 1
#define REALLOC_0_WORKS 1
#define HAVE_CODESET 1
#define POSIX_MEMALIGN_WITH_COMPLIANT_ALLOCS 1
#define G_VA_COPY va_copy
#define HAVE_LOCALTIME_R 1
#define HAVE_POSIX_GETPWUID_R 1
#define GLIB_SIZEOF_SYSTEM_THREAD 4
#define HAVE_PTHREAD_ATTR_SETSTACKSIZE 1
#define POSIX_MIN_PRIORITY sched_get_priority_min(SCHED_OTHER)
#define POSIX_MAX_PRIORITY sched_get_priority_max(SCHED_OTHER)
#define POSIX_YIELD_FUNC sched_yield()
#define G_THREAD_SOURCE "gthread-posix.c"
#define GLIB_SIZEOF_GMUTEX 24
#define GLIB_BYTE_CONTENTS_GMUTEX 0,0,0,0,0,0,0,0,0,0,0,0,0,0,0,0,0,0,0,0,0,0,0,0
#define HAVE_CLOCK_GETTIME 1
#define HAVE_MONOTONIC_CLOCK 1
#define G_ATOMIC_I486 1

configure: exit 0

## ---------------------- ##
## Running config.status. ##
## ---------------------- ##