All pastes #754987 Raw Edit

Untitled

public text v1 · immutable
#754987 ·published 2007-10-30 11:11 UTC
rendered paste body
gcc-testing/gcc -I../../../llvm-gcc-testing/gcc/. -I../../../llvm-gcc-testing/gcc/../include -I../../../llvm-gcc-testing/gcc/../libcpp/include  -I/home/phire/hobbies/touch/llvm-svn/include -I/home/phire/hobbies/touch/llvm-svn/include  -DL_gcov_merge_add -c ../../../llvm-gcc-testing/gcc/libgcov.c -o libgcc/./_gcov_merge_add.o
cc1: RegisterScavenging.cpp:113: void llvm::RegScavenger::forward(): Assertion `false && "Using an undefined register!"' failed.
../../../llvm-gcc-testing/gcc/config/darwin-crt3.c:535: internal compiler error: Aborted
Please submit a full bug report,
with preprocessed source if appropriate.
See <URL:http://llvm.org/bugs> for instructions.
make[3]: *** [crt3.o] Error 1
make[3]: Leaving directory `/home/phire/hobbies/touch/iphone-dev/build/llvm-gcc-test/gcc'
make[2]: *** [extra] Error 2
make[2]: *** Waiting for unfinished jobs....
In file included from ../../../llvm-gcc-testing/gcc/gcov-io.h:239,
                 from ../../../llvm-gcc-testing/gcc/libgcov.c:51:
./auto-host.h:23:1: warning: "DEFAULT_USE_CXA_ATEXIT" redefined
In file included from ./tm.h:8,
                 from ../../../llvm-gcc-testing/gcc/libgcov.c:39:
../../../llvm-gcc-testing/gcc/defaults.h:712:1: warning: this is the location of the previous definition
In file included from ../../../llvm-gcc-testing/gcc/gcov-io.h:239,
                 from ../../../llvm-gcc-testing/gcc/libgcov.c:51:
./auto-host.h:257:1: warning: "HAVE_DECL_GETOPT" redefined
In file included from ../../../llvm-gcc-testing/gcc/libgcov.c:37:
../../../llvm-gcc-testing/gcc/tsystem.h:40:1: warning: this is the location of the previous definition
In file included from ../../../llvm-gcc-testing/gcc/gcov-io.h:239,
                 from ../../../llvm-gcc-testing/gcc/libgcov.c:51:
./auto-host.h:23:1: warning: "DEFAULT_USE_CXA_ATEXIT" redefined
In file included from ./tm.h:8,
                 from ../../../llvm-gcc-testing/gcc/libgcov.c:39:
../../../llvm-gcc-testing/gcc/defaults.h:712:1: warning: this is the location of the previous definition
In file included from ../../../llvm-gcc-testing/gcc/gcov-io.h:239,
                 from ../../../llvm-gcc-testing/gcc/libgcov.c:51:
./auto-host.h:257:1: warning: "HAVE_DECL_GETOPT" redefined
In file included from ../../../llvm-gcc-testing/gcc/libgcov.c:37:
../../../llvm-gcc-testing/gcc/tsystem.h:40:1: warning: this is the location of the previous definition
make[2]: Leaving directory `/home/phire/hobbies/touch/iphone-dev/build/llvm-gcc-test/gcc'
make[1]: *** [stmp-multilib] Error 2
rm cpp.pod gpl.pod fsf-funding.pod gcc.pod gcov.pod gfdl.pod
make[1]: Leaving directory `/home/phire/hobbies/touch/iphone-dev/build/llvm-gcc-test/gcc'
make: *** [all-gcc] Error 2