All pastes #754047 Raw Edit

Unbenannt

public text v1 · immutable
#754047 ·published 2007-10-29 19:03 UTC
rendered paste body
make[3]: Entering directory `/media/sda5/trunk/build_dir/i386/libcap-20070813'
make -C libcap CC='gcc' CFLAGS='-Os -pipe -funit-at-a-time' LD='ld' LIBS='-L/media/sda5/trunk/build_dir/i386/libcap-20070813/libcap -lcap' LDFLAGS='' VERSION='1' MINOR='99' LIBDIR='/lib' INCDIR='/usr/include' SBINDIR='/sbin' MANDIR='/usr/share/man' all
make[4]: Entering directory `/media/sda5/trunk/build_dir/i386/libcap-20070813/libcap'
=> making cap_names.c from <linux/capability.h>
gcc -Os -pipe -funit-at-a-time _makenames.c -o _makenames
./_makenames > cap_names.h
gcc -Os -pipe -funit-at-a-time -c cap_alloc.c -o cap_alloc.o
gcc -Os -pipe -funit-at-a-time -c cap_proc.c -o cap_proc.o
gcc -Os -pipe -funit-at-a-time -c cap_extint.c -o cap_extint.o
gcc -Os -pipe -funit-at-a-time -c cap_flag.c -o cap_flag.o
gcc -Os -pipe -funit-at-a-time -c cap_text.c -o cap_text.o
gcc -Os -pipe -funit-at-a-time -c cap_file.c -o cap_file.o
cap_file.c:21: warning: 'struct vfs_cap_data' declared inside parameter list
cap_file.c:21: warning: its scope is only this definition or declaration, which is probably not what you want
cap_file.c: In function '_fcaps_load':
cap_file.c:25: error: dereferencing pointer to incomplete type
cap_file.c:26: error: 'VFS_CAP_REVISION_MASK' undeclared (first use in this function)
cap_file.c:26: error: (Each undeclared identifier is reported only once
cap_file.c:26: error: for each function it appears in.)
cap_file.c:27: error: 'VFS_CAP_REVISION_1' undeclared (first use in this function)
cap_file.c:29: error: dereferencing pointer to incomplete type
cap_file.c:31: error: dereferencing pointer to incomplete type
cap_file.c:32: error: 'VFS_CAP_FLAGS_EFFECTIVE' undeclared (first use in this function)
cap_file.c: At top level:
cap_file.c:45: warning: 'struct vfs_cap_data' declared inside parameter list
cap_file.c: In function '_fcaps_save':
cap_file.c:55: error: dereferencing pointer to incomplete type
cap_file.c:55: error: 'VFS_CAP_REVISION' undeclared (first use in this function)
cap_file.c:61: error: dereferencing pointer to incomplete type
cap_file.c:62: error: 'VFS_CAP_FLAGS_EFFECTIVE' undeclared (first use in this function)
cap_file.c:65: error: dereferencing pointer to incomplete type
cap_file.c:66: error: dereferencing pointer to incomplete type
cap_file.c: In function 'cap_get_fd':
cap_file.c:83: error: storage size of 'rawvfscap' isn't known
cap_file.c:88: error: 'XATTR_NAME_CAPS' undeclared (first use in this function)
cap_file.c: In function 'cap_get_file':
cap_file.c:111: error: storage size of 'rawvfscap' isn't known
cap_file.c:116: error: 'XATTR_NAME_CAPS' undeclared (first use in this function)
cap_file.c: In function 'cap_set_fd':
cap_file.c:135: error: storage size of 'rawvfscap' isn't known
cap_file.c:139: error: 'XATTR_NAME_CAPS' undeclared (first use in this function)
cap_file.c: In function 'cap_set_file':
cap_file.c:156: error: storage size of 'rawvfscap' isn't known
cap_file.c:160: error: 'XATTR_NAME_CAPS' undeclared (first use in this function)
make[4]: *** [cap_file.o] Error 1
make[4]: Leaving directory `/media/sda5/trunk/build_dir/i386/libcap-20070813/libcap'
make[3]: *** [all] Error 2
make[3]: Leaving directory `/media/sda5/trunk/build_dir/i386/libcap-20070813'
make[2]: *** [/media/sda5/trunk/build_dir/i386/libcap-20070813/.built] Error 2
make[2]: Leaving directory `/media/sda5/trunk/feeds/https_svn.openwrt.org_openwrt_packages_/libs/libcap'
make[1]: *** [package/libs/libcap/compile] Error 2
make[1]: Leaving directory `/media/sda5/trunk'
make: *** [package/libs/libcap-compile] Fehler 2