All pastes #753837 Raw Edit

Mine

public text v1 · immutable
#753837 ·published 2007-10-29 16:20 UTC
rendered paste body
ow-menu.Tpo -c window-menu.c  -fPIC -DPIC -o .libs/libwnck_applet_la-window-menu.o
window-menu.c: In function 'window_menu_applet_fill':
window-menu.c:254: error: too many arguments to function 'wnck_selector_new'
make[3]: *** [libwnck_applet_la-window-menu.lo] Error 1
make[3]: Leaving directory `/var/tmp/portage/gnome-base/gnome-panel-2.18.3/work/gnome-panel-2.18.3/applets/wncklet'
make[2]: *** [all-recursive] Error 1
make[2]: Leaving directory `/var/tmp/portage/gnome-base/gnome-panel-2.18.3/work/gnome-panel-2.18.3/applets'
make[1]: *** [all-recursive] Error 1
make[1]: Leaving directory `/var/tmp/portage/gnome-base/gnome-panel-2.18.3/work/gnome-panel-2.18.3'
make: *** [all] Error 2
 *
 * ERROR: gnome-base/gnome-panel-2.18.3 failed.
 * Call stack:
 *       ebuild.sh, line 1695:  Called dyn_compile
 *       ebuild.sh, line 1033:  Called qa_call 'src_compile'
 *       ebuild.sh, line   44:  Called src_compile
 *       ebuild.sh, line 1377:  Called gnome2_src_compile
 *   gnome2.eclass, line   71:  Called die
 * The specific snippet of code:
 *      emake || die "compile failure"
 *  The die message:
 *   compile failure
 *
 * If you need support, post the topmost build error, and the call stack if relevant.
 * A complete build log is located at '/var/tmp/portage/gnome-base/gnome-panel-2.18.3/temp/build.log'.
 *

 * Messages for package gnome-base/gnome-panel-2.18.3:

 *
 * ERROR: gnome-base/gnome-panel-2.18.3 failed.
 * Call stack:
 *       ebuild.sh, line 1695:  Called dyn_compile
 *       ebuild.sh, line 1033:  Called qa_call 'src_compile'
 *       ebuild.sh, line   44:  Called src_compile
 *       ebuild.sh, line 1377:  Called gnome2_src_compile
 *   gnome2.eclass, line   71:  Called die
 * The specific snippet of code:
 *      emake || die "compile failure"
 *  The die message:
 *   compile failure
 *
 * If you need support, post the topmost build error, and the call stack if relevant.
 * A complete build log is located at '/var/tmp/portage/gnome-base/gnome-panel-2.18.3/temp/build.log'.
 *

revdep-rebuild failed to emerge all packages
you have the following choices:

- if emerge failed during the build, fix the problems and re-run revdep-rebuild
    or
- use -X or --package-names as first argument (trys to rebuild package, not exact
  ebuild)
    or
- set ACCEPT_KEYWORDS="~<your platform>" and/or /etc/portage/package.unmask
  (and remove /root/.revdep-rebuild.5_order to be evaluated again)
    or
- modify the above emerge command and run it manually
    or
- compile or unmerge unsatisfied packages manually, remove temporary files and
  try again (you can edit package/ebuild list first)