All pastes #753526 Raw Edit

Mine

public text v1 · immutable
#753526 ·published 2007-10-29 09:54 UTC
rendered paste body
There were 3 errors:

1) testPropPatchSetLiveProperty(ezcWebdavFileBackendTest)
ezcBasePropertyNotFoundException: No such property name 'mime'.
/home/derick/dev/ezcomponents/trunk/Webdav/src/transports/property_handler.php:507
/home/derick/dev/ezcomponents/trunk/Webdav/src/transports/property_handler.php:357
/home/derick/dev/ezcomponents/trunk/Webdav/src/backends/file.php:408
/home/derick/dev/ezcomponents/trunk/Webdav/src/backends/file.php:479
/home/derick/dev/ezcomponents/trunk/Webdav/src/backends/simple.php:631
/home/derick/dev/ezcomponents/trunk/Webdav/src/backends/file.php:937

2) testPropPatchFailOnRemoveProperty(ezcWebdavFileBackendTest)
ezcBasePropertyNotFoundException: No such property name 'mime'.
/home/derick/dev/ezcomponents/trunk/Webdav/src/transports/property_handler.php:507
/home/derick/dev/ezcomponents/trunk/Webdav/src/transports/property_handler.php:357
/home/derick/dev/ezcomponents/trunk/Webdav/src/backends/file.php:408
/home/derick/dev/ezcomponents/trunk/Webdav/src/backends/file.php:479
/home/derick/dev/ezcomponents/trunk/Webdav/src/backends/simple.php:631
/home/derick/dev/ezcomponents/trunk/Webdav/src/backends/file.php:937

3) testPropPatchCombinedSetDeleteFail(ezcWebdavFileBackendTest)
ezcBasePropertyNotFoundException: No such property name 'mime'.
/home/derick/dev/ezcomponents/trunk/Webdav/src/transports/property_handler.php:507
/home/derick/dev/ezcomponents/trunk/Webdav/src/transports/property_handler.php:357
/home/derick/dev/ezcomponents/trunk/Webdav/src/backends/file.php:408
/home/derick/dev/ezcomponents/trunk/Webdav/src/backends/file.php:479
/home/derick/dev/ezcomponents/trunk/Webdav/src/backends/simple.php:631
/home/derick/dev/ezcomponents/trunk/Webdav/src/backends/file.php:937

--

There were 2 failures:

1) propfind_allprop(ezcWebdavClientRfcTest)
Response sent by WebDAV server incorrect.
Failed asserting that two arrays are equal.
--- Expected
+++ Actual
@@ -26,24 +26,6 @@
         <R:author xmlns:R="http://www.foo.bar/boxschema/">
           <R:Name>Hadrian</R:Name>
         </R:author>
-        <D:supportedlock>
-          <D:lockentry>
-            <D:lockscope>
-              <D:exclusive/>
-            </D:lockscope>
-            <D:locktype>
-              <D:write/>
-            </D:locktype>
-          </D:lockentry>
-          <D:lockentry>
-            <D:lockscope>
-              <D:shared/>
-            </D:lockscope>
-            <D:locktype>
-              <D:read/>
-            </D:locktype>
-          </D:lockentry>
-        </D:supportedlock>
       </D:prop>
       <D:status>HTTP/1.1 200 OK</D:status>
     </D:propstat>
@@ -63,24 +45,6 @@
         <R:bigbox xmlns:R="http://www.foo.bar/boxschema/">
           <R:BoxType>Box type B</R:BoxType>
         </R:bigbox>
-        <D:supportedlock>
-          <D:lockentry>
-            <D:lockscope>
-              <D:exclusive/>
-            </D:lockscope>
-            <D:locktype>
-              <D:write/>
-            </D:locktype>
-          </D:lockentry>
-          <D:lockentry>
-            <D:lockscope>
-              <D:shared/>
-            </D:lockscope>
-            <D:locktype>
-              <D:read/>
-            </D:locktype>
-          </D:lockentry>
-        </D:supportedlock>
       </D:prop>
       <D:status>HTTP/1.1 200 OK</D:status>
     </D:propstat>


2) propfind_propname(ezcWebdavClientRfcTest)
Response sent by WebDAV server incorrect.
Failed asserting that two arrays are equal.
--- Expected
+++ Actual
@@ -20,7 +20,6 @@
         <D:getlastmodified/>
         <D:getcontentlength/>
         <D:resourcetype/>
-        <D:supportedlock/>
         <ezc00000:bigbox xmlns:ezc00000="http://www.foo.bar/boxschema/"/>
         <ezc00000:author xmlns:ezc00000="http://www.foo.bar/boxschema/"/>
       </D:prop>
@@ -39,7 +38,6 @@
         <D:getlastmodified/>
         <D:getcontentlength/>
         <D:resourcetype/>
-        <D:supportedlock/>
         <ezc00000:bigbox xmlns:ezc00000="http://www.foo.bar/boxschema/"/>
       </D:prop>
       <D:status>HTTP/1.1 200 OK</D:status>


FAILURES!
Tests: 1183, Failures: 2, Errors: 3.

Aborted: TESTS FAILED