All pastes #753224 Raw Edit

Something

public text v1 · immutable
#753224 ·published 2007-10-29 01:25 UTC
rendered paste body
Cbook:~ coreymon$ sudo port install gimp-app
--->  Building libglade2 with target all
Error: Target org.macports.build returned: shell command " cd "/opt/local/var/macports/build/_opt_local_var_macports_sources_rsync.macports.org_release_ports_gnome_libglade2/work/libglade-2.6.2" && make all " returned error 2
Command output: make  all-recursive
Making all in glade
/bin/sh ../libtool --tag=CC   --mode=link gcc  -O2 -Wall -std=c9x -version-info 0:7:0 -export-symbols-regex "^[^_].*" -no-undefined -L/opt/local/lib -o libglade-2.0.la -rpath /opt/local/lib glade-init.lo glade-xml.lo glade-parser.lo glade-gtk.lo -R/usr/X11/lib -L/opt/local/lib -L/usr/X11/lib -lxml2 -lpthread -lm -lgtk-x11-2.0 -lgdk-x11-2.0 -latk-1.0 -lgdk_pixbuf-2.0 -lpangocairo-1.0 -lpango-1.0 -lcairo -lSM -lICE -lgobject-2.0 -lgmodule-2.0 -lfreetype -lz -lfontconfig -lexpat -lpng12 -lXrender -lX11 -lglib-2.0 -lintl -liconv   
rm -fr  .libs/libglade-2.0.exp
generating symbol list for `libglade-2.0.la'
/usr/bin/nm -p  .libs/glade-init.o .libs/glade-xml.o .libs/glade-parser.o .libs/glade-gtk.o  | sed -n -e 's/^.*[ 	]\([BCDEGRST][BCDEGRST]*\)[ 	][ 	]*_\([_A-Za-z][_A-Za-z0-9]*\)$/\1 _\2 \2/p' | /usr/bin/sed 's/.* //' | sort | uniq > .libs/libglade-2.0.exp
/usr/bin/grep -E -e "^[^_].*" ".libs/libglade-2.0.exp" > ".libs/libglade-2.0.expT"
mv -f ".libs/libglade-2.0.expT" ".libs/libglade-2.0.exp"
sed -e "s,#.*,," -e "s,^[ ]*,," -e "s,^\(..*\),_&," < .libs/libglade-2.0.exp > .libs/libglade-2.0-symbols.expsym
gcc -dynamiclib  -o .libs/libglade-2.0.0.0.7.dylib  .libs/glade-init.o .libs/glade-xml.o .libs/glade-parser.o .libs/glade-gtk.o  -L/opt/local/lib -L/usr/X11/lib /opt/local/lib/libxml2.dylib /opt/local/lib/libz.dylib -lpthread -lm /opt/local/lib/libgtk-x11-2.0.dylib /opt/local/lib/libgdk-x11-2.0.dylib /opt/local/lib/libatk-1.0.dylib /opt/local/lib/libgdk_pixbuf-2.0.dylib /opt/local/lib/libtiff.dylib /opt/local/lib/libjpeg.dylib /opt/local/lib/libpangocairo-1.0.dylib /usr/X11/lib/libXau.6.0.0.dylib /usr/X11/lib/libXdmcp.6.0.0.dylib /opt/local/lib/libpangoft2-1.0.dylib /opt/local/lib/libpango-1.0.dylib /opt/local/lib/libcairo.dylib /usr/X11/lib/libSM.6.0.0.dylib /usr/X11/lib/libICE.6.3.0.dylib /opt/local/lib/libgobject-2.0.dylib /opt/local/lib/libgmodule-2.0.dylib /opt/local/lib/libfreetype.dylib -lz /opt/local/lib/libfontconfig.dylib /opt/local/lib/libexpat.dylib /opt/local/lib/libpng12.dylib /opt/local/lib/libXrender.dylib /usr/X11/lib/libX11.6.2.0.dylib /opt/local/lib/libglib-2.0.dylib /opt/local/lib/libintl.dylib /opt/local/lib/libiconv.dylib  -install_name  /opt/local/lib/libglade-2.0.0.dylib -Wl,-compatibility_version -Wl,1 -Wl,-current_version -Wl,1.7
ld: duplicate symbol _g_bit_nth_lsf in .libs/glade-xml.o and .libs/glade-init.o

collect2: ld returned 1 exit status
make[2]: *** [libglade-2.0.la] Error 1
make[1]: *** [all-recursive] Error 1
make: *** [all] Error 2

Error: The following dependencies failed to build: gimp2 libgnomeui libbonoboui libglade2 libgnome esound audiofile libgnomecanvas gail libgtkhtml libmng autoconf help2man p5-locale-gettext libtool m4 automake lcms librsvg libcroco libgsf libwmf poppler poppler-data py25-gtk py25-cairo py25-numeric python25 py25-gobject
Error: Status 1 encountered during processing.
Cbook:~ coreymon$