[ 35%] Building C object src/CMakeFiles/xmlformat-common.dir/xmlformat-common.o
/usr/bin/gcc -Dxmlformat_common_EXPORTS -O2 -g -fPIC -I/home/prahal/tmp/build/include/opensync-1.0 -I/usr/include/glib-2.0 -I/usr/lib/glib-2.0/include -I/usr/include/glib-2.0/glib -I/usr/include/glib-2.0/gobject -o src/CMakeFiles/xmlformat-common.dir/xmlformat-common.o -c /home/prahal/tmp/opensync/format-plugins/vformat/src/xmlformat-common.c
Dans le fichier inclus à partir de /home/prahal/tmp/opensync/format-plugins/vformat/src/xmlformat-common.h:33,
à partir de /home/prahal/tmp/opensync/format-plugins/vformat/src/xmlformat-common.c:24:
/home/prahal/tmp/build/include/opensync-1.0/opensync/opensync_xml.h:4:30: erreur: libxml/xmlmemory.h : Aucun fichier ou répertoire de ce type
/home/prahal/tmp/build/include/opensync-1.0/opensync/opensync_xml.h:5:27: erreur: libxml/parser.h : Aucun fichier ou répertoire de ce type
/home/prahal/tmp/build/include/opensync-1.0/opensync/opensync_xml.h:6:26: erreur: libxml/xpath.h : Aucun fichier ou répertoire de ce type
/home/prahal/tmp/build/include/opensync-1.0/opensync/opensync_xml.h:7:31: erreur: libxml/xmlschemas.h : Aucun fichier ou répertoire de ce type
In file included from /home/prahal/tmp/opensync/format-plugins/vformat/src/xmlformat-common.h:33,
from /home/prahal/tmp/opensync/format-plugins/vformat/src/xmlformat-common.c:24:
/home/prahal/tmp/build/include/opensync-1.0/opensync/opensync_xml.h:37: erreur: expected ‘=’, ‘,’, ‘;’, ‘asm’ or ‘__attribute__’ before ‘*’ token
/home/prahal/tmp/build/include/opensync-1.0/opensync/opensync_xml.h:38: erreur: expected ‘=’, ‘,’, ‘;’, ‘asm’ or ‘__attribute__’ before ‘*’ token
/home/prahal/tmp/build/include/opensync-1.0/opensync/opensync_xml.h:39: erreur: expected ‘=’, ‘,’, ‘;’, ‘asm’ or ‘__attribute__’ before ‘*’ token
/home/prahal/tmp/build/include/opensync-1.0/opensync/opensync_xml.h:41: erreur: expected ‘=’, ‘,’, ‘;’, ‘asm’ or ‘__attribute__’ before ‘*’ token
/home/prahal/tmp/build/include/opensync-1.0/opensync/opensync_xml.h:43: erreur: expected ‘=’, ‘,’, ‘;’, ‘asm’ or ‘__attribute__’ before ‘*’ token
/home/prahal/tmp/build/include/opensync-1.0/opensync/opensync_xml.h:44: erreur: expected ‘)’ before ‘*’ token
/home/prahal/tmp/build/include/opensync-1.0/opensync/opensync_xml.h:45: erreur: expected ‘)’ before ‘*’ token
/home/prahal/tmp/build/include/opensync-1.0/opensync/opensync_xml.h:46: erreur: expected ‘)’ before ‘*’ token
/home/prahal/tmp/build/include/opensync-1.0/opensync/opensync_xml.h:47: erreur: expected ‘)’ before ‘*’ token
/home/prahal/tmp/build/include/opensync-1.0/opensync/opensync_xml.h:48: erreur: expected ‘)’ before ‘*’ token
/home/prahal/tmp/build/include/opensync-1.0/opensync/opensync_xml.h:50: erreur: expected ‘)’ before ‘*’ token
/home/prahal/tmp/build/include/opensync-1.0/opensync/opensync_xml.h:51: erreur: expected ‘)’ before ‘*’ token
/home/prahal/tmp/build/include/opensync-1.0/opensync/opensync_xml.h:52: erreur: expected ‘)’ before ‘*’ token
/home/prahal/tmp/build/include/opensync-1.0/opensync/opensync_xml.h:54: erreur: expected ‘)’ before ‘*’ token
/home/prahal/tmp/build/include/opensync-1.0/opensync/opensync_xml.h:55: erreur: expected ‘=’, ‘,’, ‘;’, ‘asm’ or ‘__attribute__’ before ‘*’ token
/home/prahal/tmp/build/include/opensync-1.0/opensync/opensync_xml.h:56: erreur: expected ‘=’, ‘,’, ‘;’, ‘asm’ or ‘__attribute__’ before ‘*’ token
/home/prahal/tmp/build/include/opensync-1.0/opensync/opensync_xml.h:57: erreur: expected ‘)’ before ‘*’ token
/home/prahal/tmp/build/include/opensync-1.0/opensync/opensync_xml.h:58: erreur: expected ‘)’ before ‘*’ token
/home/prahal/tmp/build/include/opensync-1.0/opensync/opensync_xml.h:64: erreur: expected ‘)’ before ‘doc’
/home/prahal/tmp/build/include/opensync-1.0/opensync/opensync_xml.h:66: erreur: expected ‘=’, ‘,’, ‘;’, ‘asm’ or ‘__attribute__’ before ‘*’ token
/home/prahal/tmp/build/include/opensync-1.0/opensync/opensync_xml.h:67: erreur: expected ‘=’, ‘,’, ‘;’, ‘asm’ or ‘__attribute__’ before ‘*’ token
/home/prahal/tmp/opensync/format-plugins/vformat/src/xmlformat-common.c: In function ‘handle_xml_attribute_simple_content’:
/home/prahal/tmp/opensync/format-plugins/vformat/src/xmlformat-common.c:96: attention : incompatible implicit declaration of built-in function ‘abort’
/home/prahal/tmp/opensync/format-plugins/vformat/src/xmlformat-common.c:97: attention : incompatible implicit declaration of built-in function ‘abort’
/home/prahal/tmp/opensync/format-plugins/vformat/src/xmlformat-common.c:98: attention : incompatible implicit declaration of built-in function ‘abort’
/home/prahal/tmp/opensync/format-plugins/vformat/src/xmlformat-common.c: In function ‘add_value’:
/home/prahal/tmp/opensync/format-plugins/vformat/src/xmlformat-common.c:157: attention : incompatible implicit declaration of built-in function ‘abort’
/home/prahal/tmp/opensync/format-plugins/vformat/src/xmlformat-common.c:158: attention : incompatible implicit declaration of built-in function ‘abort’
make[2]: *** [src/CMakeFiles/xmlformat-common.dir/xmlformat-common.o] Erreur 1
make[2]: quittant le répertoire « /home/prahal/tmp/opensync/format-plugins/vformat/build »
make[1]: *** [src/CMakeFiles/xmlformat-common.dir/all] Erreur 2
make[1]: quittant le répertoire « /home/prahal/tmp/opensync/format-plugins/vformat/build »
make: *** [all] Erreur 2