All pastes #752687 Raw Edit

Stuff

public text v1 · immutable
#752687 ·published 2007-10-28 17:15 UTC
rendered paste body
 -I/usr/include/gtk-2.0 -I/usr/lib/gtk-2.0/include -I/usr/include/atk-1.0 -I/usr/include/cairo -I/usr/include/pango-1.0 -I/usr/include/glib-2.0 -I/usr/lib/glib-2.0/include -I/usr/include/freetype2 -I/usr/include/directfb -I/usr/include/libpng12   -DGTK_DISABLE_DEPRECATED -O2 -march=i686 -pipe -finline-functions -Wall -Winline -MT libquicktime_config.o -MD -MP -MF .deps/libquicktime_config.Tpo -c -o libquicktime_config.o libquicktime_config.c
In file included from libquicktime_config.c:7:
lqt_gtk.h:22: error: expected specifier-qualifier-list before 'GtkTooltips'
lqt_gtk.h:26: error: expected declaration specifiers or '...' before 'GtkTooltips'
lqt_gtk.h:48: error: expected specifier-qualifier-list before 'GtkTooltips'
make[3]: *** [libquicktime_config.o] Error 1
make[3]: *** Waiting for unfinished jobs....
In file included from lqt_gtk.c:7:
lqt_gtk.h:22: error: expected specifier-qualifier-list before 'GtkTooltips'
lqt_gtk.h:26: error: expected declaration specifiers or '...' before 'GtkTooltips'
lqt_gtk.h:48: error: expected specifier-qualifier-list before 'GtkTooltips'
lqt_gtk.c: In function 'set_combo_tooltip':
lqt_gtk.c:164: warning: implicit declaration of function 'gtk_tooltips_set_tip'
lqt_gtk.c:164: error: 'LqtGtkParameterWidget' has no member named 'tooltips'
lqt_gtk.c: At top level:
lqt_gtk.c:181: error: expected declaration specifiers or '...' before 'GtkTooltips'
lqt_gtk.c: In function 'lqtgtk_create_parameter_widget':
lqt_gtk.c:185: error: 'LqtGtkParameterWidget' has no member named 'tooltips'
lqt_gtk.c:185: error: 'tooltips' undeclared (first use in this function)
lqt_gtk.c:185: error: (Each undeclared identifier is reported only once
lqt_gtk.c:185: error: for each function it appears in.)
lqt_gtk.c:197: error: 'LqtGtkParameterWidget' has no member named 'tooltips'
lqt_gtk.c:216: error: 'LqtGtkParameterWidget' has no member named 'tooltips'
lqt_gtk.c:233: error: 'LqtGtkParameterWidget' has no member named 'tooltips'
lqt_gtk.c:260: error: 'LqtGtkParameterWidget' has no member named 'tooltips'
lqt_gtk.c:281: error: 'LqtGtkParameterWidget' has no member named 'tooltips'
lqt_gtk.c:289: error: 'LqtGtkParameterWidget' has no member named 'tooltips'
lqt_gtk.c: At top level:
lqt_gtk.c:343: error: expected declaration specifiers or '...' before 'GtkTooltips'
lqt_gtk.c: In function 'create_table':
lqt_gtk.c:358: error: 'tooltips' undeclared (first use in this function)
lqt_gtk.c:358: error: too many arguments to function 'lqtgtk_create_parameter_widget'
lqt_gtk.c: In function 'lqtgtk_create_codec_config_widget':
lqt_gtk.c:391: error: 'LqtGtkCodecConfigWidget' has no member named 'tooltips'
lqt_gtk.c:391: warning: implicit declaration of function 'gtk_tooltips_new'
lqt_gtk.c:392: error: 'LqtGtkCodecConfigWidget' has no member named 'tooltips'
lqt_gtk.c:393: warning: implicit declaration of function 'gtk_object_sink'
lqt_gtk.c:393: error: 'LqtGtkCodecConfigWidget' has no member named 'tooltips'
lqt_gtk.c:430: error: 'LqtGtkCodecConfigWidget' has no member named 'tooltips'
lqt_gtk.c:430: error: too many arguments to function 'create_table'
lqt_gtk.c:448: error: 'LqtGtkCodecConfigWidget' has no member named 'tooltips'
lqt_gtk.c:448: error: too many arguments to function 'create_table'
make[3]: *** [lqt_gtk.o] Error 1
make[3]: Leaving directory `/var/tmp/portage/media-libs/libquicktime-0.9.10/work/libquicktime-0.9.10/utils/gtk'
make[2]: *** [all-recursive] Error 1
make[2]: Leaving directory `/var/tmp/portage/media-libs/libquicktime-0.9.10/work/libquicktime-0.9.10/utils'
make[1]: *** [all-recursive] Error 1
make[1]: Leaving directory `/var/tmp/portage/media-libs/libquicktime-0.9.10/work/libquicktime-0.9.10'
make: *** [all] Error 2
 * 
 * ERROR: media-libs/libquicktime-0.9.10 failed.
 * Call stack:
 *                    ebuild.sh, line 1695:  Called dyn_compile
 *                    ebuild.sh, line 1033:  Called qa_call 'src_compile'
 *                    ebuild.sh, line   44:  Called src_compile
 *   libquicktime-0.9.10.ebuild, line   93:  Called die
 * The specific snippet of code:
 *   	emake || die "emake failed"
 *  The die message:
 *   emake failed
 * 
 * If you need support, post the topmost build error, and the call stack if relevant.
 * A complete build log is located at '/var/tmp/portage/media-libs/libquicktime-0.9.10/temp/build.log'.
 *