All pastes #752605 Raw Edit

Something

public text v1 · immutable
#752605 ·published 2007-10-28 15:41 UTC
rendered paste body
make[2]: Entering directory `/targets/SDK_BETA_ARMEL/mnt/shared/repos/svn/llvm/llvm-project/llvm-gcc-4.2/trunk/build'
Configuring stage 2 in ./intl
configure: creating cache ./config.cache
checking whether make sets $(MAKE)... yes
checking for a BSD-compatible install... /scratchbox/tools/bin/install -c
checking whether NLS is requested... yes
checking for msgfmt... /scratchbox/tools/bin/msgfmt
checking for gmsgfmt... /scratchbox/tools/bin/msgfmt
checking for xgettext... /scratchbox/tools/bin/xgettext
checking for msgmerge... /scratchbox/tools/bin/msgmerge
checking for arm-unknown-linux-gnu-gcc...  /mnt/shared/repos/svn/llvm/llvm-project/llvm-gcc-4.2/trunk/build/./prev-gcc/xgcc -B/mnt/shared/repos/svn/llvm/llvm-project/llvm-gcc-4.2/trunk/build/./prev-gcc/ -B/mnt/shared/repos/svn/llvm/llvm-project/llvm-gcc-4.2/trunk/install//arm-unknown-linux-gnu/bin/
checking for C compiler default output file name... configure: error: C compiler cannot create executables
See `config.log' for more details.
make[2]: *** [configure-stage2-intl] Error 77
make[2]: Leaving directory `/targets/SDK_BETA_ARMEL/mnt/shared/repos/svn/llvm/llvm-project/llvm-gcc-4.2/trunk/build'
make[1]: *** [stage2-bubble] Error 2
make[1]: Leaving directory `/targets/SDK_BETA_ARMEL/mnt/shared/repos/svn/llvm/llvm-project/llvm-gcc-4.2/trunk/build'
make: *** [all] Error 2

[sbox-SDK_BETA_ARMEL: /mnt/shared/repos/svn/llvm/llvm-project/llvm-gcc-4.2/trunk/build] > tail config.log
configure:7078: checking where to find the target ld
configure:7111: checking where to find the target lipo
configure:7134: checking where to find the target nm
configure:7167: checking where to find the target objdump
configure:7200: checking where to find the target ranlib
configure:7233: checking where to find the target strip
configure:7266: checking where to find the target windres
configure:7327: checking whether to enable maintainer-specific portions of Makefiles
configure:7376: checking whether -fkeep-inline-functions is supported
configure:7391: gcc -c -g -O2 -fkeep-inline-functions  conftest.c 1>&5