All pastes #752459 Raw Edit

Miscellany

public text v1 · immutable
#752459 ·published 2007-10-28 13:17 UTC
rendered paste body
WARNING: Documentation in template file for gdk_keymap_get_direction being overridden by inline comments
100% symbol docs coverage (854 symbols documented, 0 symbols incomplete, 1 not documented)
See gdk-undocumented.txt for a list of missing docs.
The doc coverage percentage doesn't include intro sections.
touch sgml-build.stamp
gtk-doc: Building HTML
rm -rf ./html
mkdir ./html
cd ./html && gtkdoc-mkhtml gdk ../gdk-docs.sgml
../xml/threads.xml:444: parser error : Opening and ending tag mismatch: programlisting line 439 and para
</para>
       ^
../xml/threads.xml:474: parser error : Opening and ending tag mismatch: para line 465 and programlisting
</programlisting></informalexample></para>
                 ^
../xml/threads.xml:611: parser error : chunk is not well balanced

^
../gdk-docs.sgml:78: parser error : Failure to process entity gdk-Threads
    &gdk-Threads;
                 ^
../gdk-docs.sgml:78: parser error : Entity 'gdk-Threads' not defined
    &gdk-Threads;
                 ^
unable to parse ../gdk-docs.sgml
make[4]: *** [html-build.stamp] Error 6
make[4]: Leaving directory `/var/tmp/portage/x11-libs/gtk+-2.12.1/work/gtk+-2.12.1/docs/reference/gdk'
make[3]: *** [all-recursive] Error 1
make[3]: Leaving directory `/var/tmp/portage/x11-libs/gtk+-2.12.1/work/gtk+-2.12.1/docs/reference'
make[2]: *** [all-recursive] Error 1
make[2]: Leaving directory `/var/tmp/portage/x11-libs/gtk+-2.12.1/work/gtk+-2.12.1/docs'
make[1]: *** [all-recursive] Error 1
make[1]: Leaving directory `/var/tmp/portage/x11-libs/gtk+-2.12.1/work/gtk+-2.12.1'
make: *** [all] Error 2
 ^[[31;01m*^[[0m
 ^[[31;01m*^[[0m ERROR: x11-libs/gtk+-2.12.1 failed.
 ^[[31;01m*^[[0m Call stack:
 ^[[31;01m*^[[0m            ebuild.sh, line 1695:  Called dyn_compile
 ^[[31;01m*^[[0m            ebuild.sh, line 1033:  Called qa_call 'src_compile'
 ^[[31;01m*^[[0m            ebuild.sh, line   44:  Called src_compile
 ^[[31;01m*^[[0m   gtk+-2.12.1.ebuild, line  110:  Called die
 ^[[31;01m*^[[0m The specific snippet of code:
 ^[[31;01m*^[[0m        emake || die "compile failed"
 ^[[31;01m*^[[0m  The die message:
 ^[[31;01m*^[[0m   compile failed
 ^[[31;01m*^[[0m
 ^[[31;01m*^[[0m If you need support, post the topmost build error, and the call stack if relevant.
 ^[[31;01m*^[[0m A complete build log is located at '/var/tmp/portage/x11-libs/gtk+-2.12.1/temp/build.log'.
 ^[[31;01m*^[[0m