All pastes #751743 Raw Edit

Meins

public text v1 · immutable
#751743 ·published 2007-10-27 17:54 UTC
rendered paste body
This file contains any messages produced by compilers while
running configure, to aid debugging if configure makes a mistake.

It was created by gnucash configure 2.2.1, which was
generated by GNU Autoconf 2.61.  Invocation command line was

  $ ./configure 

## --------- ##
## Platform. ##
## --------- ##

hostname = administrator
uname -m = i686
uname -r = 2.6.22-14-generic
uname -s = Linux
uname -v = #1 SMP Sun Oct 14 23:05:12 GMT 2007

/usr/bin/uname -p = unknown
/bin/uname -X     = unknown

/bin/arch              = unknown
/usr/bin/arch -k       = unknown
/usr/convex/getsysinfo = unknown
/usr/bin/hostinfo      = unknown
/bin/machine           = unknown
/usr/bin/oslevel       = unknown
/bin/universe          = unknown

PATH: /usr/local/sbin
PATH: /usr/local/bin
PATH: /usr/sbin
PATH: /usr/bin
PATH: /sbin
PATH: /bin
PATH: /usr/games


## ----------- ##
## Core tests. ##
## ----------- ##

configure:2197: checking for a BSD-compatible install
configure:2253: result: /usr/bin/install -c
configure:2264: checking whether build environment is sane
configure:2307: result: yes
configure:2372: checking for gawk
configure:2388: found /usr/bin/gawk
configure:2399: result: gawk
configure:2410: checking whether make sets $(MAKE)
configure:2431: result: yes
configure:2683: checking for gcc
configure:2699: found /usr/bin/gcc
configure:2710: result: gcc
configure:2948: checking for C compiler version
configure:2955: gcc --version >&5
gcc (GCC) 4.1.3 20070929 (prerelease) (Ubuntu 4.1.2-16ubuntu2)
Copyright (C) 2006 Free Software Foundation, Inc.
This is free software; see the source for copying conditions.  There is NO
warranty; not even for MERCHANTABILITY or FITNESS FOR A PARTICULAR PURPOSE.

configure:2958: $? = 0
configure:2965: gcc -v >&5
Using built-in specs.
Target: i486-linux-gnu
Configured with: ../src/configure -v --enable-languages=c,c++,fortran,objc,obj-c++,treelang --prefix=/usr --enable-shared --with-system-zlib --libexecdir=/usr/lib --without-included-gettext --enable-threads=posix --enable-nls --with-gxx-include-dir=/usr/include/c++/4.1.3 --program-suffix=-4.1 --enable-__cxa_atexit --enable-clocale=gnu --enable-libstdcxx-debug --enable-mpfr --enable-checking=release i486-linux-gnu
Thread model: posix
gcc version 4.1.3 20070929 (prerelease) (Ubuntu 4.1.2-16ubuntu2)
configure:2968: $? = 0
configure:2975: gcc -V >&5
gcc: '-V' option must have argument
configure:2978: $? = 1
configure:3001: checking for C compiler default output file name
configure:3028: gcc    conftest.c  >&5
configure:3031: $? = 0
configure:3069: result: a.out
configure:3086: checking whether the C compiler works
configure:3096: ./a.out
configure:3099: $? = 0
configure:3116: result: yes
configure:3123: checking whether we are cross compiling
configure:3125: result: no
configure:3128: checking for suffix of executables
configure:3135: gcc -o conftest    conftest.c  >&5
configure:3138: $? = 0
configure:3162: result: 
configure:3168: checking for suffix of object files
configure:3194: gcc -c   conftest.c >&5
configure:3197: $? = 0
configure:3220: result: o
configure:3224: checking whether we are using the GNU C compiler
configure:3253: gcc -c   conftest.c >&5
configure:3259: $? = 0
configure:3276: result: yes
configure:3281: checking whether gcc accepts -g
configure:3311: gcc -c -g  conftest.c >&5
configure:3317: $? = 0
configure:3416: result: yes
configure:3433: checking for gcc option to accept ISO C89
configure:3507: gcc  -c -g -O2  conftest.c >&5
configure:3513: $? = 0
configure:3536: result: none needed
configure:3565: checking for style of include used by make
configure:3593: result: GNU
configure:3621: checking dependency style of gcc
configure:3711: result: gcc3
configure:3812: checking for perl
configure:3830: found /usr/bin/perl
configure:3842: result: /usr/bin/perl
configure:3861: checking for XML::Parser
configure:3864: result: ok
configure:3901: gcc -o conftest -g -O2   conftest.c  >&5
configure:3907: $? = 0
configure:4042: result: Using config source xml:merged:/etc/gconf/gconf.xml.defaults for schema installation
configure:4057: result: Using $(sysconfdir)/gconf/schemas as install directory for schema files
configure:4126: checking how to run the C preprocessor
configure:4166: gcc -E  conftest.c
configure:4172: $? = 0
configure:4203: gcc -E  conftest.c
conftest.c:15:28: error: ac_nonexistent.h: No such file or directory
configure:4209: $? = 1
configure: failed program was:
| /* confdefs.h.  */
| #define PACKAGE_NAME "gnucash"
| #define PACKAGE_TARNAME "gnucash"
| #define PACKAGE_VERSION "2.2.1"
| #define PACKAGE_STRING "gnucash 2.2.1"
| #define PACKAGE_BUGREPORT "gnucash-devel@gnucash.org"
| #define PACKAGE "gnucash"
| #define VERSION "2.2.1"
| #define _GNU_SOURCE 1
| #define GNUCASH_MAJOR_VERSION 2
| #define GNUCASH_MINOR_VERSION 2
| #define GNUCASH_MICRO_VERSION 1
| #define GETTEXT_PACKAGE "gnucash"
| /* end confdefs.h.  */
| #include <ac_nonexistent.h>
configure:4242: result: gcc -E
configure:4271: gcc -E  conftest.c
configure:4277: $? = 0
configure:4308: gcc -E  conftest.c
conftest.c:15:28: error: ac_nonexistent.h: No such file or directory
configure:4314: $? = 1
configure: failed program was:
| /* confdefs.h.  */
| #define PACKAGE_NAME "gnucash"
| #define PACKAGE_TARNAME "gnucash"
| #define PACKAGE_VERSION "2.2.1"
| #define PACKAGE_STRING "gnucash 2.2.1"
| #define PACKAGE_BUGREPORT "gnucash-devel@gnucash.org"
| #define PACKAGE "gnucash"
| #define VERSION "2.2.1"
| #define _GNU_SOURCE 1
| #define GNUCASH_MAJOR_VERSION 2
| #define GNUCASH_MINOR_VERSION 2
| #define GNUCASH_MICRO_VERSION 1
| #define GETTEXT_PACKAGE "gnucash"
| /* end confdefs.h.  */
| #include <ac_nonexistent.h>
configure:4352: checking for grep that handles long lines and -e
configure:4426: result: /bin/grep
configure:4431: checking for egrep
configure:4509: result: /bin/grep -E
configure:4514: checking for ANSI C header files
configure:4544: gcc -c -g -O2  conftest.c >&5
configure:4550: $? = 0
configure:4649: gcc -o conftest -g -O2   conftest.c  >&5
configure:4652: $? = 0
configure:4658: ./conftest
configure:4661: $? = 0
configure:4678: result: yes
configure:4702: checking for sys/types.h
configure:4723: gcc -c -g -O2  conftest.c >&5
configure:4729: $? = 0
configure:4745: result: yes
configure:4702: checking for sys/stat.h
configure:4723: gcc -c -g -O2  conftest.c >&5
configure:4729: $? = 0
configure:4745: result: yes
configure:4702: checking for stdlib.h
configure:4723: gcc -c -g -O2  conftest.c >&5
configure:4729: $? = 0
configure:4745: result: yes
configure:4702: checking for string.h
configure:4723: gcc -c -g -O2  conftest.c >&5
configure:4729: $? = 0
configure:4745: result: yes
configure:4702: checking for memory.h
configure:4723: gcc -c -g -O2  conftest.c >&5
configure:4729: $? = 0
configure:4745: result: yes
configure:4702: checking for strings.h
configure:4723: gcc -c -g -O2  conftest.c >&5
configure:4729: $? = 0
configure:4745: result: yes
configure:4702: checking for inttypes.h
configure:4723: gcc -c -g -O2  conftest.c >&5
configure:4729: $? = 0
configure:4745: result: yes
configure:4702: checking for stdint.h
configure:4723: gcc -c -g -O2  conftest.c >&5
configure:4729: $? = 0
configure:4745: result: yes
configure:4702: checking for unistd.h
configure:4723: gcc -c -g -O2  conftest.c >&5
configure:4729: $? = 0
configure:4745: result: yes
configure:4763: checking build system type
configure:4781: result: i686-pc-linux-gnu
configure:4803: checking host system type
configure:4818: result: i686-pc-linux-gnu
configure:4856: checking locale.h usability
configure:4873: gcc -c -g -O2  conftest.c >&5
configure:4879: $? = 0
configure:4893: result: yes
configure:4897: checking locale.h presence
configure:4912: gcc -E  conftest.c
configure:4918: $? = 0
configure:4932: result: yes
configure:4965: checking for locale.h
configure:4973: result: yes
configure:4987: checking for LC_MESSAGES
configure:5013: gcc -o conftest -g -O2   conftest.c  >&5
configure:5019: $? = 0
configure:5036: result: yes
configure:5065: checking libintl.h usability
configure:5082: gcc -c -g -O2  conftest.c >&5
configure:5088: $? = 0
configure:5102: result: yes
configure:5106: checking libintl.h presence
configure:5121: gcc -E  conftest.c
configure:5127: $? = 0
configure:5141: result: yes
configure:5174: checking for libintl.h
configure:5181: result: yes
configure:5192: checking for ngettext in libc
configure:5220: gcc -o conftest -g -O2   conftest.c  >&5
configure:5226: $? = 0
configure:5244: result: yes
configure:5248: checking for dgettext in libc
configure:5276: gcc -o conftest -g -O2   conftest.c  >&5
configure:5282: $? = 0
configure:5300: result: yes
configure:5309: checking for bind_textdomain_codeset
configure:5365: gcc -o conftest -g -O2   conftest.c  >&5
configure:5371: $? = 0
configure:5389: result: yes
configure:5876: checking for msgfmt
configure:5903: result: /usr/bin/msgfmt
configure:5916: checking for dcgettext
configure:5972: gcc -o conftest -g -O2   conftest.c   >&5
conftest.c:52: warning: conflicting types for built-in function 'dcgettext'
configure:5978: $? = 0
configure:5996: result: yes
configure:6007: checking if msgfmt accepts -c
configure:6022: $MSGFMT -c -o /dev/null conftest.foo
configure:6025: $? = 0
configure:6027: result: yes
configure:6037: checking for gmsgfmt
configure:6068: result: /usr/bin/msgfmt
configure:6078: checking for xgettext
configure:6105: result: /usr/bin/xgettext
configure:6134: gcc -o conftest -g -O2   conftest.c   >&5
configure:6140: $? = 0
configure:6309: checking for catalogs to be installed
configure:6334: result:  ca cs da de el en_GB es_NI es eu fr hu it ja nb ne nl pl pt_BR pt ro ru rw sk sv ta tr uk zh_CN zh_TW
configure:6386: checking for a BSD-compatible install
configure:6442: result: /usr/bin/install -c
configure:6529: checking for a sed that does not truncate output
configure:6585: result: /bin/sed
configure:6599: checking for ld used by gcc
configure:6666: result: /usr/bin/ld
configure:6675: checking if the linker (/usr/bin/ld) is GNU ld
configure:6690: result: yes
configure:6695: checking for /usr/bin/ld option to reload object files
configure:6702: result: -r
configure:6720: checking for BSD-compatible nm
configure:6769: result: /usr/bin/nm -B
configure:6773: checking whether ln -s works
configure:6777: result: yes
configure:6784: checking how to recognize dependent libraries
configure:6970: result: pass_all
configure:7220: checking dlfcn.h usability
configure:7237: gcc -c -g -O2  conftest.c >&5
configure:7243: $? = 0
configure:7257: result: yes
configure:7261: checking dlfcn.h presence
configure:7276: gcc -E  conftest.c
configure:7282: $? = 0
configure:7296: result: yes
configure:7329: checking for dlfcn.h
configure:7337: result: yes
configure:7408: checking for g++
configure:7424: found /usr/bin/g++
configure:7435: result: g++
configure:7466: checking for C++ compiler version
configure:7473: g++ --version >&5
g++ (GCC) 4.1.3 20070929 (prerelease) (Ubuntu 4.1.2-16ubuntu2)
Copyright (C) 2006 Free Software Foundation, Inc.
This is free software; see the source for copying conditions.  There is NO
warranty; not even for MERCHANTABILITY or FITNESS FOR A PARTICULAR PURPOSE.

configure:7476: $? = 0
configure:7483: g++ -v >&5
Using built-in specs.
Target: i486-linux-gnu
Configured with: ../src/configure -v --enable-languages=c,c++,fortran,objc,obj-c++,treelang --prefix=/usr --enable-shared --with-system-zlib --libexecdir=/usr/lib --without-included-gettext --enable-threads=posix --enable-nls --with-gxx-include-dir=/usr/include/c++/4.1.3 --program-suffix=-4.1 --enable-__cxa_atexit --enable-clocale=gnu --enable-libstdcxx-debug --enable-mpfr --enable-checking=release i486-linux-gnu
Thread model: posix
gcc version 4.1.3 20070929 (prerelease) (Ubuntu 4.1.2-16ubuntu2)
configure:7486: $? = 0
configure:7493: g++ -V >&5
g++: '-V' option must have argument
configure:7496: $? = 1
configure:7499: checking whether we are using the GNU C++ compiler
configure:7528: g++ -c   conftest.cpp >&5
configure:7534: $? = 0
configure:7551: result: yes
configure:7556: checking whether g++ accepts -g
configure:7586: g++ -c -g  conftest.cpp >&5
configure:7592: $? = 0
configure:7691: result: yes
configure:7716: checking dependency style of g++
configure:7806: result: gcc3
configure:7833: checking how to run the C++ preprocessor
configure:7869: g++ -E  conftest.cpp
configure:7875: $? = 0
configure:7906: g++ -E  conftest.cpp
conftest.cpp:32:28: error: ac_nonexistent.h: No such file or directory
configure:7912: $? = 1
configure: failed program was:
| /* confdefs.h.  */
| #define PACKAGE_NAME "gnucash"
| #define PACKAGE_TARNAME "gnucash"
| #define PACKAGE_VERSION "2.2.1"
| #define PACKAGE_STRING "gnucash 2.2.1"
| #define PACKAGE_BUGREPORT "gnucash-devel@gnucash.org"
| #define PACKAGE "gnucash"
| #define VERSION "2.2.1"
| #define _GNU_SOURCE 1
| #define GNUCASH_MAJOR_VERSION 2
| #define GNUCASH_MINOR_VERSION 2
| #define GNUCASH_MICRO_VERSION 1
| #define GETTEXT_PACKAGE "gnucash"
| #define STDC_HEADERS 1
| #define HAVE_SYS_TYPES_H 1
| #define HAVE_SYS_STAT_H 1
| #define HAVE_STDLIB_H 1
| #define HAVE_STRING_H 1
| #define HAVE_MEMORY_H 1
| #define HAVE_STRINGS_H 1
| #define HAVE_INTTYPES_H 1
| #define HAVE_STDINT_H 1
| #define HAVE_UNISTD_H 1
| #define HAVE_LOCALE_H 1
| #define HAVE_LC_MESSAGES 1
| #define HAVE_BIND_TEXTDOMAIN_CODESET 1
| #define HAVE_GETTEXT 1
| #define HAVE_DCGETTEXT 1
| #define ENABLE_NLS 1
| #define HAVE_DLFCN_H 1
| /* end confdefs.h.  */
| #include <ac_nonexistent.h>
configure:7945: result: g++ -E
configure:7974: g++ -E  conftest.cpp
configure:7980: $? = 0
configure:8011: g++ -E  conftest.cpp
conftest.cpp:32:28: error: ac_nonexistent.h: No such file or directory
configure:8017: $? = 1
configure: failed program was:
| /* confdefs.h.  */
| #define PACKAGE_NAME "gnucash"
| #define PACKAGE_TARNAME "gnucash"
| #define PACKAGE_VERSION "2.2.1"
| #define PACKAGE_STRING "gnucash 2.2.1"
| #define PACKAGE_BUGREPORT "gnucash-devel@gnucash.org"
| #define PACKAGE "gnucash"
| #define VERSION "2.2.1"
| #define _GNU_SOURCE 1
| #define GNUCASH_MAJOR_VERSION 2
| #define GNUCASH_MINOR_VERSION 2
| #define GNUCASH_MICRO_VERSION 1
| #define GETTEXT_PACKAGE "gnucash"
| #define STDC_HEADERS 1
| #define HAVE_SYS_TYPES_H 1
| #define HAVE_SYS_STAT_H 1
| #define HAVE_STDLIB_H 1
| #define HAVE_STRING_H 1
| #define HAVE_MEMORY_H 1
| #define HAVE_STRINGS_H 1
| #define HAVE_INTTYPES_H 1
| #define HAVE_STDINT_H 1
| #define HAVE_UNISTD_H 1
| #define HAVE_LOCALE_H 1
| #define HAVE_LC_MESSAGES 1
| #define HAVE_BIND_TEXTDOMAIN_CODESET 1
| #define HAVE_GETTEXT 1
| #define HAVE_DCGETTEXT 1
| #define ENABLE_NLS 1
| #define HAVE_DLFCN_H 1
| /* end confdefs.h.  */
| #include <ac_nonexistent.h>
configure:8110: checking for g77
configure:8140: result: no
configure:8110: checking for xlf
configure:8140: result: no
configure:8110: checking for f77
configure:8140: result: no
configure:8110: checking for frt
configure:8140: result: no
configure:8110: checking for pgf77
configure:8140: result: no
configure:8110: checking for cf77
configure:8140: result: no
configure:8110: checking for fort77
configure:8140: result: no
configure:8110: checking for fl32
configure:8140: result: no
configure:8110: checking for af77
configure:8140: result: no
configure:8110: checking for xlf90
configure:8140: result: no
configure:8110: checking for f90
configure:8140: result: no
configure:8110: checking for pgf90
configure:8140: result: no
configure:8110: checking for pghpf
configure:8140: result: no
configure:8110: checking for epcf90
configure:8140: result: no
configure:8110: checking for gfortran
configure:8140: result: no
configure:8110: checking for g95
configure:8140: result: no
configure:8110: checking for xlf95
configure:8140: result: no
configure:8110: checking for f95
configure:8140: result: no
configure:8110: checking for fort
configure:8140: result: no
configure:8110: checking for ifort
configure:8140: result: no
configure:8110: checking for ifc
configure:8140: result: no
configure:8110: checking for efc
configure:8140: result: no
configure:8110: checking for pgf95
configure:8140: result: no
configure:8110: checking for lf95
configure:8140: result: no
configure:8110: checking for ftn
configure:8140: result: no
configure:8167: checking for Fortran 77 compiler version
configure:8174:  --version >&5
./configure: line 8175: --version: command not found
configure:8177: $? = 127
configure:8184:  -v >&5
./configure: line 8185: -v: command not found
configure:8187: $? = 127
configure:8194:  -V >&5
./configure: line 8195: -V: command not found
configure:8197: $? = 127
configure:8205: checking whether we are using the GNU Fortran 77 compiler
configure:8224:  -c  conftest.F >&5
./configure: line 8225: -c: command not found
configure:8230: $? = 127
configure: failed program was:
|       program main
| #ifndef __GNUC__
|        choke me
| #endif
| 
|       end
configure:8247: result: no
configure:8253: checking whether  accepts -g
configure:8270:  -c -g conftest.f >&5
./configure: line 8271: -c: command not found
configure:8276: $? = 127
configure: failed program was:
|       program main
| 
|       end
configure:8292: result: no
configure:8322: checking the maximum length of command line arguments
configure:8434: result: 98304
configure:8446: checking command to parse /usr/bin/nm -B output from gcc object
configure:8551: gcc -c -g -O2  conftest.c >&5
configure:8554: $? = 0
configure:8558: /usr/bin/nm -B conftest.o \| sed -n -e 's/^.*[ 	]\([ABCDGIRSTW][ABCDGIRSTW]*\)[ 	][ 	]*\([_A-Za-z][_A-Za-z0-9]*\)$/\1 \2 \2/p' \> conftest.nm
configure:8561: $? = 0
configure:8613: gcc -o conftest -g -O2   conftest.c conftstm.o >&5
configure:8616: $? = 0
configure:8654: result: ok
configure:8658: checking for objdir
configure:8673: result: .libs
configure:8765: checking for ar
configure:8781: found /usr/bin/ar
configure:8792: result: ar
configure:8861: checking for ranlib
configure:8877: found /usr/bin/ranlib
configure:8888: result: ranlib
configure:8957: checking for strip
configure:8973: found /usr/bin/strip
configure:8984: result: strip
configure:9270: checking if gcc supports -fno-rtti -fno-exceptions
configure:9288: gcc -c -g -O2  -fno-rtti -fno-exceptions conftest.c >&5
cc1: warning: command line option "-fno-rtti" is valid for C++/ObjC++ but not for C
configure:9292: $? = 0
configure:9305: result: no
configure:9320: checking for gcc option to produce PIC
configure:9552: result: -fPIC
configure:9560: checking if gcc PIC flag -fPIC works
configure:9578: gcc -c -g -O2  -fPIC -DPIC conftest.c >&5
configure:9582: $? = 0
configure:9595: result: yes
configure:9623: checking if gcc static flag -static works
configure:9651: result: yes
configure:9661: checking if gcc supports -c -o file.o
configure:9682: gcc -c -g -O2  -o out/conftest2.o conftest.c >&5
configure:9686: $? = 0
configure:9708: result: yes
configure:9734: checking whether the gcc linker (/usr/bin/ld) supports shared libraries
configure:10715: result: yes
configure:10736: checking whether -lc should be explicitly linked in
configure:10741: gcc -c -g -O2  conftest.c >&5
configure:10744: $? = 0
configure:10759: gcc -shared conftest.o  -v -Wl,-soname -Wl,conftest -o conftest 2\>\&1 \| grep  -lc  \>/dev/null 2\>\&1
configure:10762: $? = 0
configure:10774: result: no
configure:10782: checking dynamic linker characteristics
configure:11396: result: GNU/Linux ld.so
configure:11405: checking how to hardcode library paths into programs
configure:11430: result: immediate
configure:11444: checking whether stripping libraries is possible
configure:11449: result: yes
configure:11573: checking for shl_load
configure:11629: gcc -o conftest -g -O2   conftest.c  >&5
/tmp/ccaHvIeZ.o: In function `main':
/home/administrator/development/gnucash/trunk/conftest.c:66: undefined reference to `shl_load'
collect2: ld returned 1 exit status
configure:11635: $? = 1
configure: failed program was:
| /* confdefs.h.  */
| #define PACKAGE_NAME "gnucash"
| #define PACKAGE_TARNAME "gnucash"
| #define PACKAGE_VERSION "2.2.1"
| #define PACKAGE_STRING "gnucash 2.2.1"
| #define PACKAGE_BUGREPORT "gnucash-devel@gnucash.org"
| #define PACKAGE "gnucash"
| #define VERSION "2.2.1"
| #define _GNU_SOURCE 1
| #define GNUCASH_MAJOR_VERSION 2
| #define GNUCASH_MINOR_VERSION 2
| #define GNUCASH_MICRO_VERSION 1
| #define GETTEXT_PACKAGE "gnucash"
| #define STDC_HEADERS 1
| #define HAVE_SYS_TYPES_H 1
| #define HAVE_SYS_STAT_H 1
| #define HAVE_STDLIB_H 1
| #define HAVE_STRING_H 1
| #define HAVE_MEMORY_H 1
| #define HAVE_STRINGS_H 1
| #define HAVE_INTTYPES_H 1
| #define HAVE_STDINT_H 1
| #define HAVE_UNISTD_H 1
| #define HAVE_LOCALE_H 1
| #define HAVE_LC_MESSAGES 1
| #define HAVE_BIND_TEXTDOMAIN_CODESET 1
| #define HAVE_GETTEXT 1
| #define HAVE_DCGETTEXT 1
| #define ENABLE_NLS 1
| #define HAVE_DLFCN_H 1
| /* end confdefs.h.  */
| /* Define shl_load to an innocuous variant, in case <limits.h> declares shl_load.
|    For example, HP-UX 11i <limits.h> declares gettimeofday.  */
| #define shl_load innocuous_shl_load
| 
| /* System header to define __stub macros and hopefully few prototypes,
|     which can conflict with char shl_load (); below.
|     Prefer <limits.h> to <assert.h> if __STDC__ is defined, since
|     <limits.h> exists even on freestanding compilers.  */
| 
| #ifdef __STDC__
| # include <limits.h>
| #else
| # include <assert.h>
| #endif
| 
| #undef shl_load
| 
| /* Override any GCC internal prototype to avoid an error.
|    Use char because int might match the return type of a GCC
|    builtin and then its argument prototype would still apply.  */
| #ifdef __cplusplus
| extern "C"
| #endif
| char shl_load ();
| /* The GNU C library defines this for functions which it implements
|     to always fail with ENOSYS.  Some functions are actually named
|     something starting with __ and the normal name is an alias.  */
| #if defined __stub_shl_load || defined __stub___shl_load
| choke me
| #endif
| 
| int
| main ()
| {
| return shl_load ();
|   ;
|   return 0;
| }
configure:11652: result: no
configure:11657: checking for shl_load in -ldld
configure:11692: gcc -o conftest -g -O2   conftest.c -ldld   >&5
/usr/bin/ld: cannot find -ldld
collect2: ld returned 1 exit status
configure:11698: $? = 1
configure: failed program was:
| /* confdefs.h.  */
| #define PACKAGE_NAME "gnucash"
| #define PACKAGE_TARNAME "gnucash"
| #define PACKAGE_VERSION "2.2.1"
| #define PACKAGE_STRING "gnucash 2.2.1"
| #define PACKAGE_BUGREPORT "gnucash-devel@gnucash.org"
| #define PACKAGE "gnucash"
| #define VERSION "2.2.1"
| #define _GNU_SOURCE 1
| #define GNUCASH_MAJOR_VERSION 2
| #define GNUCASH_MINOR_VERSION 2
| #define GNUCASH_MICRO_VERSION 1
| #define GETTEXT_PACKAGE "gnucash"
| #define STDC_HEADERS 1
| #define HAVE_SYS_TYPES_H 1
| #define HAVE_SYS_STAT_H 1
| #define HAVE_STDLIB_H 1
| #define HAVE_STRING_H 1
| #define HAVE_MEMORY_H 1
| #define HAVE_STRINGS_H 1
| #define HAVE_INTTYPES_H 1
| #define HAVE_STDINT_H 1
| #define HAVE_UNISTD_H 1
| #define HAVE_LOCALE_H 1
| #define HAVE_LC_MESSAGES 1
| #define HAVE_BIND_TEXTDOMAIN_CODESET 1
| #define HAVE_GETTEXT 1
| #define HAVE_DCGETTEXT 1
| #define ENABLE_NLS 1
| #define HAVE_DLFCN_H 1
| /* end confdefs.h.  */
| 
| /* Override any GCC internal prototype to avoid an error.
|    Use char because int might match the return type of a GCC
|    builtin and then its argument prototype would still apply.  */
| #ifdef __cplusplus
| extern "C"
| #endif
| char shl_load ();
| int
| main ()
| {
| return shl_load ();
|   ;
|   return 0;
| }
configure:11716: result: no
configure:11721: checking for dlopen
configure:11777: gcc -o conftest -g -O2   conftest.c  >&5
/tmp/ccOIvEfl.o: In function `main':
/home/administrator/development/gnucash/trunk/conftest.c:66: undefined reference to `dlopen'
collect2: ld returned 1 exit status
configure:11783: $? = 1
configure: failed program was:
| /* confdefs.h.  */
| #define PACKAGE_NAME "gnucash"
| #define PACKAGE_TARNAME "gnucash"
| #define PACKAGE_VERSION "2.2.1"
| #define PACKAGE_STRING "gnucash 2.2.1"
| #define PACKAGE_BUGREPORT "gnucash-devel@gnucash.org"
| #define PACKAGE "gnucash"
| #define VERSION "2.2.1"
| #define _GNU_SOURCE 1
| #define GNUCASH_MAJOR_VERSION 2
| #define GNUCASH_MINOR_VERSION 2
| #define GNUCASH_MICRO_VERSION 1
| #define GETTEXT_PACKAGE "gnucash"
| #define STDC_HEADERS 1
| #define HAVE_SYS_TYPES_H 1
| #define HAVE_SYS_STAT_H 1
| #define HAVE_STDLIB_H 1
| #define HAVE_STRING_H 1
| #define HAVE_MEMORY_H 1
| #define HAVE_STRINGS_H 1
| #define HAVE_INTTYPES_H 1
| #define HAVE_STDINT_H 1
| #define HAVE_UNISTD_H 1
| #define HAVE_LOCALE_H 1
| #define HAVE_LC_MESSAGES 1
| #define HAVE_BIND_TEXTDOMAIN_CODESET 1
| #define HAVE_GETTEXT 1
| #define HAVE_DCGETTEXT 1
| #define ENABLE_NLS 1
| #define HAVE_DLFCN_H 1
| /* end confdefs.h.  */
| /* Define dlopen to an innocuous variant, in case <limits.h> declares dlopen.
|    For example, HP-UX 11i <limits.h> declares gettimeofday.  */
| #define dlopen innocuous_dlopen
| 
| /* System header to define __stub macros and hopefully few prototypes,
|     which can conflict with char dlopen (); below.
|     Prefer <limits.h> to <assert.h> if __STDC__ is defined, since
|     <limits.h> exists even on freestanding compilers.  */
| 
| #ifdef __STDC__
| # include <limits.h>
| #else
| # include <assert.h>
| #endif
| 
| #undef dlopen
| 
| /* Override any GCC internal prototype to avoid an error.
|    Use char because int might match the return type of a GCC
|    builtin and then its argument prototype would still apply.  */
| #ifdef __cplusplus
| extern "C"
| #endif
| char dlopen ();
| /* The GNU C library defines this for functions which it implements
|     to always fail with ENOSYS.  Some functions are actually named
|     something starting with __ and the normal name is an alias.  */
| #if defined __stub_dlopen || defined __stub___dlopen
| choke me
| #endif
| 
| int
| main ()
| {
| return dlopen ();
|   ;
|   return 0;
| }
configure:11800: result: no
configure:11805: checking for dlopen in -ldl
configure:11840: gcc -o conftest -g -O2   conftest.c -ldl   >&5
configure:11846: $? = 0
configure:11864: result: yes
configure:12033: checking whether a program can dlopen itself
configure:12107: gcc -o conftest -g -O2  -DHAVE_DLFCN_H  -Wl,--export-dynamic conftest.c -ldl  >&5
configure: In function 'main':
configure:12103: warning: incompatible implicit declaration of built-in function 'exit'
configure:12110: $? = 0
configure:12128: result: yes
configure:12133: checking whether a statically linked program can dlopen itself
configure:12207: gcc -o conftest -g -O2  -DHAVE_DLFCN_H  -Wl,--export-dynamic -static conftest.c -ldl  >&5
configure: In function 'main':
configure:12203: warning: incompatible implicit declaration of built-in function 'exit'
/tmp/ccaZNviO.o: In function `main':
/home/administrator/development/gnucash/trunk/configure:12191: warning: Using 'dlopen' in statically linked applications requires at runtime the shared libraries from the glibc version used for linking
configure:12210: $? = 0
/lib/: cannot read file data: Is a directory
configure:12228: result: no
configure:12251: checking if libtool supports shared libraries
configure:12253: result: yes
configure:12256: checking whether to build shared libraries
configure:12277: result: yes
configure:12280: checking whether to build static libraries
configure:12284: result: no
configure:12377: creating libtool
configure:12965: checking for ld used by g++
configure:13032: result: /usr/bin/ld
configure:13041: checking if the linker (/usr/bin/ld) is GNU ld
configure:13056: result: yes
configure:13107: checking whether the g++ linker (/usr/bin/ld) supports shared libraries
configure:14081: result: yes
configure:14099: g++ -c -g -O2  conftest.cpp >&5
configure:14102: $? = 0
configure:14254: checking for g++ option to produce PIC
configure:14538: result: -fPIC
configure:14546: checking if g++ PIC flag -fPIC works
configure:14564: g++ -c -g -O2  -fPIC -DPIC conftest.cpp >&5
configure:14568: $? = 0
configure:14581: result: yes
configure:14609: checking if g++ static flag -static works
configure:14637: result: yes
configure:14647: checking if g++ supports -c -o file.o
configure:14668: g++ -c -g -O2  -o out/conftest2.o conftest.cpp >&5
configure:14672: $? = 0
configure:14694: result: yes
configure:14720: checking whether the g++ linker (/usr/bin/ld) supports shared libraries
configure:14748: result: yes
configure:14815: checking dynamic linker characteristics
configure:15377: result: GNU/Linux ld.so
configure:15386: checking how to hardcode library paths into programs
configure:15411: result: immediate
configure:21611: checking for library containing strerror
configure:21652: gcc -o conftest -g -O2   conftest.c  >&5
configure:21658: $? = 0
configure:21686: result: none required
configure:21694: checking whether byte ordering is bigendian
configure:21727: gcc -c -g -O2  conftest.c >&5
configure:21733: $? = 0
configure:21765: gcc -c -g -O2  conftest.c >&5
conftest.c: In function 'main':
conftest.c:39: error: 'not' undeclared (first use in this function)
conftest.c:39: error: (Each undeclared identifier is reported only once
conftest.c:39: error: for each function it appears in.)
conftest.c:39: error: expected ';' before 'big'
configure:21771: $? = 1
configure: failed program was:
| /* confdefs.h.  */
| #define PACKAGE_NAME "gnucash"
| #define PACKAGE_TARNAME "gnucash"
| #define PACKAGE_VERSION "2.2.1"
| #define PACKAGE_STRING "gnucash 2.2.1"
| #define PACKAGE_BUGREPORT "gnucash-devel@gnucash.org"
| #define PACKAGE "gnucash"
| #define VERSION "2.2.1"
| #define _GNU_SOURCE 1
| #define GNUCASH_MAJOR_VERSION 2
| #define GNUCASH_MINOR_VERSION 2
| #define GNUCASH_MICRO_VERSION 1
| #define GETTEXT_PACKAGE "gnucash"
| #define STDC_HEADERS 1
| #define HAVE_SYS_TYPES_H 1
| #define HAVE_SYS_STAT_H 1
| #define HAVE_STDLIB_H 1
| #define HAVE_STRING_H 1
| #define HAVE_MEMORY_H 1
| #define HAVE_STRINGS_H 1
| #define HAVE_INTTYPES_H 1
| #define HAVE_STDINT_H 1
| #define HAVE_UNISTD_H 1
| #define HAVE_LOCALE_H 1
| #define HAVE_LC_MESSAGES 1
| #define HAVE_BIND_TEXTDOMAIN_CODESET 1
| #define HAVE_GETTEXT 1
| #define HAVE_DCGETTEXT 1
| #define ENABLE_NLS 1
| #define HAVE_DLFCN_H 1
| /* end confdefs.h.  */
| #include <sys/types.h>
| #include <sys/param.h>
| 
| int
| main ()
| {
| #if BYTE_ORDER != BIG_ENDIAN
|  not big endian
| #endif
| 
|   ;
|   return 0;
| }
configure:21911: result: no
configure:21930: checking whether make sets $(MAKE)
configure:21951: result: yes
configure:21960: checking whether ln -s works
configure:21964: result: yes
configure:21971: checking for ANSI C header files
configure:22135: result: yes
configure:22163: checking limits.h usability
configure:22180: gcc -c -g -O2  conftest.c >&5
configure:22186: $? = 0
configure:22200: result: yes
configure:22204: checking limits.h presence
configure:22219: gcc -E  conftest.c
configure:22225: $? = 0
configure:22239: result: yes
configure:22272: checking for limits.h
configure:22280: result: yes
configure:22163: checking sys/times.h usability
configure:22180: gcc -c -g -O2  conftest.c >&5
configure:22186: $? = 0
configure:22200: result: yes
configure:22204: checking sys/times.h presence
configure:22219: gcc -E  conftest.c
configure:22225: $? = 0
configure:22239: result: yes
configure:22272: checking for sys/times.h
configure:22280: result: yes
configure:22163: checking sys/wait.h usability
configure:22180: gcc -c -g -O2  conftest.c >&5
configure:22186: $? = 0
configure:22200: result: yes
configure:22204: checking sys/wait.h presence
configure:22219: gcc -E  conftest.c
configure:22225: $? = 0
configure:22239: result: yes
configure:22272: checking for sys/wait.h
configure:22280: result: yes
configure:22300: checking for stpcpy
configure:22356: gcc -o conftest -g -O2   conftest.c  >&5
conftest.c:59: warning: conflicting types for built-in function 'stpcpy'
configure:22362: $? = 0
configure:22380: result: yes
configure:22300: checking for memcpy
configure:22356: gcc -o conftest -g -O2   conftest.c  >&5
conftest.c:60: warning: conflicting types for built-in function 'memcpy'
configure:22362: $? = 0
configure:22380: result: yes
configure:22300: checking for timegm
configure:22356: gcc -o conftest -g -O2   conftest.c  >&5
configure:22362: $? = 0
configure:22380: result: yes
configure:22300: checking for towupper
configure:22356: gcc -o conftest -g -O2   conftest.c  >&5
conftest.c:62: warning: conflicting types for built-in function 'towupper'
configure:22362: $? = 0
configure:22380: result: yes
configure:22394: checking for setenv
configure:22450: gcc -o conftest -g -O2   conftest.c  >&5
configure:22456: $? = 0
configure:22474: result: yes
configure:22591: checking for native Win32
configure:22601: result: no
configure:22614: checking for Win32 platform in general
configure:22624: result: no
configure:22712: checking for the tm_gmtoff member of struct tm
configure:22743: gcc -o conftest -g -O2   conftest.c  >&5
conftest.c:43:1: warning: "_GNU_SOURCE" redefined
conftest.c:9:1: warning: this is the location of the previous definition
configure:22749: $? = 0
configure:22767: result: yes
configure:22778: checking if scanf supports %lld conversions
configure:22830: gcc -o conftest -g -O2   conftest.c  >&5
configure:22833: $? = 0
configure:22839: ./conftest
configure:22842: $? = 0
configure:22858: result: yes
configure:23071: checking for swig
configure:23089: found /usr/bin/swig
configure:23101: result: /usr/bin/swig
configure:23115: checking for SWIG version
configure:23118: result: 1.3.31
configure:23161: SWIG executable is '/usr/bin/swig'
configure:23302: checking X11/Xlib.h usability
configure:23319: gcc -c -g -O2  conftest.c >&5
configure:23325: $? = 0
configure:23339: result: yes
configure:23343: checking X11/Xlib.h presence
configure:23358: gcc -E  conftest.c
configure:23364: $? = 0
configure:23378: result: yes
configure:23411: checking for X11/Xlib.h
configure:23419: result: yes
configure:23302: checking glob.h usability
configure:23319: gcc -c -g -O2  conftest.c >&5
configure:23325: $? = 0
configure:23339: result: yes
configure:23343: checking glob.h presence
configure:23358: gcc -E  conftest.c
configure:23364: $? = 0
configure:23378: result: yes
configure:23411: checking for glob.h
configure:23419: result: yes
configure:23441: checking for chown
configure:23497: gcc -o conftest -g -O2   conftest.c  >&5
configure:23503: $? = 0
configure:23521: result: yes
configure:23441: checking for gethostname
configure:23497: gcc -o conftest -g -O2   conftest.c  >&5
configure:23503: $? = 0
configure:23521: result: yes
configure:23441: checking for getppid
configure:23497: gcc -o conftest -g -O2   conftest.c  >&5
configure:23503: $? = 0
configure:23521: result: yes
configure:23441: checking for getuid
configure:23497: gcc -o conftest -g -O2   conftest.c  >&5
configure:23503: $? = 0
configure:23521: result: yes
configure:23441: checking for gettimeofday
configure:23497: gcc -o conftest -g -O2   conftest.c  >&5
configure:23503: $? = 0
configure:23521: result: yes
configure:23441: checking for gmtime_r
configure:23497: gcc -o conftest -g -O2   conftest.c  >&5
configure:23503: $? = 0
configure:23521: result: yes
configure:23536: checking for gethostid
configure:23592: gcc -o conftest -g -O2   conftest.c  >&5
configure:23598: $? = 0
configure:23616: result: yes
configure:23536: checking for link
configure:23592: gcc -o conftest -g -O2   conftest.c  >&5
configure:23598: $? = 0
configure:23616: result: yes
configure:23648: checking for /proc/self/maps
configure:23663: result: yes
configure:23666: checking whether everything is installed to the same prefix
configure:23684: result: yes
configure:23687: checking whether binary relocation support should be enabled
configure:23705: result: yes
configure:23717: checking for pthread_getspecific in -lpthread
configure:23752: gcc -o conftest -g -O2   conftest.c -lpthread   >&5
configure:23758: $? = 0
configure:23776: result: yes
configure:23789: checking whether binary relocation should use threads
configure:23804: result: yes
configure:23832: checking for pkg-config
configure:23850: found /usr/bin/pkg-config
configure:23862: result: /usr/bin/pkg-config
configure:24057: checking pkg-config is at least version 0.7
configure:24060: result: yes
configure:24078: checking for GLIB - version >= 2.6.0
configure:24202: gcc -o conftest -g -O2 -pthread -I/usr/include/glib-2.0 -I/usr/lib/glib-2.0/include     conftest.c -pthread -Wl,--export-dynamic -lgthread-2.0 -lrt -lgobject-2.0 -lgmodule-2.0 -ldl -lglib-2.0   -lpthread  >&5
configure:24205: $? = 0
configure:24211: ./conftest
configure:24214: $? = 0
configure:24234: result: yes (version 2.14.1)
configure:24341: checking for GLIB - version >= 2.8.0
configure:24345: result: yes
configure:24378: checking for GLIB - version >= 2.9.0
configure:24382: result: yes
configure:24395: checking for GLIB - version >= 2.12.0
configure:24399: result: yes
configure:24422: checking for untested GLIB versions (glib >= 2.13.0)
configure:24426: result: yes
configure:24445: checking for dlfcn.h
configure:24451: result: yes
configure:24455: checking dl.h usability
configure:24472: gcc -c -g -O2  conftest.c >&5
conftest.c:93:16: error: dl.h: No such file or directory
configure:24478: $? = 1
configure: failed program was:
| /* confdefs.h.  */
| #define PACKAGE_NAME "gnucash"
| #define PACKAGE_TARNAME "gnucash"
| #define PACKAGE_VERSION "2.2.1"
| #define PACKAGE_STRING "gnucash 2.2.1"
| #define PACKAGE_BUGREPORT "gnucash-devel@gnucash.org"
| #define PACKAGE "gnucash"
| #define VERSION "2.2.1"
| #define _GNU_SOURCE 1
| #define GNUCASH_MAJOR_VERSION 2
| #define GNUCASH_MINOR_VERSION 2
| #define GNUCASH_MICRO_VERSION 1
| #define GETTEXT_PACKAGE "gnucash"
| #define STDC_HEADERS 1
| #define HAVE_SYS_TYPES_H 1
| #define HAVE_SYS_STAT_H 1
| #define HAVE_STDLIB_H 1
| #define HAVE_STRING_H 1
| #define HAVE_MEMORY_H 1
| #define HAVE_STRINGS_H 1
| #define HAVE_INTTYPES_H 1
| #define HAVE_STDINT_H 1
| #define HAVE_UNISTD_H 1
| #define HAVE_LOCALE_H 1
| #define HAVE_LC_MESSAGES 1
| #define HAVE_BIND_TEXTDOMAIN_CODESET 1
| #define HAVE_GETTEXT 1
| #define HAVE_DCGETTEXT 1
| #define ENABLE_NLS 1
| #define HAVE_DLFCN_H 1
| #define STDC_HEADERS 1
| #define HAVE_LIMITS_H 1
| #define HAVE_SYS_TIMES_H 1
| #define HAVE_SYS_WAIT_H 1
| #define HAVE_STPCPY 1
| #define HAVE_MEMCPY 1
| #define HAVE_TIMEGM 1
| #define HAVE_TOWUPPER 1
| #define HAVE_SETENV 1
| #define HAVE_STRUCT_TM_GMTOFF 1
| #define HAVE_SCANF_LLD 1
| #define HAVE_X11_XLIB_H 1
| #define HAVE_GLOB_H 1
| #define HAVE_CHOWN 1
| #define HAVE_GETHOSTNAME 1
| #define HAVE_GETPPID 1
| #define HAVE_GETUID 1
| #define HAVE_GETTIMEOFDAY 1
| #define HAVE_GMTIME_R 1
| #define HAVE_GETHOSTID 1
| #define HAVE_LINK 1
| #define ENABLE_BINRELOC
| #define HAVE_LIBPTHREAD 1
| #define BR_PTHREAD 1
| #define HAVE_GLIB_2_8 1
| #define HAVE_GLIB29 1
| #define HAVE_GLIB_2_12 1
| #define HAVE_DLFCN_H 1
| /* end confdefs.h.  */
| #include <stdio.h>
| #ifdef HAVE_SYS_TYPES_H
| # include <sys/types.h>
| #endif
| #ifdef HAVE_SYS_STAT_H
| # include <sys/stat.h>
| #endif
| #ifdef STDC_HEADERS
| # include <stdlib.h>
| # include <stddef.h>
| #else
| # ifdef HAVE_STDLIB_H
| #  include <stdlib.h>
| # endif
| #endif
| #ifdef HAVE_STRING_H
| # if !defined STDC_HEADERS && defined HAVE_MEMORY_H
| #  include <memory.h>
| # endif
| # include <string.h>
| #endif
| #ifdef HAVE_STRINGS_H
| # include <strings.h>
| #endif
| #ifdef HAVE_INTTYPES_H
| # include <inttypes.h>
| #endif
| #ifdef HAVE_STDINT_H
| # include <stdint.h>
| #endif
| #ifdef HAVE_UNISTD_H
| # include <unistd.h>
| #endif
| #include <dl.h>
configure:24492: result: no
configure:24496: checking dl.h presence
configure:24511: gcc -E  conftest.c
conftest.c:60:16: error: dl.h: No such file or directory
configure:24517: $? = 1
configure: failed program was:
| /* confdefs.h.  */
| #define PACKAGE_NAME "gnucash"
| #define PACKAGE_TARNAME "gnucash"
| #define PACKAGE_VERSION "2.2.1"
| #define PACKAGE_STRING "gnucash 2.2.1"
| #define PACKAGE_BUGREPORT "gnucash-devel@gnucash.org"
| #define PACKAGE "gnucash"
| #define VERSION "2.2.1"
| #define _GNU_SOURCE 1
| #define GNUCASH_MAJOR_VERSION 2
| #define GNUCASH_MINOR_VERSION 2
| #define GNUCASH_MICRO_VERSION 1
| #define GETTEXT_PACKAGE "gnucash"
| #define STDC_HEADERS 1
| #define HAVE_SYS_TYPES_H 1
| #define HAVE_SYS_STAT_H 1
| #define HAVE_STDLIB_H 1
| #define HAVE_STRING_H 1
| #define HAVE_MEMORY_H 1
| #define HAVE_STRINGS_H 1
| #define HAVE_INTTYPES_H 1
| #define HAVE_STDINT_H 1
| #define HAVE_UNISTD_H 1
| #define HAVE_LOCALE_H 1
| #define HAVE_LC_MESSAGES 1
| #define HAVE_BIND_TEXTDOMAIN_CODESET 1
| #define HAVE_GETTEXT 1
| #define HAVE_DCGETTEXT 1
| #define ENABLE_NLS 1
| #define HAVE_DLFCN_H 1
| #define STDC_HEADERS 1
| #define HAVE_LIMITS_H 1
| #define HAVE_SYS_TIMES_H 1
| #define HAVE_SYS_WAIT_H 1
| #define HAVE_STPCPY 1
| #define HAVE_MEMCPY 1
| #define HAVE_TIMEGM 1
| #define HAVE_TOWUPPER 1
| #define HAVE_SETENV 1
| #define HAVE_STRUCT_TM_GMTOFF 1
| #define HAVE_SCANF_LLD 1
| #define HAVE_X11_XLIB_H 1
| #define HAVE_GLOB_H 1
| #define HAVE_CHOWN 1
| #define HAVE_GETHOSTNAME 1
| #define HAVE_GETPPID 1
| #define HAVE_GETUID 1
| #define HAVE_GETTIMEOFDAY 1
| #define HAVE_GMTIME_R 1
| #define HAVE_GETHOSTID 1
| #define HAVE_LINK 1
| #define ENABLE_BINRELOC
| #define HAVE_LIBPTHREAD 1
| #define BR_PTHREAD 1
| #define HAVE_GLIB_2_8 1
| #define HAVE_GLIB29 1
| #define HAVE_GLIB_2_12 1
| #define HAVE_DLFCN_H 1
| /* end confdefs.h.  */
| #include <dl.h>
configure:24531: result: no
configure:24564: checking for dl.h
configure:24572: result: no
configure:24455: checking utmp.h usability
configure:24472: gcc -c -g -O2  conftest.c >&5
configure:24478: $? = 0
configure:24492: result: yes
configure:24496: checking utmp.h presence
configure:24511: gcc -E  conftest.c
configure:24517: $? = 0
configure:24531: result: yes
configure:24564: checking for utmp.h
configure:24572: result: yes
configure:24445: checking for locale.h
configure:24451: result: yes
configure:24455: checking mcheck.h usability
configure:24472: gcc -c -g -O2  conftest.c >&5
configure:24478: $? = 0
configure:24492: result: yes
configure:24496: checking mcheck.h presence
configure:24511: gcc -E  conftest.c
configure:24517: $? = 0
configure:24531: result: yes
configure:24564: checking for mcheck.h
configure:24572: result: yes
configure:24445: checking for unistd.h
configure:24451: result: yes
configure:24455: checking wctype.h usability
configure:24472: gcc -c -g -O2  conftest.c >&5
configure:24478: $? = 0
configure:24492: result: yes
configure:24496: checking wctype.h presence
configure:24511: gcc -E  conftest.c
configure:24517: $? = 0
configure:24531: result: yes
configure:24564: checking for wctype.h
configure:24572: result: yes
configure:24593: checking for dlsym
configure:24649: gcc -o conftest -g -O2   conftest.c -lpthread  >&5
/tmp/ccurTU6T.o: In function `main':
/home/administrator/development/gnucash/trunk/conftest.c:99: undefined reference to `dlsym'
collect2: ld returned 1 exit status
configure:24655: $? = 1
configure: failed program was:
| /* confdefs.h.  */
| #define PACKAGE_NAME "gnucash"
| #define PACKAGE_TARNAME "gnucash"
| #define PACKAGE_VERSION "2.2.1"
| #define PACKAGE_STRING "gnucash 2.2.1"
| #define PACKAGE_BUGREPORT "gnucash-devel@gnucash.org"
| #define PACKAGE "gnucash"
| #define VERSION "2.2.1"
| #define _GNU_SOURCE 1
| #define GNUCASH_MAJOR_VERSION 2
| #define GNUCASH_MINOR_VERSION 2
| #define GNUCASH_MICRO_VERSION 1
| #define GETTEXT_PACKAGE "gnucash"
| #define STDC_HEADERS 1
| #define HAVE_SYS_TYPES_H 1
| #define HAVE_SYS_STAT_H 1
| #define HAVE_STDLIB_H 1
| #define HAVE_STRING_H 1
| #define HAVE_MEMORY_H 1
| #define HAVE_STRINGS_H 1
| #define HAVE_INTTYPES_H 1
| #define HAVE_STDINT_H 1
| #define HAVE_UNISTD_H 1
| #define HAVE_LOCALE_H 1
| #define HAVE_LC_MESSAGES 1
| #define HAVE_BIND_TEXTDOMAIN_CODESET 1
| #define HAVE_GETTEXT 1
| #define HAVE_DCGETTEXT 1
| #define ENABLE_NLS 1
| #define HAVE_DLFCN_H 1
| #define STDC_HEADERS 1
| #define HAVE_LIMITS_H 1
| #define HAVE_SYS_TIMES_H 1
| #define HAVE_SYS_WAIT_H 1
| #define HAVE_STPCPY 1
| #define HAVE_MEMCPY 1
| #define HAVE_TIMEGM 1
| #define HAVE_TOWUPPER 1
| #define HAVE_SETENV 1
| #define HAVE_STRUCT_TM_GMTOFF 1
| #define HAVE_SCANF_LLD 1
| #define HAVE_X11_XLIB_H 1
| #define HAVE_GLOB_H 1
| #define HAVE_CHOWN 1
| #define HAVE_GETHOSTNAME 1
| #define HAVE_GETPPID 1
| #define HAVE_GETUID 1
| #define HAVE_GETTIMEOFDAY 1
| #define HAVE_GMTIME_R 1
| #define HAVE_GETHOSTID 1
| #define HAVE_LINK 1
| #define ENABLE_BINRELOC
| #define HAVE_LIBPTHREAD 1
| #define BR_PTHREAD 1
| #define HAVE_GLIB_2_8 1
| #define HAVE_GLIB29 1
| #define HAVE_GLIB_2_12 1
| #define HAVE_DLFCN_H 1
| #define HAVE_UTMP_H 1
| #define HAVE_LOCALE_H 1
| #define HAVE_MCHECK_H 1
| #define HAVE_UNISTD_H 1
| #define HAVE_WCTYPE_H 1
| /* end confdefs.h.  */
| /* Define dlsym to an innocuous variant, in case <limits.h> declares dlsym.
|    For example, HP-UX 11i <limits.h> declares gettimeofday.  */
| #define dlsym innocuous_dlsym
| 
| /* System header to define __stub macros and hopefully few prototypes,
|     which can conflict with char dlsym (); below.
|     Prefer <limits.h> to <assert.h> if __STDC__ is defined, since
|     <limits.h> exists even on freestanding compilers.  */
| 
| #ifdef __STDC__
| # include <limits.h>
| #else
| # include <assert.h>
| #endif
| 
| #undef dlsym
| 
| /* Override any GCC internal prototype to avoid an error.
|    Use char because int might match the return type of a GCC
|    builtin and then its argument prototype would still apply.  */
| #ifdef __cplusplus
| extern "C"
| #endif
| char dlsym ();
| /* The GNU C library defines this for functions which it implements
|     to always fail with ENOSYS.  Some functions are actually named
|     something starting with __ and the normal name is an alias.  */
| #if defined __stub_dlsym || defined __stub___dlsym
| choke me
| #endif
| 
| int
| main ()
| {
| return dlsym ();
|   ;
|   return 0;
| }
configure:24673: result: no
configure:24682: checking for dlsym in -ldl
configure:24717: gcc -o conftest -g -O2   conftest.c -ldl  -lpthread  >&5
configure:24723: $? = 0
configure:24741: result: yes
configure:24923: checking for dlerror
configure:24979: gcc -o conftest -g -O2   conftest.c -lpthread  -ldl >&5
configure:24985: $? = 0
configure:25003: result: yes
configure:25026: checking for darwin
configure:25051: result: no
configure:25074: checking for qt_null in -lqthreads
configure:25109: gcc -o conftest -g -O2    conftest.c -lqthreads -lpthread  -lpthread  >&5
configure:25115: $? = 0
configure:25133: result: yes
configure:25211: checking for main in -ltermcap
configure:25240: gcc -o conftest -g -O2    conftest.c -ltermcap  -lpthread  >&5
configure:25246: $? = 0
configure:25264: result: yes
configure:25270: checking for main in -lreadline
configure:25299: gcc -o conftest -g -O2    conftest.c -lreadline -ltermcap -lpthread  >&5
configure:25305: $? = 0
configure:25323: result: yes
configure:25341: checking for guile-config
configure:25357: found /usr/bin/guile-config
configure:25369: result: yes
configure:25379: checking whether guile-config works
configure:25385: result: yes
configure:25447: checking for sin in -lm
configure:25482: gcc -o conftest -g -O2    conftest.c -lm  -lpthread  >&5
conftest.c:73: warning: conflicting types for built-in function 'sin'
configure:25488: $? = 0
configure:25506: result: yes
configure:25519: checking for guile libraries
configure:25522: result: -lguile -lguile-ltdl -lqthreads -lpthread -lcrypt -lm
configure:25524: checking for guile headers
configure:25527: result: 
configure:25861: checking whether guile works
configure:25890: gcc -o conftest -g -O2     conftest.c -lm -lpthread  -lguile -lguile-ltdl -lqthreads -lpthread -lcrypt -lm >&5
configure:25896: $? = 0
configure:25921: result: yes
configure:25978: checking for guile
configure:25996: found /usr/bin/guile
configure:26009: result: /usr/bin/guile
configure:26024: checking for guile - 1.6.0 <= version < 99.99.99
configure:26071: result: yes: 1.6.8
configure:26163: checking for guile - 1.8.0 <= version < 99.99.99
configure:26221: result: no: 1.6.8
configure:26237: checking for SLIB support
configure:26241: result: yes
configure:26262: checking if guile long_long is at least as big as gint64
configure:26361: gcc -o conftest   -g -O2 -pthread -I/usr/include/glib-2.0 -I/usr/lib/glib-2.0/include     conftest.c -lm -lpthread  >&5
configure:26364: $? = 0
configure:26370: ./conftest
configure:26373: $? = 0
configure:26376: result: yes
configure:26378: checking for scm_long_long2num in -lguile
configure:26413: gcc -o conftest   -g -O2 -pthread -I/usr/include/glib-2.0 -I/usr/lib/glib-2.0/include     conftest.c -lguile  -lm -lpthread  >&5
configure:26419: $? = 0
configure:26437: result: yes
configure:26468: checking if unsigned long is at least as big as guint32
configure:26497: gcc -o conftest   -g -O2 -pthread -I/usr/include/glib-2.0 -I/usr/lib/glib-2.0/include     conftest.c -lm -lpthread  >&5
configure:26500: $? = 0
configure:26506: ./conftest
configure:26509: $? = 0
configure:26512: result: yes
configure:26544: checking if guile needs our copy of srfi-1
configure:26548: result: no
configure:26544: checking if guile needs our copy of srfi-11
configure:26548: result: no
configure:26544: checking if guile needs our copy of srfi-19
configure:26548: result: no
configure:26544: checking if guile needs our copy of srfi-2
configure:26548: result: no
configure:26544: checking if guile needs our copy of srfi-8
configure:26548: result: no
configure:26544: checking if guile needs our copy of srfi-9
configure:26548: result: no
configure:26574: checking if guile needs our copy of (guile www)
configure:26578: checking for guile
configure:26608: result: /usr/bin/guile
configure:26624: checking for guile-config
configure:26642: found /usr/bin/guile-config
configure:26654: result: /usr/bin/guile-config
configure:26670: checking for guile-tools
configure:26688: found /usr/bin/guile-tools
configure:26700: result: /usr/bin/guile-tools
configure:26710: checking if (www main) is available
configure:26717: result: yes
configure:26791: checking for gconf-2.0 >= "2.0"
configure:26795: result: yes
configure:26799: checking GCONF_CFLAGS
configure:26802: result: -DORBIT2=1 -pthread -I/usr/include/gconf/2 -I/usr/include/orbit-2.0 -I/usr/include/glib-2.0 -I/usr/lib/glib-2.0/include  
configure:26805: checking GCONF_LIBS
configure:26808: result: -pthread -lgconf-2 -lORBit-2 -lgthread-2.0 -lrt -lgobject-2.0 -lglib-2.0  
configure:26840: checking for gconftool-2
configure:26858: found /usr/bin/gconftool-2
configure:26870: result: /usr/bin/gconftool-2
configure:26941: checking for libxml-2.0 >= 2.5.10
configure:26945: result: yes
configure:26949: checking LIBXML2_CFLAGS
configure:26952: result: -I/usr/include/libxml2  
configure:26955: checking LIBXML2_LIBS
configure:26958: result: -lxml2  
configure:27006: checking for xmlElemDump in -lxml2
configure:27041: gcc -o conftest -g -O2   conftest.c -lxml2  -lm -lpthread  -lxml2   >&5
configure:27047: $? = 0
configure:27065: result: yes
configure:27141: External QOF Disabled.  Using Internal QOF Code.
configure:27590: checking whether to use OFX
configure:27597: result: yes -- automatic test
configure:27616: checking for libofx/libofx.h
configure:27643: gcc -E   conftest.c
conftest.c:76:27: error: libofx/libofx.h: No such file or directory
configure:27649: $? = 1
configure: failed program was:
| /* confdefs.h.  */
| #define PACKAGE_NAME "gnucash"
| #define PACKAGE_TARNAME "gnucash"
| #define PACKAGE_VERSION "2.2.1"
| #define PACKAGE_STRING "gnucash 2.2.1"
| #define PACKAGE_BUGREPORT "gnucash-devel@gnucash.org"
| #define PACKAGE "gnucash"
| #define VERSION "2.2.1"
| #define _GNU_SOURCE 1
| #define GNUCASH_MAJOR_VERSION 2
| #define GNUCASH_MINOR_VERSION 2
| #define GNUCASH_MICRO_VERSION 1
| #define GETTEXT_PACKAGE "gnucash"
| #define STDC_HEADERS 1
| #define HAVE_SYS_TYPES_H 1
| #define HAVE_SYS_STAT_H 1
| #define HAVE_STDLIB_H 1
| #define HAVE_STRING_H 1
| #define HAVE_MEMORY_H 1
| #define HAVE_STRINGS_H 1
| #define HAVE_INTTYPES_H 1
| #define HAVE_STDINT_H 1
| #define HAVE_UNISTD_H 1
| #define HAVE_LOCALE_H 1
| #define HAVE_LC_MESSAGES 1
| #define HAVE_BIND_TEXTDOMAIN_CODESET 1
| #define HAVE_GETTEXT 1
| #define HAVE_DCGETTEXT 1
| #define ENABLE_NLS 1
| #define HAVE_DLFCN_H 1
| #define STDC_HEADERS 1
| #define HAVE_LIMITS_H 1
| #define HAVE_SYS_TIMES_H 1
| #define HAVE_SYS_WAIT_H 1
| #define HAVE_STPCPY 1
| #define HAVE_MEMCPY 1
| #define HAVE_TIMEGM 1
| #define HAVE_TOWUPPER 1
| #define HAVE_SETENV 1
| #define HAVE_STRUCT_TM_GMTOFF 1
| #define HAVE_SCANF_LLD 1
| #define HAVE_X11_XLIB_H 1
| #define HAVE_GLOB_H 1
| #define HAVE_CHOWN 1
| #define HAVE_GETHOSTNAME 1
| #define HAVE_GETPPID 1
| #define HAVE_GETUID 1
| #define HAVE_GETTIMEOFDAY 1
| #define HAVE_GMTIME_R 1
| #define HAVE_GETHOSTID 1
| #define HAVE_LINK 1
| #define ENABLE_BINRELOC
| #define HAVE_LIBPTHREAD 1
| #define BR_PTHREAD 1
| #define HAVE_GLIB_2_8 1
| #define HAVE_GLIB29 1
| #define HAVE_GLIB_2_12 1
| #define HAVE_DLFCN_H 1
| #define HAVE_UTMP_H 1
| #define HAVE_LOCALE_H 1
| #define HAVE_MCHECK_H 1
| #define HAVE_UNISTD_H 1
| #define HAVE_WCTYPE_H 1
| #define HAVE_DLERROR 1
| #define HAVE_LIBM 1
| #define HAVE_GUILE 1
| #define GNC_GUILE_MAJOR_VERSION 1
| #define GNC_GUILE_MINOR_VERSION 6
| #define GNC_GUILE_MICRO_VERSION 8
| #define GUILE_LONG_LONG_OK 1
| #define HAVE_LIBQOF
| #define QOF_DISABLE_DEPRECATED 1
| #define DEBUG_MEMORY 0
| #define DEBUG_REFERENCE_COUNTING 0
| /* end confdefs.h.  */
| #include <libofx/libofx.h>
configure:27727: checking for libofx
configure:27757: gcc -o conftest -g -O2    conftest.c -lm -lpthread   -lofx >&5
conftest.c:77:43: error: libofx/libofx.h: No such file or directory
conftest.c: In function 'main':
conftest.c:83: error: 'LibofxContextPtr' undeclared (first use in this function)
conftest.c:83: error: (Each undeclared identifier is reported only once
conftest.c:83: error: for each function it appears in.)
conftest.c:83: error: expected ';' before 'libofx_context'
conftest.c:84: error: 'libofx_context' undeclared (first use in this function)
configure:27763: $? = 1
configure: failed program was:
| /* confdefs.h.  */
| #define PACKAGE_NAME "gnucash"
| #define PACKAGE_TARNAME "gnucash"
| #define PACKAGE_VERSION "2.2.1"
| #define PACKAGE_STRING "gnucash 2.2.1"
| #define PACKAGE_BUGREPORT "gnucash-devel@gnucash.org"
| #define PACKAGE "gnucash"
| #define VERSION "2.2.1"
| #define _GNU_SOURCE 1
| #define GNUCASH_MAJOR_VERSION 2
| #define GNUCASH_MINOR_VERSION 2
| #define GNUCASH_MICRO_VERSION 1
| #define GETTEXT_PACKAGE "gnucash"
| #define STDC_HEADERS 1
| #define HAVE_SYS_TYPES_H 1
| #define HAVE_SYS_STAT_H 1
| #define HAVE_STDLIB_H 1
| #define HAVE_STRING_H 1
| #define HAVE_MEMORY_H 1
| #define HAVE_STRINGS_H 1
| #define HAVE_INTTYPES_H 1
| #define HAVE_STDINT_H 1
| #define HAVE_UNISTD_H 1
| #define HAVE_LOCALE_H 1
| #define HAVE_LC_MESSAGES 1
| #define HAVE_BIND_TEXTDOMAIN_CODESET 1
| #define HAVE_GETTEXT 1
| #define HAVE_DCGETTEXT 1
| #define ENABLE_NLS 1
| #define HAVE_DLFCN_H 1
| #define STDC_HEADERS 1
| #define HAVE_LIMITS_H 1
| #define HAVE_SYS_TIMES_H 1
| #define HAVE_SYS_WAIT_H 1
| #define HAVE_STPCPY 1
| #define HAVE_MEMCPY 1
| #define HAVE_TIMEGM 1
| #define HAVE_TOWUPPER 1
| #define HAVE_SETENV 1
| #define HAVE_STRUCT_TM_GMTOFF 1
| #define HAVE_SCANF_LLD 1
| #define HAVE_X11_XLIB_H 1
| #define HAVE_GLOB_H 1
| #define HAVE_CHOWN 1
| #define HAVE_GETHOSTNAME 1
| #define HAVE_GETPPID 1
| #define HAVE_GETUID 1
| #define HAVE_GETTIMEOFDAY 1
| #define HAVE_GMTIME_R 1
| #define HAVE_GETHOSTID 1
| #define HAVE_LINK 1
| #define ENABLE_BINRELOC
| #define HAVE_LIBPTHREAD 1
| #define BR_PTHREAD 1
| #define HAVE_GLIB_2_8 1
| #define HAVE_GLIB29 1
| #define HAVE_GLIB_2_12 1
| #define HAVE_DLFCN_H 1
| #define HAVE_UTMP_H 1
| #define HAVE_LOCALE_H 1
| #define HAVE_MCHECK_H 1
| #define HAVE_UNISTD_H 1
| #define HAVE_WCTYPE_H 1
| #define HAVE_DLERROR 1
| #define HAVE_LIBM 1
| #define HAVE_GUILE 1
| #define GNC_GUILE_MAJOR_VERSION 1
| #define GNC_GUILE_MINOR_VERSION 6
| #define GNC_GUILE_MICRO_VERSION 8
| #define GUILE_LONG_LONG_OK 1
| #define HAVE_LIBQOF
| #define QOF_DISABLE_DEPRECATED 1
| #define DEBUG_MEMORY 0
| #define DEBUG_REFERENCE_COUNTING 0
| /* end confdefs.h.  */
| 
|                 #include <libofx/libofx.h>
| 
| int
| main ()
| {
| 
| 	        LibofxContextPtr libofx_context = libofx_get_new_context();
| 	        libofx_free_context(libofx_context);
| 
|   ;
|   return 0;
| }
configure:27780: result: *** Cannot compile test program for libofx library. Please check config.log for the exact error.
configure:28269: checking for nl_langinfo and D_FMT
configure:28295: gcc -o conftest -g -O2   conftest.c -lm -lpthread  >&5
configure:28301: $? = 0
configure:28319: result: yes
configure:28340: checking for a valid gettext/gmsgfmt installation
configure:28349: result: yes - /usr/bin/msgfmt
configure:28513: checking for perl
configure:28531: found /usr/bin/perl
configure:28543: result: /usr/bin/perl
configure:28622: checking for doxygen
configure:28640: found /usr/bin/doxygen
configure:28652: result: /usr/bin/doxygen
configure:28671: checking for dot
configure:28704: result: no
configure:28770: checking popt.h usability
configure:28787: gcc -c -g -O2  conftest.c >&5
configure:28793: $? = 0
configure:28807: result: yes
configure:28811: checking popt.h presence
configure:28826: gcc -E  conftest.c
configure:28832: $? = 0
configure:28846: result: yes
configure:28879: checking for popt.h
configure:28887: result: yes
configure:28901: checking for poptStrippedArgv in -lpopt
configure:28936: gcc -o conftest -g -O2   conftest.c -lpopt  -lm -lpthread  -lm >&5
configure:28942: $? = 0
configure:28960: result: yes
configure:29035: checking what warning flags to pass to the C compiler
configure:29056: result: -Wall -Wunused -Wmissing-prototypes -Wmissing-declarations
configure:29067: checking what language compliance flags to pass to the C compiler
configure:29083: result: 
configure:29147: checking for gtk+-2.0 >= 2.6
configure:29151: result: yes
configure:29155: checking GTK_CFLAGS
configure:29158: result: -I/usr/include/gtk-2.0 -I/usr/lib/gtk-2.0/include -I/usr/include/atk-1.0 -I/usr/include/cairo -I/usr/include/pango-1.0 -I/usr/include/glib-2.0 -I/usr/lib/glib-2.0/include -I/usr/include/freetype2 -I/usr/include/libpng12  
configure:29161: checking GTK_LIBS
configure:29164: result: -lgtk-x11-2.0 -lgdk-x11-2.0 -latk-1.0 -lgdk_pixbuf-2.0 -lm -lpangocairo-1.0 -lfontconfig -lXext -lXrender -lXinerama -lXi -lXrandr -lXcursor -lXcomposite -lXdamage -lpango-1.0 -lcairo -lX11 -lXfixes -lgobject-2.0 -lgmodule-2.0 -ldl -lglib-2.0  
configure:29207: checking for GTK - version >= 2.10.0
configure:29211: result: yes
configure:29234: checking for untested GDK versions (gdk > 2.11.0)
configure:29238: result: yes
configure:29298: checking for libgnomeui-2.0 >= 2.4
configure:29302: result: yes
configure:29306: checking GNOME_CFLAGS
configure:29309: result: -DORBIT2=1 -pthread -I/usr/include/libgnomeui-2.0 -I/usr/include/libart-2.0 -I/usr/include/gconf/2 -I/usr/include/gnome-keyring-1 -I/usr/include/libgnome-2.0 -I/usr/include/libbonoboui-2.0 -I/usr/include/libgnomecanvas-2.0 -I/usr/include/gtk-2.0 -I/usr/include/gnome-vfs-2.0 -I/usr/lib/gnome-vfs-2.0/include -I/usr/include/orbit-2.0 -I/usr/include/glib-2.0 -I/usr/lib/glib-2.0/include -I/usr/include/libbonobo-2.0 -I/usr/include/bonobo-activation-2.0 -I/usr/include/libxml2 -I/usr/include/pango-1.0 -I/usr/include/freetype2 -I/usr/include/gail-1.0 -I/usr/include/atk-1.0 -I/usr/lib/gtk-2.0/include -I/usr/include/cairo -I/usr/include/libpng12  
configure:29312: checking GNOME_LIBS
configure:29315: result: -pthread -lgnomeui-2 -lSM -lICE -lbonoboui-2 -lgnomevfs-2 -lgnomecanvas-2 -lgnome-2 -lpopt -lbonobo-2 -lbonobo-activation -lart_lgpl_2 -lgtk-x11-2.0 -lgdk-x11-2.0 -latk-1.0 -lgdk_pixbuf-2.0 -lm -lpangocairo-1.0 -lfontconfig -lXext -lXrender -lXinerama -lXi -lXrandr -lXcursor -lXcomposite -lXdamage -lpango-1.0 -lcairo -lX11 -lXfixes -lgconf-2 -lgmodule-2.0 -ldl -lORBit-2 -lgthread-2.0 -lrt -lgobject-2.0 -lglib-2.0  
configure:29357: checking for untested GNOME versions (libgnome >= 2.19.0)
configure:29361: result: yes
configure:29424: checking for gdk-pixbuf-2.0
configure:29428: result: yes
configure:29432: checking GDK_PIXBUF_CFLAGS
configure:29435: result: -I/usr/include/gtk-2.0 -I/usr/include/glib-2.0 -I/usr/lib/glib-2.0/include  
configure:29438: checking GDK_PIXBUF_LIBS
configure:29441: result: -lgdk_pixbuf-2.0 -lm -lgobject-2.0 -lgmodule-2.0 -ldl -lglib-2.0  
configure:29538: checking for libglade-2.0 >= 2.4
configure:29542: result: yes
configure:29546: checking GLADE_CFLAGS
configure:29549: result: -I/usr/include/libglade-2.0 -I/usr/include/gtk-2.0 -I/usr/include/libxml2 -I/usr/lib/gtk-2.0/include -I/usr/include/atk-1.0 -I/usr/include/cairo -I/usr/include/pango-1.0 -I/usr/include/glib-2.0 -I/usr/lib/glib-2.0/include -I/usr/include/freetype2 -I/usr/include/libpng12  
configure:29552: checking GLADE_LIBS
configure:29555: result: -lglade-2.0 -lgtk-x11-2.0 -lxml2 -lgdk-x11-2.0 -latk-1.0 -lgdk_pixbuf-2.0 -lm -lpangocairo-1.0 -lfontconfig -lXext -lXrender -lXinerama -lXi -lXrandr -lXcursor -lXcomposite -lXdamage -lpango-1.0 -lcairo -lX11 -lXfixes -lgobject-2.0 -lgmodule-2.0 -ldl -lglib-2.0  
configure:29652: checking for libgoffice-0.4 >= 0.4.0
configure:29656: result: yes
configure:29660: checking GOFFICE_CFLAGS
configure:29663: result: -I/usr/include/libgoffice-0.4 -I/usr/include/glib-2.0 -I/usr/lib/glib-2.0/include -I/usr/include/libgsf-1 -I/usr/include/libxml2 -I/usr/include/gtk-2.0 -I/usr/include/libglade-2.0 -I/usr/include/libgnomeprint-2.2 -I/usr/include/libart-2.0 -I/usr/include/cairo -I/usr/include/pango-1.0 -I/usr/lib/gtk-2.0/include -I/usr/include/atk-1.0 -I/usr/include/freetype2 -I/usr/include/libpng12  
configure:29666: checking GOFFICE_LIBS
configure:29669: result: -lgoffice-0 -lgsf-1 -lglade-2.0 -lgnomeprint-2-2 -lz -lgtk-x11-2.0 -lgdk-x11-2.0 -latk-1.0 -lgdk_pixbuf-2.0 -lm -lpangocairo-1.0 -lfontconfig -lXext -lXrender -lXinerama -lXi -lXrandr -lXcursor -lXcomposite -lXdamage -lX11 -lXfixes -lart_lgpl_2 -lxml2 -lpango-1.0 -lcairo -lgobject-2.0 -lgmodule-2.0 -ldl -lglib-2.0  
configure:29925: checking goffice/graph/gog-renderer-cairo.h usability
configure:29942: gcc -c -g -O2 -Wall -Wunused -Wmissing-prototypes -Wmissing-declarations  -I/usr/include/libgoffice-0.4 -I/usr/include/glib-2.0 -I/usr/lib/glib-2.0/include -I/usr/include/libgsf-1 -I/usr/include/libxml2 -I/usr/include/gtk-2.0 -I/usr/include/libglade-2.0 -I/usr/include/libgnomeprint-2.2 -I/usr/include/libart-2.0 -I/usr/include/cairo -I/usr/include/pango-1.0 -I/usr/lib/gtk-2.0/include -I/usr/include/atk-1.0 -I/usr/include/freetype2 -I/usr/include/libpng12  conftest.c >&5
configure:29948: $? = 0
configure:29962: result: yes
configure:29966: checking goffice/graph/gog-renderer-cairo.h presence
configure:29981: gcc -E -I/usr/include/libgoffice-0.4 -I/usr/include/glib-2.0 -I/usr/lib/glib-2.0/include -I/usr/include/libgsf-1 -I/usr/include/libxml2 -I/usr/include/gtk-2.0 -I/usr/include/libglade-2.0 -I/usr/include/libgnomeprint-2.2 -I/usr/include/libart-2.0 -I/usr/include/cairo -I/usr/include/pango-1.0 -I/usr/lib/gtk-2.0/include -I/usr/include/atk-1.0 -I/usr/include/freetype2 -I/usr/include/libpng12  conftest.c
configure:29987: $? = 0
configure:30001: result: yes
configure:30034: checking for goffice/graph/gog-renderer-cairo.h
configure:30041: result: yes
configure:30120: checking for libgtkhtml-3.14
configure:30124: result: yes
configure:30128: checking GTKHTML_CFLAGS
configure:30131: result: -DORBIT2=1 -pthread -I/usr/include/libgtkhtml-3.14 -I/usr/include/gtk-2.0 -I/usr/include/libgnomeui-2.0 -I/usr/include/libglade-2.0 -I/usr/lib/gtk-2.0/include -I/usr/include/atk-1.0 -I/usr/include/cairo -I/usr/include/pango-1.0 -I/usr/include/glib-2.0 -I/usr/lib/glib-2.0/include -I/usr/include/freetype2 -I/usr/include/libpng12 -I/usr/include/libart-2.0 -I/usr/include/gconf/2 -I/usr/include/gnome-keyring-1 -I/usr/include/libgnome-2.0 -I/usr/include/libbonoboui-2.0 -I/usr/include/libgnomecanvas-2.0 -I/usr/include/gnome-vfs-2.0 -I/usr/lib/gnome-vfs-2.0/include -I/usr/include/orbit-2.0 -I/usr/include/libbonobo-2.0 -I/usr/include/bonobo-activation-2.0 -I/usr/include/libxml2 -I/usr/include/gail-1.0  
configure:30134: checking GTKHTML_LIBS
configure:30137: result: -pthread -lgtkhtml-3.14 -lgnomeui-2 -lSM -lICE -lglade-2.0 -lbonoboui-2 -lgnomevfs-2 -lgnomecanvas-2 -lgnome-2 -lpopt -lbonobo-2 -lbonobo-activation -lart_lgpl_2 -lgconf-2 -lORBit-2 -lgthread-2.0 -lrt -lgtk-x11-2.0 -lxml2 -lgdk-x11-2.0 -latk-1.0 -lgdk_pixbuf-2.0 -lm -lpangocairo-1.0 -lfontconfig -lXext -lXrender -lXinerama -lXi -lXrandr -lXcursor -lXcomposite -lXdamage -lpango-1.0 -lcairo -lX11 -lXfixes -lgobject-2.0 -lgmodule-2.0 -ldl -lglib-2.0  
configure:30901: checking for pthread_mutex_init
configure:30957: gcc -o conftest -g -O2 -Wall -Wunused -Wmissing-prototypes -Wmissing-declarations    conftest.c -lpopt -lm -lpthread  -lm >&5
configure:30963: $? = 0
configure:30981: result: yes
configure:30996: checking for strptime
configure:31052: gcc -o conftest -g -O2 -Wall -Wunused -Wmissing-prototypes -Wmissing-declarations    conftest.c -lpopt -lm -lpthread  -lm >&5
configure:31058: $? = 0
configure:31076: result: yes
configure:30996: checking for localtime_r
configure:31052: gcc -o conftest -g -O2 -Wall -Wunused -Wmissing-prototypes -Wmissing-declarations    conftest.c -lpopt -lm -lpthread  -lm >&5
configure:31058: $? = 0
configure:31076: result: yes
configure:31108: checking what extra warning flags to pass to the C compiler
configure:31175: result:  -Werror -Wdeclaration-after-statement -Wno-pointer-sign -D_FORTIFY_SOURCE=2
configure:31461: creating ./config.status

## ---------------------- ##
## Running config.status. ##
## ---------------------- ##

This file was extended by gnucash config.status 2.2.1, which was
generated by GNU Autoconf 2.61.  Invocation command line was

  CONFIG_FILES    = 
  CONFIG_HEADERS  = 
  CONFIG_LINKS    = 
  CONFIG_COMMANDS = 
  $ ./config.status 

on administrator

config.status:981: creating po/Makefile.in
config.status:981: creating Makefile
config.status:981: creating accounts/Makefile
config.status:981: creating accounts/C/Makefile
config.status:981: creating accounts/da/Makefile
config.status:981: creating accounts/de_AT/Makefile
config.status:981: creating accounts/de_CH/Makefile
config.status:981: creating accounts/de_DE/Makefile
config.status:981: creating accounts/el_GR/Makefile
config.status:981: creating accounts/en_GB/Makefile
config.status:981: creating accounts/es_ES/Makefile
config.status:981: creating accounts/fr_CA/Makefile
config.status:981: creating accounts/fr_CH/Makefile
config.status:981: creating accounts/fr_FR/Makefile
config.status:981: creating accounts/hu_HU/Makefile
config.status:981: creating accounts/it/Makefile
config.status:981: creating accounts/ja/Makefile
config.status:981: creating accounts/nb/Makefile
config.status:981: creating accounts/pt_BR/Makefile
config.status:981: creating accounts/pt_PT/Makefile
config.status:981: creating accounts/sk/Makefile
config.status:981: creating accounts/tr_TR/Makefile
config.status:981: creating accounts/zh_CN/Makefile
config.status:981: creating checks/Makefile
config.status:981: creating doc/Makefile
config.status:981: creating doc/examples/Makefile
config.status:981: creating intl-scm/Makefile
config.status:981: creating lib/Makefile
config.status:981: creating lib/glib28/Makefile
config.status:981: creating lib/guile-www/Makefile
config.status:981: creating lib/srfi/Makefile
config.status:981: creating lib/libc/Makefile
config.status:981: creating lib/libqof/Makefile
config.status:981: creating lib/libqof/qof/Makefile
config.status:981: creating lib/libqof/backend/Makefile
config.status:981: creating lib/libqof/backend/file/Makefile
config.status:981: creating lib/stf/Makefile
config.status:981: creating packaging/Makefile
config.status:981: creating packaging/win32/Makefile
config.status:981: creating packaging/win32/gnucash.iss
config.status:981: creating src/Makefile
config.status:981: creating src/app-utils/Makefile
config.status:981: creating src/app-utils/test/Makefile
config.status:981: creating src/backend/Makefile
config.status:981: creating src/backend/file/Makefile
config.status:981: creating src/backend/file/test/Makefile
config.status:981: creating src/backend/file/test/test-files/Makefile
config.status:981: creating src/backend/file/test/test-files/xml2/Makefile
config.status:981: creating src/backend/postgres/Makefile
config.status:981: creating src/backend/postgres/test/Makefile
config.status:981: creating src/bin/Makefile
config.status:981: creating src/bin/overrides/Makefile
config.status:981: creating src/bin/test/Makefile
config.status:981: creating src/core-utils/Makefile
config.status:981: creating src/calculation/Makefile
config.status:981: creating src/calculation/test/Makefile
config.status:981: creating src/doc/Makefile
config.status:981: creating src/doc/design/Makefile
config.status:981: creating src/doc/xml/Makefile
config.status:981: creating src/engine/Makefile
config.status:981: creating src/engine/test/Makefile
config.status:981: creating src/engine/test-core/Makefile
config.status:981: creating src/gnc-module/Makefile
config.status:981: creating src/gnc-module/test/Makefile
config.status:981: creating src/gnc-module/test/mod-foo/Makefile
config.status:981: creating src/gnc-module/test/mod-bar/Makefile
config.status:981: creating src/gnc-module/test/mod-baz/Makefile
config.status:981: creating src/gnc-module/test/misc-mods/Makefile
config.status:981: creating src/gnome/Makefile
config.status:981: creating src/gnome/gnucash.desktop.in
config.status:981: creating src/gnome/glade/Makefile
config.status:981: creating src/gnome/schemas/Makefile
config.status:981: creating src/gnome/ui/Makefile
config.status:981: creating src/gnome-utils/Makefile
config.status:981: creating src/gnome-utils/glade/Makefile
config.status:981: creating src/gnome-utils/schemas/Makefile
config.status:981: creating src/gnome-utils/test/Makefile
config.status:981: creating src/gnome-utils/ui/Makefile
config.status:981: creating src/gnome-search/Makefile
config.status:981: creating src/import-export/Makefile
config.status:981: creating src/import-export/test/Makefile
config.status:981: creating src/import-export/qif-import/Makefile
config.status:981: creating src/import-export/qif/Makefile
config.status:981: creating src/import-export/qif/test/Makefile
config.status:981: creating src/import-export/qif-import/test/Makefile
config.status:981: creating src/import-export/qif-io-core/Makefile
config.status:981: creating src/import-export/qif-io-core/test/Makefile
config.status:981: creating src/import-export/schemas/Makefile
config.status:981: creating src/import-export/ofx/Makefile
config.status:981: creating src/import-export/ofx/test/Makefile
config.status:981: creating src/import-export/csv/Makefile
config.status:981: creating src/import-export/log-replay/Makefile
config.status:981: creating src/import-export/hbci/Makefile
config.status:981: creating src/import-export/hbci/glade/Makefile
config.status:981: creating src/import-export/hbci/schemas/Makefile
config.status:981: creating src/import-export/hbci/test/Makefile
config.status:981: creating src/optional/Makefile
config.status:981: creating src/optional/xsl/Makefile
config.status:981: creating src/pixmaps/Makefile
config.status:981: creating src/quotes/Makefile
config.status:981: creating src/register/Makefile
config.status:981: creating src/register/ledger-core/Makefile
config.status:981: creating src/register/ledger-core/test/Makefile
config.status:981: creating src/register/register-core/Makefile
config.status:981: creating src/register/register-core/test/Makefile
config.status:981: creating src/register/register-gnome/Makefile
config.status:981: creating src/register/register-gnome/test/Makefile
config.status:981: creating src/report/Makefile
config.status:981: creating src/report/report-gnome/Makefile
config.status:981: creating src/report/report-gnome/test/Makefile
config.status:981: creating src/report/report-system/Makefile
config.status:981: creating src/report/report-system/test/Makefile
config.status:981: creating src/report/standard-reports/Makefile
config.status:981: creating src/report/standard-reports/test/Makefile
config.status:981: creating src/report/locale-specific/Makefile
config.status:981: creating src/report/locale-specific/us/Makefile
config.status:981: creating src/report/locale-specific/us/test/Makefile
config.status:981: creating src/report/stylesheets/Makefile
config.status:981: creating src/report/stylesheets/test/Makefile
config.status:981: creating src/report/utility-reports/Makefile
config.status:981: creating src/report/utility-reports/test/Makefile
config.status:981: creating src/scm/Makefile
config.status:981: creating src/scm/gnumeric/Makefile
config.status:981: creating src/tax/Makefile
config.status:981: creating src/tax/us/Makefile
config.status:981: creating src/tax/us/test/Makefile
config.status:981: creating src/test-core/Makefile
config.status:981: creating src/business/Makefile
config.status:981: creating src/business/business-core/Makefile
config.status:981: creating src/business/business-core/test/Makefile
config.status:981: creating src/business/business-core/file/Makefile
config.status:981: creating src/business/business-utils/Makefile
config.status:981: creating src/business/dialog-tax-table/Makefile
config.status:981: creating src/business/business-gnome/Makefile
config.status:981: creating src/business/business-gnome/glade/Makefile
config.status:981: creating src/business/business-gnome/schemas/Makefile
config.status:981: creating src/business/business-gnome/ui/Makefile
config.status:981: creating src/business/business-ledger/Makefile
config.status:981: creating src/business/business-reports/Makefile
config.status:981: creating config.h
config.status:1321: executing depfiles commands
config.status:1321: executing intltool commands
config.status:1321: executing default-1 commands
config.status:1321: executing po/stamp-it commands
configure:33160: result:
  Options detected/selected
  -------------------------
  gnucash version ...... : 2.2.1
  Build for host ....... : i686-pc-linux-gnu
  Optional components....:
  Extra Warnings ....... :  -Werror -Wdeclaration-after-statement -Wno-pointer-sign -D_FORTIFY_SOURCE=2
  CPPFLAGS ............. : 
  CFLAGS ............... :  -Werror -Wdeclaration-after-statement -Wno-pointer-sign -D_FORTIFY_SOURCE=2 -g -O2 -Wall -Wunused -Wmissing-prototypes -Wmissing-declarations  -Wno-unused
  LDFLAGS .............. : 
  prefix.................: /usr/local
  QOF support ...........: internal
  QOF location ..........: internal
  QOF library dir .......: 
  QOF backend config ....: /usr/local/gnucash/xml/qsf




## ---------------- ##
## Cache variables. ##
## ---------------- ##

ac_cv_build=i686-pc-linux-gnu
ac_cv_c_bigendian=no
ac_cv_c_compiler_gnu=yes
ac_cv_cxx_compiler_gnu=yes
ac_cv_env_CCC_set=
ac_cv_env_CCC_value=
ac_cv_env_CC_set=
ac_cv_env_CC_value=
ac_cv_env_CFLAGS_set=
ac_cv_env_CFLAGS_value=
ac_cv_env_CPPFLAGS_set=
ac_cv_env_CPPFLAGS_value=
ac_cv_env_CPP_set=
ac_cv_env_CPP_value=
ac_cv_env_CXXCPP_set=
ac_cv_env_CXXCPP_value=
ac_cv_env_CXXFLAGS_set=
ac_cv_env_CXXFLAGS_value=
ac_cv_env_CXX_set=
ac_cv_env_CXX_value=
ac_cv_env_F77_set=
ac_cv_env_F77_value=
ac_cv_env_FFLAGS_set=
ac_cv_env_FFLAGS_value=
ac_cv_env_LDFLAGS_set=
ac_cv_env_LDFLAGS_value=
ac_cv_env_LIBS_set=
ac_cv_env_LIBS_value=
ac_cv_env_PKG_CONFIG_set=
ac_cv_env_PKG_CONFIG_value=
ac_cv_env_build_alias_set=
ac_cv_env_build_alias_value=
ac_cv_env_host_alias_set=
ac_cv_env_host_alias_value=
ac_cv_env_target_alias_set=
ac_cv_env_target_alias_value=
ac_cv_f77_compiler_gnu=no
ac_cv_file__proc_self_maps=yes
ac_cv_func_bind_textdomain_codeset=yes
ac_cv_func_chown=yes
ac_cv_func_dcgettext=yes
ac_cv_func_dlerror=yes
ac_cv_func_dlopen=no
ac_cv_func_dlsym=no
ac_cv_func_gethostid=yes
ac_cv_func_gethostname=yes
ac_cv_func_getppid=yes
ac_cv_func_gettimeofday=yes
ac_cv_func_getuid=yes
ac_cv_func_gmtime_r=yes
ac_cv_func_link=yes
ac_cv_func_localtime_r=yes
ac_cv_func_memcpy=yes
ac_cv_func_pthread_mutex_init=yes
ac_cv_func_setenv=yes
ac_cv_func_shl_load=no
ac_cv_func_stpcpy=yes
ac_cv_func_strptime=yes
ac_cv_func_timegm=yes
ac_cv_func_towupper=yes
ac_cv_guile_found=yes
ac_cv_header_X11_Xlib_h=yes
ac_cv_header_dl_h=no
ac_cv_header_dlfcn_h=yes
ac_cv_header_glob_h=yes
ac_cv_header_goffice_graph_gog_renderer_cairo_h=yes
ac_cv_header_inttypes_h=yes
ac_cv_header_libintl_h=yes
ac_cv_header_limits_h=yes
ac_cv_header_locale_h=yes
ac_cv_header_mcheck_h=yes
ac_cv_header_memory_h=yes
ac_cv_header_popt_h=yes
ac_cv_header_stdc=yes
ac_cv_header_stdint_h=yes
ac_cv_header_stdlib_h=yes
ac_cv_header_string_h=yes
ac_cv_header_strings_h=yes
ac_cv_header_sys_stat_h=yes
ac_cv_header_sys_times_h=yes
ac_cv_header_sys_types_h=yes
ac_cv_header_sys_wait_h=yes
ac_cv_header_unistd_h=yes
ac_cv_header_utmp_h=yes
ac_cv_header_wctype_h=yes
ac_cv_host=i686-pc-linux-gnu
ac_cv_lib_dl_dlopen=yes
ac_cv_lib_dl_dlsym=yes
ac_cv_lib_dld_shl_load=no
ac_cv_lib_guile_scm_long_long2num=yes
ac_cv_lib_m_sin=yes
ac_cv_lib_popt_poptStrippedArgv=yes
ac_cv_lib_pthread_pthread_getspecific=yes
ac_cv_lib_qthreads_qt_null=yes
ac_cv_lib_readline_main=yes
ac_cv_lib_termcap_main=yes
ac_cv_lib_xml2_xmlElemDump=yes
ac_cv_objext=o
ac_cv_path_DOXYGEN=/usr/bin/doxygen
ac_cv_path_EGREP='/bin/grep -E'
ac_cv_path_GCONFTOOL=/usr/bin/gconftool-2
ac_cv_path_GMSGFMT=/usr/bin/msgfmt
ac_cv_path_GREP=/bin/grep
ac_cv_path_GUILE=/usr/bin/guile
ac_cv_path_GUILE_CONFIG=/usr/bin/guile-config
ac_cv_path_GUILE_TOOLS=/usr/bin/guile-tools
ac_cv_path_INTLTOOL_PERL=/usr/bin/perl
ac_cv_path_MSGFMT=/usr/bin/msgfmt
ac_cv_path_PERL=/usr/bin/perl
ac_cv_path_PKG_CONFIG=/usr/bin/pkg-config
ac_cv_path_SWIG=/usr/bin/swig
ac_cv_path_XGETTEXT=/usr/bin/xgettext
ac_cv_path_install='/usr/bin/install -c'
ac_cv_prog_AWK=gawk
ac_cv_prog_BUILD_GUILE=yes
ac_cv_prog_CPP='gcc -E'
ac_cv_prog_CXXCPP='g++ -E'
ac_cv_prog_ac_ct_AR=ar
ac_cv_prog_ac_ct_CC=gcc
ac_cv_prog_ac_ct_CXX=g++
ac_cv_prog_ac_ct_RANLIB=ranlib
ac_cv_prog_ac_ct_STRIP=strip
ac_cv_prog_cc_c89=
ac_cv_prog_cc_g=yes
ac_cv_prog_cxx_g=yes
ac_cv_prog_f77_g=no
ac_cv_prog_make_make_set=yes
ac_cv_search_strerror='none required'
am_cv_CC_dependencies_compiler_type=gcc3
am_cv_CXX_dependencies_compiler_type=gcc3
am_cv_langinfo_dfmt=yes
am_cv_scanf_lld=yes
am_cv_struct_tm_gmtoff=yes
am_cv_val_LC_MESSAGES=yes
br_cv_binreloc=yes
br_cv_binreloc_threads=yes
br_cv_valid_prefixes=yes
gt_cv_func_dgettext_libc=yes
gt_cv_func_dgettext_libintl=no
gt_cv_func_ngettext_libc=yes
gt_cv_have_gettext=yes
lt_cv_deplibs_check_method=pass_all
lt_cv_dlopen=dlopen
lt_cv_dlopen_libs=-ldl
lt_cv_dlopen_self=yes
lt_cv_dlopen_self_static=no
lt_cv_file_magic_cmd='$MAGIC_CMD'
lt_cv_file_magic_test_file=
lt_cv_ld_reload_flag=-r
lt_cv_objdir=.libs
lt_cv_path_LD=/usr/bin/ld
lt_cv_path_LDCXX=/usr/bin/ld
lt_cv_path_NM='/usr/bin/nm -B'
lt_cv_path_SED=/bin/sed
lt_cv_prog_compiler_c_o=yes
lt_cv_prog_compiler_c_o_CXX=yes
lt_cv_prog_compiler_rtti_exceptions=no
lt_cv_prog_gnu_ld=yes
lt_cv_prog_gnu_ldcxx=yes
lt_cv_sys_global_symbol_pipe='sed -n -e '\''s/^.*[ 	]\([ABCDGIRSTW][ABCDGIRSTW]*\)[ 	][ 	]*\([_A-Za-z][_A-Za-z0-9]*\)$/\1 \2 \2/p'\'''
lt_cv_sys_global_symbol_to_c_name_address='sed -n -e '\''s/^: \([^ ]*\) $/  {\"\1\", (lt_ptr) 0},/p'\'' -e '\''s/^[BCDEGRST] \([^ ]*\) \([^ ]*\)$/  {"\2", (lt_ptr) \&\2},/p'\'''
lt_cv_sys_global_symbol_to_cdecl='sed -n -e '\''s/^. .* \(.*\)$/extern int \1;/p'\'''
lt_cv_sys_max_cmd_len=98304
lt_lt_cv_prog_compiler_c_o='"yes"'
lt_lt_cv_prog_compiler_c_o_CXX='"yes"'
lt_lt_cv_sys_global_symbol_pipe='"sed -n -e '\''s/^.*[ 	]\\([ABCDGIRSTW][ABCDGIRSTW]*\\)[ 	][ 	]*\\([_A-Za-z][_A-Za-z0-9]*\\)\$/\\1 \\2 \\2/p'\''"'
lt_lt_cv_sys_global_symbol_to_c_name_address='"sed -n -e '\''s/^: \\([^ ]*\\) \$/  {\\\"\\1\\\", (lt_ptr) 0},/p'\'' -e '\''s/^[BCDEGRST] \\([^ ]*\\) \\([^ ]*\\)\$/  {\"\\2\", (lt_ptr) \\&\\2},/p'\''"'
lt_lt_cv_sys_global_symbol_to_cdecl='"sed -n -e '\''s/^. .* \\(.*\\)\$/extern int \\1;/p'\''"'

## ----------------- ##
## Output variables. ##
## ----------------- ##

ACLOCAL='${SHELL} /home/administrator/development/gnucash/trunk/missing --run aclocal-1.9'
ALL_LINGUAS='ca cs da de el en_GB es_NI es eu fr hu it ja nb ne nl pl pt_BR pt ro ru rw sk sv ta tr uk zh_CN zh_TW'
AMDEPBACKSLASH='\'
AMDEP_FALSE='#'
AMDEP_TRUE=''
AMTAR='${SHELL} /home/administrator/development/gnucash/trunk/missing --run tar'
AR='ar'
AUTOCONF='${SHELL} /home/administrator/development/gnucash/trunk/missing --run autoconf'
AUTOHEADER='${SHELL} /home/administrator/development/gnucash/trunk/missing --run autoheader'
AUTOMAKE='${SHELL} /home/administrator/development/gnucash/trunk/missing --run automake-1.9'
AWK='gawk'
BINRELOC_CFLAGS='-DENABLE_BINRELOC'
BINRELOC_LIBS='-lpthread'
BUILDING_FROM_SVN_FALSE='#'
BUILDING_FROM_SVN_TRUE=''
BUILD_GUILE='yes'
CATALOGS=' ca.gmo cs.gmo da.gmo de.gmo el.gmo en_GB.gmo es_NI.gmo es.gmo eu.gmo fr.gmo hu.gmo it.gmo ja.gmo nb.gmo ne.gmo nl.gmo pl.gmo pt_BR.gmo pt.gmo ro.gmo ru.gmo rw.gmo sk.gmo sv.gmo ta.gmo tr.gmo uk.gmo zh_CN.gmo zh_TW.gmo'
CATOBJEXT='.gmo'
CC='gcc'
CCDEPMODE='depmode=gcc3'
CFLAGS=' -Werror -Wdeclaration-after-statement -Wno-pointer-sign -D_FORTIFY_SOURCE=2 -g -O2 -Wall -Wunused -Wmissing-prototypes -Wmissing-declarations  -Wno-unused'
CPP='gcc -E'
CPPFLAGS=''
CXX='g++'
CXXCPP='g++ -E'
CXXDEPMODE='depmode=gcc3'
CXXFLAGS='-g -O2'
CYGPATH_W='echo'
DATADIRNAME='share'
DEFS='-DHAVE_CONFIG_H'
DEPDIR='.deps'
DL_LIB='-ldl'
DOC_FALSE='#'
DOC_TRUE=''
DOT=''
DOXYGEN='/usr/bin/doxygen'
ECHO='echo'
ECHO_C=''
ECHO_N='-n'
ECHO_T=''
EFENCE_LIBS=''
EGREP='/bin/grep -E'
ENABLE_DOXYGEN_FALSE=''
ENABLE_DOXYGEN_TRUE='#'
EXEEXT=''
F77=''
FFLAGS=''
GCONFTOOL='/usr/bin/gconftool-2'
GCONF_CFLAGS='-DORBIT2=1 -pthread -I/usr/include/gconf/2 -I/usr/include/orbit-2.0 -I/usr/include/glib-2.0 -I/usr/lib/glib-2.0/include  '
GCONF_LIBS='-pthread -lgconf-2 -lORBit-2 -lgthread-2.0 -lrt -lgobject-2.0 -lglib-2.0  '
GCONF_SCHEMAS_INSTALL_FALSE='#'
GCONF_SCHEMAS_INSTALL_TRUE=''
GCONF_SCHEMA_CONFIG_SOURCE='xml::${prefix}/etc/gconf/gconf.xml.defaults'
GCONF_SCHEMA_CONFIG_SOURCE_DIRONLY='${prefix}/etc/gconf/gconf.xml.defaults'
GCONF_SCHEMA_FILE_DIR='$(sysconfdir)/gconf/schemas'
GDK_PIXBUF_CFLAGS='-I/usr/include/gtk-2.0 -I/usr/include/glib-2.0 -I/usr/lib/glib-2.0/include'
GDK_PIXBUF_LIBS='-lgdk_pixbuf-2.0 -lm -lgobject-2.0 -lgmodule-2.0 -ldl -lglib-2.0  '
GETTEXT_PACKAGE='gnucash'
GLADE_CFLAGS='-I/usr/include/libglade-2.0 -I/usr/include/gtk-2.0 -I/usr/include/libxml2 -I/usr/lib/gtk-2.0/include -I/usr/include/atk-1.0 -I/usr/include/cairo -I/usr/include/pango-1.0 -I/usr/include/glib-2.0 -I/usr/lib/glib-2.0/include -I/usr/include/freetype2 -I/usr/include/libpng12'
GLADE_LIBS='-lglade-2.0 -lgtk-x11-2.0 -lxml2 -lgdk-x11-2.0 -latk-1.0 -lgdk_pixbuf-2.0 -lm -lpangocairo-1.0 -lfontconfig -lXext -lXrender -lXinerama -lXi -lXrandr -lXcursor -lXcomposite -lXdamage -lpango-1.0 -lcairo -lX11 -lXfixes -lgobject-2.0 -lgmodule-2.0 -ldl -lglib-2.0  '
GLIB26_LIBS=''
GLIB_CFLAGS='-pthread -I/usr/include/glib-2.0 -I/usr/lib/glib-2.0/include  '
GLIB_GENMARSHAL='glib-genmarshal'
GLIB_LIBS='-pthread -Wl,--export-dynamic -lgthread-2.0 -lrt -lgobject-2.0 -lgmodule-2.0 -ldl -lglib-2.0  '
GLIB_MKENUMS='glib-mkenums'
GMOFILES=' ca.gmo cs.gmo da.gmo de.gmo el.gmo en_GB.gmo es_NI.gmo es.gmo eu.gmo fr.gmo hu.gmo it.gmo ja.gmo nb.gmo ne.gmo nl.gmo pl.gmo pt_BR.gmo pt.gmo ro.gmo ru.gmo rw.gmo sk.gmo sv.gmo ta.gmo tr.gmo uk.gmo zh_CN.gmo zh_TW.gmo'
GMSGFMT='/usr/bin/msgfmt'
GNC_ACCOUNTS_DIR='${GNC_SHAREDIR}/accounts'
GNC_ADD_ON_SRFIS=''
GNC_CHECKS_DIR='${GNC_SHAREDIR}/checks'
GNC_CONFIGDIR='${sysconfdir}/gnucash'
GNC_CTAGS_FILE=''
GNC_CTAGS_FILE_FALSE=''
GNC_CTAGS_FILE_TRUE='#'
GNC_DOC_INSTALL_DIR='${pkgdatadir}/doc'
GNC_ETAGS_FILE=''
GNC_ETAGS_FILE_FALSE=''
GNC_ETAGS_FILE_TRUE='#'
GNC_GLADE_DIR='${GNC_SHAREDIR}/glade'
GNC_HAVE_GUILE_WWW_FALSE='#'
GNC_HAVE_GUILE_WWW_TRUE=''
GNC_HELPDIR='${datadir}'
GNC_INCLUDE_DIR='${includedir}/gnucash'
GNC_LIBEXECDIR='${libexecdir}/gnucash'
GNC_PIXMAP_DIR='${GNC_SHAREDIR}/pixmaps'
GNC_SCM_INSTALL_DIR='${pkgdatadir}/scm'
GNC_SHAREDIR='${pkgdatadir}'
GNC_SRFI_LOAD_PATH=''
GNC_TEST_SRFI_LOAD_CMD=''
GNC_UI_DIR='${GNC_SHAREDIR}/ui'
GNOME_CFLAGS='-DORBIT2=1 -pthread -I/usr/include/libgnomeui-2.0 -I/usr/include/libart-2.0 -I/usr/include/gconf/2 -I/usr/include/gnome-keyring-1 -I/usr/include/libgnome-2.0 -I/usr/include/libbonoboui-2.0 -I/usr/include/libgnomecanvas-2.0 -I/usr/include/gtk-2.0 -I/usr/include/gnome-vfs-2.0 -I/usr/lib/gnome-vfs-2.0/include -I/usr/include/orbit-2.0 -I/usr/include/glib-2.0 -I/usr/lib/glib-2.0/include -I/usr/include/libbonobo-2.0 -I/usr/include/bonobo-activation-2.0 -I/usr/include/libxml2 -I/usr/include/pango-1.0 -I/usr/include/freetype2 -I/usr/include/gail-1.0 -I/usr/include/atk-1.0 -I/usr/lib/gtk-2.0/include -I/usr/include/cairo -I/usr/include/libpng12'
GNOME_LIBS='-pthread -lgnomeui-2 -lSM -lICE -lbonoboui-2 -lgnomevfs-2 -lgnomecanvas-2 -lgnome-2 -lpopt -lbonobo-2 -lbonobo-activation -lart_lgpl_2 -lgtk-x11-2.0 -lgdk-x11-2.0 -latk-1.0 -lgdk_pixbuf-2.0 -lm -lpangocairo-1.0 -lfontconfig -lXext -lXrender -lXinerama -lXi -lXrandr -lXcursor -lXcomposite -lXdamage -lpango-1.0 -lcairo -lX11 -lXfixes -lgconf-2 -lgmodule-2.0 -ldl -lORBit-2 -lgthread-2.0 -lrt -lgobject-2.0 -lglib-2.0  '
GNOME_PRINT_CFLAGS=''
GNOME_PRINT_LIBS=''
GNUCASH_ENABLE_GUI_FALSE='#'
GNUCASH_ENABLE_GUI_TRUE=''
GNUCASH_MAJOR_VERSION='2'
GNUCASH_MICRO_VERSION='1'
GNUCASH_MINOR_VERSION='2'
GNUCASH_SEPARATE_BUILDDIR_FALSE=''
GNUCASH_SEPARATE_BUILDDIR_TRUE='#'
GOBJECT_QUERY='gobject-query'
GOFFICE_CFLAGS='-I/usr/include/libgoffice-0.4 -I/usr/include/glib-2.0 -I/usr/lib/glib-2.0/include -I/usr/include/libgsf-1 -I/usr/include/libxml2 -I/usr/include/gtk-2.0 -I/usr/include/libglade-2.0 -I/usr/include/libgnomeprint-2.2 -I/usr/include/libart-2.0 -I/usr/include/cairo -I/usr/include/pango-1.0 -I/usr/lib/gtk-2.0/include -I/usr/include/atk-1.0 -I/usr/include/freetype2 -I/usr/include/libpng12'
GOFFICE_LIBS='-lgoffice-0 -lgsf-1 -lglade-2.0 -lgnomeprint-2-2 -lz -lgtk-x11-2.0 -lgdk-x11-2.0 -latk-1.0 -lgdk_pixbuf-2.0 -lm -lpangocairo-1.0 -lfontconfig -lXext -lXrender -lXinerama -lXi -lXrandr -lXcursor -lXcomposite -lXdamage -lX11 -lXfixes -lart_lgpl_2 -lxml2 -lpango-1.0 -lcairo -lgobject-2.0 -lgmodule-2.0 -ldl -lglib-2.0  '
GREP='/bin/grep'
GTKHTML_CFLAGS='-DORBIT2=1 -pthread -I/usr/include/libgtkhtml-3.14 -I/usr/include/gtk-2.0 -I/usr/include/libgnomeui-2.0 -I/usr/include/libglade-2.0 -I/usr/lib/gtk-2.0/include -I/usr/include/atk-1.0 -I/usr/include/cairo -I/usr/include/pango-1.0 -I/usr/include/glib-2.0 -I/usr/lib/glib-2.0/include -I/usr/include/freetype2 -I/usr/include/libpng12 -I/usr/include/libart-2.0 -I/usr/include/gconf/2 -I/usr/include/gnome-keyring-1 -I/usr/include/libgnome-2.0 -I/usr/include/libbonoboui-2.0 -I/usr/include/libgnomecanvas-2.0 -I/usr/include/gnome-vfs-2.0 -I/usr/lib/gnome-vfs-2.0/include -I/usr/include/orbit-2.0 -I/usr/include/libbonobo-2.0 -I/usr/include/bonobo-activation-2.0 -I/usr/include/libxml2 -I/usr/include/gail-1.0'
GTKHTML_LIBS='-pthread -lgtkhtml-3.14 -lgnomeui-2 -lSM -lICE -lglade-2.0 -lbonoboui-2 -lgnomevfs-2 -lgnomecanvas-2 -lgnome-2 -lpopt -lbonobo-2 -lbonobo-activation -lart_lgpl_2 -lgconf-2 -lORBit-2 -lgthread-2.0 -lrt -lgtk-x11-2.0 -lxml2 -lgdk-x11-2.0 -latk-1.0 -lgdk_pixbuf-2.0 -lm -lpangocairo-1.0 -lfontconfig -lXext -lXrender -lXinerama -lXi -lXrandr -lXcursor -lXcomposite -lXdamage -lpango-1.0 -lcairo -lX11 -lXfixes -lgobject-2.0 -lgmodule-2.0 -ldl -lglib-2.0  '
GTKHTML_USES_GTKPRINT_FALSE='#'
GTKHTML_USES_GTKPRINT_TRUE=''
GTK_CFLAGS='-I/usr/include/gtk-2.0 -I/usr/lib/gtk-2.0/include -I/usr/include/atk-1.0 -I/usr/include/cairo -I/usr/include/pango-1.0 -I/usr/include/glib-2.0 -I/usr/lib/glib-2.0/include -I/usr/include/freetype2 -I/usr/include/libpng12'
GTK_LIBS='-lgtk-x11-2.0 -lgdk-x11-2.0 -latk-1.0 -lgdk_pixbuf-2.0 -lm -lpangocairo-1.0 -lfontconfig -lXext -lXrender -lXinerama -lXi -lXrandr -lXcursor -lXcomposite -lXdamage -lpango-1.0 -lcairo -lX11 -lXfixes -lgobject-2.0 -lgmodule-2.0 -ldl -lglib-2.0  '
GUILE='/usr/bin/guile'
GUILE_CONFIG='/usr/bin/guile-config'
GUILE_FALSE='#'
GUILE_INCS=''
GUILE_LIBS='-lguile -lguile-ltdl -lqthreads -lpthread -lcrypt -lm'
GUILE_TOOLS='/usr/bin/guile-tools'
GUILE_TRUE=''
HAVE_GLIB_2_8_FALSE='#'
HAVE_GLIB_2_8_TRUE=''
HAVE_GTK_2_10_FALSE='#'
HAVE_GTK_2_10_TRUE=''
HBCI_CFLAGS=''
HBCI_DIR=''
HBCI_LIBS=''
HTMLHELP_LIBS=''
INSTALL_DATA='${INSTALL} -m 644'
INSTALL_PROGRAM='${INSTALL}'
INSTALL_SCRIPT='${INSTALL}'
INSTALL_STRIP_PROGRAM='${SHELL} $(install_sh) -c -s'
INSTOBJEXT='.mo'
INTLLIBS=''
INTLTOOL_CAVES_RULE='%.caves:     %.caves.in     $(INTLTOOL_MERGE) $(wildcard $(top_srcdir)/po/*.po) ; LC_ALL=C $(INTLTOOL_MERGE) -d -u -c $(top_builddir)/po/.intltool-merge-cache $(top_srcdir)/po $< $@'
INTLTOOL_DESKTOP_RULE='%.desktop:   %.desktop.in   $(INTLTOOL_MERGE) $(wildcard $(top_srcdir)/po/*.po) ; LC_ALL=C $(INTLTOOL_MERGE) -d -u -c $(top_builddir)/po/.intltool-merge-cache $(top_srcdir)/po $< $@'
INTLTOOL_DIRECTORY_RULE='%.directory: %.directory.in $(INTLTOOL_MERGE) $(wildcard $(top_srcdir)/po/*.po) ; LC_ALL=C $(INTLTOOL_MERGE) -d -u -c $(top_builddir)/po/.intltool-merge-cache $(top_srcdir)/po $< $@'
INTLTOOL_EXTRACT='$(top_builddir)/intltool-extract'
INTLTOOL_KBD_RULE='%.kbd:       %.kbd.in       $(INTLTOOL_MERGE) $(wildcard $(top_srcdir)/po/*.po) ; LC_ALL=C $(INTLTOOL_MERGE) -x -u -m -c $(top_builddir)/po/.intltool-merge-cache $(top_srcdir)/po $< $@'
INTLTOOL_KEYS_RULE='%.keys:      %.keys.in      $(INTLTOOL_MERGE) $(wildcard $(top_srcdir)/po/*.po) ; LC_ALL=C $(INTLTOOL_MERGE) -k -u -c $(top_builddir)/po/.intltool-merge-cache $(top_srcdir)/po $< $@'
INTLTOOL_MERGE='$(top_builddir)/intltool-merge'
INTLTOOL_OAF_RULE='%.oaf:       %.oaf.in       $(INTLTOOL_MERGE) $(wildcard $(top_srcdir)/po/*.po) ; LC_ALL=C $(INTLTOOL_MERGE) -o -p $(top_srcdir)/po $< $@'
INTLTOOL_PERL='/usr/bin/perl'
INTLTOOL_POLICY_RULE='%.policy:    %.policy.in    $(INTLTOOL_MERGE) $(wildcard $(top_srcdir)/po/*.po) ; LC_ALL=C $(INTLTOOL_MERGE) -x -u -c $(top_builddir)/po/.intltool-merge-cache $(top_srcdir)/po $< $@'
INTLTOOL_PONG_RULE='%.pong:      %.pong.in      $(INTLTOOL_MERGE) $(wildcard $(top_srcdir)/po/*.po) ; LC_ALL=C $(INTLTOOL_MERGE) -x -u -c $(top_builddir)/po/.intltool-merge-cache $(top_srcdir)/po $< $@'
INTLTOOL_PROP_RULE='%.prop:      %.prop.in      $(INTLTOOL_MERGE) $(wildcard $(top_srcdir)/po/*.po) ; LC_ALL=C $(INTLTOOL_MERGE) -d -u -c $(top_builddir)/po/.intltool-merge-cache $(top_srcdir)/po $< $@'
INTLTOOL_SCHEMAS_RULE='%.schemas:   %.schemas.in   $(INTLTOOL_MERGE) $(wildcard $(top_srcdir)/po/*.po) ; LC_ALL=C $(INTLTOOL_MERGE) -s -u -c $(top_builddir)/po/.intltool-merge-cache $(top_srcdir)/po $< $@'
INTLTOOL_SERVER_RULE='%.server:    %.server.in    $(INTLTOOL_MERGE) $(wildcard $(top_srcdir)/po/*.po) ; LC_ALL=C $(INTLTOOL_MERGE) -o -u -c $(top_builddir)/po/.intltool-merge-cache $(top_srcdir)/po $< $@'
INTLTOOL_SERVICE_RULE='%.service: %.service.in   $(INTLTOOL_MERGE) $(wildcard $(top_srcdir)/po/*.po) ; LC_ALL=C $(INTLTOOL_MERGE) -d -u -c $(top_builddir)/po/.intltool-merge-cache $(top_srcdir)/po $< $@'
INTLTOOL_SHEET_RULE='%.sheet:     %.sheet.in     $(INTLTOOL_MERGE) $(wildcard $(top_srcdir)/po/*.po) ; LC_ALL=C $(INTLTOOL_MERGE) -x -u -c $(top_builddir)/po/.intltool-merge-cache $(top_srcdir)/po $< $@'
INTLTOOL_SOUNDLIST_RULE='%.soundlist: %.soundlist.in $(INTLTOOL_MERGE) $(wildcard $(top_srcdir)/po/*.po) ; LC_ALL=C $(INTLTOOL_MERGE) -d -u -c $(top_builddir)/po/.intltool-merge-cache $(top_srcdir)/po $< $@'
INTLTOOL_THEME_RULE='%.theme:     %.theme.in     $(INTLTOOL_MERGE) $(wildcard $(top_srcdir)/po/*.po) ; LC_ALL=C $(INTLTOOL_MERGE) -d -u -c $(top_builddir)/po/.intltool-merge-cache $(top_srcdir)/po $< $@'
INTLTOOL_UI_RULE='%.ui:        %.ui.in        $(INTLTOOL_MERGE) $(wildcard $(top_srcdir)/po/*.po) ; LC_ALL=C $(INTLTOOL_MERGE) -x -u -c $(top_builddir)/po/.intltool-merge-cache $(top_srcdir)/po $< $@'
INTLTOOL_UPDATE='$(top_builddir)/intltool-update'
INTLTOOL_XAM_RULE='%.xam:       %.xml.in       $(INTLTOOL_MERGE) $(wildcard $(top_srcdir)/po/*.po) ; LC_ALL=C $(INTLTOOL_MERGE) -x -u -c $(top_builddir)/po/.intltool-merge-cache $(top_srcdir)/po $< $@'
INTLTOOL_XML_NOMERGE_RULE='%.xml:       %.xml.in       $(INTLTOOL_MERGE) ; LC_ALL=C $(INTLTOOL_MERGE) -x -u /tmp $< $@'
INTLTOOL_XML_RULE='%.xml:       %.xml.in       $(INTLTOOL_MERGE) $(wildcard $(top_srcdir)/po/*.po) ; LC_ALL=C $(INTLTOOL_MERGE) -x -u -c $(top_builddir)/po/.intltool-merge-cache $(top_srcdir)/po $< $@'
LC_MESSAGES_ENUM='LC_MESSAGES'
LDFLAGS=''
LIBOBJS=''
LIBOBJS_SEDSCRIPT='s,\.[^.]* ,&,g;s,\.[^.]*$$,&,'
LIBOFX_CFLAGS=''
LIBOFX_LIBS=' -lofx'
LIBQOF_BACKEND_QSF_LIBRARY_VERSION='0:3:0'
LIBQOF_LIBRARY_VERSION='1:4:0'
LIBS='-lpopt -lm -lpthread  -lm'
LIBTOOL='$(SHELL) $(top_builddir)/libtool'
LIBTOOL_DEPS='./ltmain.sh'
LIBXML2_CFLAGS='-I/usr/include/libxml2'
LIBXML2_LIBS='-lxml2  '
LIBXML_VERSION='0.22'
LN_S='ln -s'
LTLIBOBJS=''
MAKEINFO='${SHELL} /home/administrator/development/gnucash/trunk/missing --run makeinfo'
MKINSTALLDIRS='./mkinstalldirs'
MSGFMT='/usr/bin/msgfmt'
MSGFMT_OPTS='-c'
OBJEXT='o'
OFX_DIR=''
OS_WIN32_FALSE=''
OS_WIN32_TRUE='#'
PACKAGE='gnucash'
PACKAGE_BUGREPORT='gnucash-devel@gnucash.org'
PACKAGE_NAME='gnucash'
PACKAGE_STRING='gnucash 2.2.1'
PACKAGE_TARNAME='gnucash'
PACKAGE_VERSION='2.2.1'
PATH_SEPARATOR=':'
PERL='/usr/bin/perl'
PERLINCL='/usr/lib/perl/5.8'
PGSQL_CFLAGS=''
PGSQL_LIBS=''
PKG_CONFIG='/usr/bin/pkg-config'
PLATFORM_WIN32_FALSE=''
PLATFORM_WIN32_TRUE='#'
POFILES=' ca.po cs.po da.po de.po el.po en_GB.po es_NI.po es.po eu.po fr.po hu.po it.po ja.po nb.po ne.po nl.po pl.po pt_BR.po pt.po ro.po ru.po rw.po sk.po sv.po ta.po tr.po uk.po zh_CN.po zh_TW.po'
POSUB='po'
PO_IN_DATADIR_FALSE=''
PO_IN_DATADIR_TRUE=''
QOF_CFLAGS='-I${top_builddir}/lib/libqof/qof -I${top_srcdir}/lib/libqof/qof'
QOF_LIBS='${top_builddir}/lib/libqof/qof/libgnc-qof.la'
QOF_LIB_DIR='${pkglibdir}'
QOF_PREFIX='internal'
QOF_XML_DIR='${pkgdatadir}/xml/qsf'
QTTHREADS_LIB='-lqthreads'
RANLIB='ranlib'
READLINE_LIB='-lreadline'
REGEX_LIBS=''
SED='/bin/sed'
SET_MAKE=''
SHELL='/bin/bash'
SQL_DIR=''
STRIP='strip'
SWIG='/usr/bin/swig'
TERMCAP_LIB='-ltermcap'
USE_LIBQOF=''
USE_LIBQOF_FALSE='#'
USE_LIBQOF_TRUE=''
USE_NLS='yes'
VERSION='2.2.1'
XGETTEXT='/usr/bin/xgettext'
ac_ct_CC='gcc'
ac_ct_CXX='g++'
ac_ct_F77=''
am__fastdepCC_FALSE='#'
am__fastdepCC_TRUE=''
am__fastdepCXX_FALSE='#'
am__fastdepCXX_TRUE=''
am__include='include'
am__leading_dot='.'
am__quote=''
am__tar='${AMTAR} chof - "$$tardir"'
am__untar='${AMTAR} xf -'
aqbanking_data=''
aqbanking_dir=''
aqbanking_includes=''
aqbanking_libs=''
aqbanking_libspp=''
aqbanking_plugins=''
bindir='${exec_prefix}/bin'
build='i686-pc-linux-gnu'
build_alias=''
build_cpu='i686'
build_os='linux-gnu'
build_vendor='pc'
cflags_set='yes'
datadir='${datarootdir}'
datarootdir='${prefix}/share'
docdir='${datarootdir}/doc/${PACKAGE_TARNAME}'
dvidir='${docdir}'
enable_dot='no'
enable_html_docs='yes'
enable_latex_docs='no'
exec_prefix='${prefix}'
host='i686-pc-linux-gnu'
host_alias=''
host_cpu='i686'
host_os='linux-gnu'
host_vendor='pc'
htmldir='${docdir}'
includedir='${prefix}/include'
infodir='${datarootdir}/info'
install_sh='/home/administrator/development/gnucash/trunk/install-sh'
libdir='${exec_prefix}/lib'
libexecdir='${exec_prefix}/libexec'
localedir='${datarootdir}/locale'
localstatedir='${prefix}/var'
mandir='${datarootdir}/man'
mkdir_p='mkdir -p --'
oldincludedir='/usr/include'
pdfdir='${docdir}'
prefix='/usr/local'
program_transform_name='s,x,x,'
psdir='${docdir}'
sbindir='${exec_prefix}/sbin'
sharedstatedir='${prefix}/com'
sysconfdir='${prefix}/etc'
target_alias=''

## ----------- ##
## confdefs.h. ##
## ----------- ##

#define PACKAGE_NAME "gnucash"
#define PACKAGE_TARNAME "gnucash"
#define PACKAGE_VERSION "2.2.1"
#define PACKAGE_STRING "gnucash 2.2.1"
#define PACKAGE_BUGREPORT "gnucash-devel@gnucash.org"
#define PACKAGE "gnucash"
#define VERSION "2.2.1"
#define _GNU_SOURCE 1
#define GNUCASH_MAJOR_VERSION 2
#define GNUCASH_MINOR_VERSION 2
#define GNUCASH_MICRO_VERSION 1
#define GETTEXT_PACKAGE "gnucash"
#define STDC_HEADERS 1
#define HAVE_SYS_TYPES_H 1
#define HAVE_SYS_STAT_H 1
#define HAVE_STDLIB_H 1
#define HAVE_STRING_H 1
#define HAVE_MEMORY_H 1
#define HAVE_STRINGS_H 1
#define HAVE_INTTYPES_H 1
#define HAVE_STDINT_H 1
#define HAVE_UNISTD_H 1
#define HAVE_LOCALE_H 1
#define HAVE_LC_MESSAGES 1
#define HAVE_BIND_TEXTDOMAIN_CODESET 1
#define HAVE_GETTEXT 1
#define HAVE_DCGETTEXT 1
#define ENABLE_NLS 1
#define HAVE_DLFCN_H 1
#define STDC_HEADERS 1
#define HAVE_LIMITS_H 1
#define HAVE_SYS_TIMES_H 1
#define HAVE_SYS_WAIT_H 1
#define HAVE_STPCPY 1
#define HAVE_MEMCPY 1
#define HAVE_TIMEGM 1
#define HAVE_TOWUPPER 1
#define HAVE_SETENV 1
#define HAVE_STRUCT_TM_GMTOFF 1
#define HAVE_SCANF_LLD 1
#define HAVE_X11_XLIB_H 1
#define HAVE_GLOB_H 1
#define HAVE_CHOWN 1
#define HAVE_GETHOSTNAME 1
#define HAVE_GETPPID 1
#define HAVE_GETUID 1
#define HAVE_GETTIMEOFDAY 1
#define HAVE_GMTIME_R 1
#define HAVE_GETHOSTID 1
#define HAVE_LINK 1
#define ENABLE_BINRELOC
#define HAVE_LIBPTHREAD 1
#define BR_PTHREAD 1
#define HAVE_GLIB_2_8 1
#define HAVE_GLIB29 1
#define HAVE_GLIB_2_12 1
#define HAVE_DLFCN_H 1
#define HAVE_UTMP_H 1
#define HAVE_LOCALE_H 1
#define HAVE_MCHECK_H 1
#define HAVE_UNISTD_H 1
#define HAVE_WCTYPE_H 1
#define HAVE_DLERROR 1
#define HAVE_LIBM 1
#define HAVE_GUILE 1
#define GNC_GUILE_MAJOR_VERSION 1
#define GNC_GUILE_MINOR_VERSION 6
#define GNC_GUILE_MICRO_VERSION 8
#define GUILE_LONG_LONG_OK 1
#define HAVE_LIBQOF
#define QOF_DISABLE_DEPRECATED 1
#define DEBUG_MEMORY 0
#define DEBUG_REFERENCE_COUNTING 0
#define HAVE_LANGINFO_D_FMT 1
#define HAVE_POPT_H 1
#define HAVE_LIBPOPT 1
#define HAVE_GTK_2_10 1
#define GOFFICE_WITH_CAIRO 1
#define GTKHTML_USES_GTKPRINT 1
#define GNOME
#define HAVE_PTHREAD_MUTEX_INIT 1
#define HAVE_STRPTIME 1
#define HAVE_LOCALTIME_R 1

configure: exit 0