All pastes #751381 Raw Edit

MenAreAnts

public text v1 · immutable
#751381 ·published 2007-10-27 10:08 UTC
rendered paste body
maxiounet@ArToPsi:~/MenAreAnts$ make
make  all-recursive
make[1]: entrant dans le répertoire « /home/maxiounet/MenAreAnts »
Making all in lib
make[2]: entrant dans le répertoire « /home/maxiounet/MenAreAnts/lib »
make[3]: entrant dans le répertoire « /home/maxiounet/MenAreAnts »
make[3]: quittant le répertoire « /home/maxiounet/MenAreAnts »
if g++ -DHAVE_CONFIG_H -I. -I. -I..     -g -O2  -O2 -MT Outils.o -MD -MP -MF ".deps/Outils.Tpo" -c -o Outils.o Outils.cpp; \
        then mv -f ".deps/Outils.Tpo" ".deps/Outils.Po"; else rm -f ".deps/Outils.Tpo"; exit 1; fi
if g++ -DHAVE_CONFIG_H -I. -I. -I..     -g -O2  -O2 -MT Channels.o -MD -MP -MF ".deps/Channels.Tpo" -c -o Channels.o Channels.cpp; \
        then mv -f ".deps/Channels.Tpo" ".deps/Channels.Po"; else rm -f ".deps/Channels.Tpo"; exit 1; fi
if g++ -DHAVE_CONFIG_H -I. -I. -I..     -g -O2  -O2 -MT Debug.o -MD -MP -MF ".deps/Debug.Tpo" -c -o Debug.o Debug.cpp; \
        then mv -f ".deps/Debug.Tpo" ".deps/Debug.Po"; else rm -f ".deps/Debug.Tpo"; exit 1; fi
if g++ -DHAVE_CONFIG_H -I. -I. -I..     -g -O2  -O2 -MT Map.o -MD -MP -MF ".deps/Map.Tpo" -c -o Map.o Map.cpp; \
        then mv -f ".deps/Map.Tpo" ".deps/Map.Po"; else rm -f ".deps/Map.Tpo"; exit 1; fi
if g++ -DHAVE_CONFIG_H -I. -I. -I..     -g -O2  -O2 -MT Batiments.o -MD -MP -MF ".deps/Batiments.Tpo" -c -o Batiments.o Batiments.cpp; \
        then mv -f ".deps/Batiments.Tpo" ".deps/Batiments.Po"; else rm -f ".deps/Batiments.Tpo"; exit 1; fi
if g++ -DHAVE_CONFIG_H -I. -I. -I..     -g -O2  -O2 -MT Units.o -MD -MP -MF ".deps/Units.Tpo" -c -o Units.o Units.cpp; \
        then mv -f ".deps/Units.Tpo" ".deps/Units.Po"; else rm -f ".deps/Units.Tpo"; exit 1; fi
if g++ -DHAVE_CONFIG_H -I. -I. -I..     -g -O2  -O2 -MT LibConfig.o -MD -MP -MF ".deps/LibConfig.Tpo" -c -o LibConfig.o LibConfig.cpp; \
        then mv -f ".deps/LibConfig.Tpo" ".deps/LibConfig.Po"; else rm -f ".deps/LibConfig.Tpo"; exit 1; fi
rm -f libmenareants.a
ar cru libmenareants.a Outils.o Channels.o Debug.o Map.o Batiments.o Units.o LibConfig.o 
ranlib libmenareants.a
Make a Version.h...
make[2]: quittant le répertoire « /home/maxiounet/MenAreAnts/lib »
Making all in src
make[2]: entrant dans le répertoire « /home/maxiounet/MenAreAnts/src »
make[3]: entrant dans le répertoire « /home/maxiounet/MenAreAnts »
make[3]: quittant le répertoire « /home/maxiounet/MenAreAnts »
Making all in data
make[3]: entrant dans le répertoire « /home/maxiounet/MenAreAnts/src/data »
make[4]: entrant dans le répertoire « /home/maxiounet/MenAreAnts »
make[4]: quittant le répertoire « /home/maxiounet/MenAreAnts »
make[3]: Rien à faire pour « all ».
make[3]: quittant le répertoire « /home/maxiounet/MenAreAnts/src/data »
make[3]: entrant dans le répertoire « /home/maxiounet/MenAreAnts/src »
make[4]: entrant dans le répertoire « /home/maxiounet/MenAreAnts »
make[4]: quittant le répertoire « /home/maxiounet/MenAreAnts »
if g++ -DPKGDATADIR=\"/usr/local/share/menareants/\" -DHAVE_CONFIG_H -I. -I. -I.. -I../lib   -DINSTALL_LOCALEDIR=\"/usr/local/share/locale\" -g -O2  -O2 -MT Font.o -MD -MP -MF ".deps/Font.Tpo" -c -o Font.o `test -f 'tools/Font.cpp' || echo './'`tools/Font.cpp; \
        then mv -f ".deps/Font.Tpo" ".deps/Font.Po"; else rm -f ".deps/Font.Tpo"; exit 1; fi
tools/Font.cpp:40:23: erreur: SDL_image.h : Aucun fichier ou répertoire de ce type
tools/Font.cpp:41:23: erreur: SDL_video.h : Aucun fichier ou répertoire de ce type
Dans le fichier inclus à partir de tools/Font.cpp:44:
tools/Font.h:43:17: erreur: SDL.h : Aucun fichier ou répertoire de ce type
tools/Font.h:44:21: erreur: SDL_ttf.h : Aucun fichier ou répertoire de ce type
tools/Color.h:50: erreur: «Uint8" does not name a type
tools/Color.h:51: erreur: «Uint8" does not name a type
tools/Color.h:52: erreur: «Uint8" does not name a type
tools/Color.h:53: erreur: «Uint8" does not name a type
tools/Color.h:57: erreur: expected `)' before «r"
tools/Color.h:61: erreur: «Uint8" has not been declared
tools/Color.h:61: erreur: «Uint8" has not been declared
tools/Color.h:61: erreur: «Uint8" has not been declared
tools/Color.h:61: erreur: «Uint8" has not been declared
tools/Color.h:63: erreur: «Uint8" does not name a type
tools/Color.h:64: erreur: «Uint8" does not name a type
tools/Color.h:65: erreur: «Uint8" does not name a type
tools/Color.h:66: erreur: «Uint8" does not name a type
tools/Color.h:68: erreur: «SDL_Color" does not name a type
tools/Color.h:71: erreur: no matching function for call to «Color::Color(int, int, int, int)"
tools/Color.h:56: note: candidats sont: Color::Color()
tools/Color.h:48: note:                 Color::Color(const Color&)
tools/Color.h:72: erreur: no matching function for call to «Color::Color(int, int, int, int)"
tools/Color.h:56: note: candidats sont: Color::Color()
tools/Color.h:48: note:                 Color::Color(const Color&)
tools/Color.h:73: erreur: no matching function for call to «Color::Color(int, int, int, int)"
tools/Color.h:56: note: candidats sont: Color::Color()
tools/Color.h:48: note:                 Color::Color(const Color&)
tools/Color.h:74: erreur: no matching function for call to «Color::Color(int, int, int, int)"
tools/Color.h:56: note: candidats sont: Color::Color()
tools/Color.h:48: note:                 Color::Color(const Color&)
tools/Color.h:75: erreur: no matching function for call to «Color::Color(int, int, int, int)"
tools/Color.h:56: note: candidats sont: Color::Color()
tools/Color.h:48: note:                 Color::Color(const Color&)
tools/Color.h:76: erreur: no matching function for call to «Color::Color(int, int, int, int)"
tools/Color.h:56: note: candidats sont: Color::Color()
tools/Color.h:48: note:                 Color::Color(const Color&)
tools/Color.h:77: erreur: no matching function for call to «Color::Color(int, int, int, int)"
tools/Color.h:56: note: candidats sont: Color::Color()
tools/Color.h:48: note:                 Color::Color(const Color&)
tools/Color.h:78: erreur: no matching function for call to «Color::Color(int, int, int, int)"
tools/Color.h:56: note: candidats sont: Color::Color()
tools/Color.h:48: note:                 Color::Color(const Color&)
tools/Color.h:79: erreur: no matching function for call to «Color::Color(int, int, int, int)"
tools/Color.h:56: note: candidats sont: Color::Color()
tools/Color.h:48: note:                 Color::Color(const Color&)
tools/Color.h:80: erreur: no matching function for call to «Color::Color(int, int, int, int)"
tools/Color.h:56: note: candidats sont: Color::Color()
tools/Color.h:48: note:                 Color::Color(const Color&)
tools/Color.h:81: erreur: no matching function for call to «Color::Color(int, int, int, int)"
tools/Color.h:56: note: candidats sont: Color::Color()
tools/Color.h:48: note:                 Color::Color(const Color&)
tools/Color.h:84: erreur: no matching function for call to «Color::Color(int, int, int, int)"
tools/Color.h:56: note: candidats sont: Color::Color()
tools/Color.h:48: note:                 Color::Color(const Color&)
tools/Color.h:85: erreur: no matching function for call to «Color::Color(int, int, int, int)"
tools/Color.h:56: note: candidats sont: Color::Color()
tools/Color.h:48: note:                 Color::Color(const Color&)
tools/Color.h:86: erreur: no matching function for call to «Color::Color(int, int, int, int)"
tools/Color.h:56: note: candidats sont: Color::Color()
tools/Color.h:48: note:                 Color::Color(const Color&)
tools/Color.h:87: erreur: no matching function for call to «Color::Color(int, int, int, int)"
tools/Color.h:56: note: candidats sont: Color::Color()
tools/Color.h:48: note:                 Color::Color(const Color&)
tools/Color.h:88: erreur: no matching function for call to «Color::Color(int, int, int, int)"
tools/Color.h:56: note: candidats sont: Color::Color()
tools/Color.h:48: note:                 Color::Color(const Color&)
tools/Color.h:90: erreur: no matching function for call to «Color::Color(int, int, int, int)"
tools/Color.h:56: note: candidats sont: Color::Color()
tools/Color.h:48: note:                 Color::Color(const Color&)
tools/Color.h:91: erreur: no matching function for call to «Color::Color(int, int, int, int)"
tools/Color.h:56: note: candidats sont: Color::Color()
tools/Color.h:48: note:                 Color::Color(const Color&)
tools/Color.h:92: erreur: no matching function for call to «Color::Color(int, int, int, int)"
tools/Color.h:56: note: candidats sont: Color::Color()
tools/Color.h:48: note:                 Color::Color(const Color&)
tools/Color.h:93: erreur: no matching function for call to «Color::Color(int, int, int, int)"
tools/Color.h:56: note: candidats sont: Color::Color()
tools/Color.h:48: note:                 Color::Color(const Color&)
tools/Images.h:36: erreur: «Uint32" does not name a type
tools/Images.h:37: erreur: variable or field «putpixel" declared void
tools/Images.h:37: erreur: «SDL_Surface" was not declared in this scope
tools/Images.h:37: erreur: «surface" was not declared in this scope
tools/Images.h:37: erreur: expected primary-expression before «int"
tools/Images.h:37: erreur: expected primary-expression before «int"
tools/Images.h:37: erreur: «Uint32" was not declared in this scope
tools/Images.h:37: erreur: initializer liste d'expressions traitée comme une expression composée
tools/Images.h:38: erreur: variable or field «DrawRect" declared void
tools/Images.h:38: erreur: «SDL_Surface" was not declared in this scope
tools/Images.h:38: erreur: «screen" was not declared in this scope
tools/Images.h:38: erreur: expected primary-expression before «int"
tools/Images.h:38: erreur: expected primary-expression before «int"
tools/Images.h:38: erreur: expected primary-expression before «int"
tools/Images.h:38: erreur: expected primary-expression before «int"
tools/Images.h:38: erreur: «Uint32" was not declared in this scope
tools/Images.h:38: erreur: initializer liste d'expressions traitée comme une expression composée
tools/Images.h:40: erreur: expected constructor, destructor, or type conversion before «*" token
tools/Images.h:41: erreur: expected constructor, destructor, or type conversion before «*" token
tools/Images.h:42: erreur: variable or field «DrawLine" declared void
tools/Images.h:42: erreur: «SDL_Surface" was not declared in this scope
tools/Images.h:42: erreur: «screen" was not declared in this scope
tools/Images.h:42: erreur: expected primary-expression before «int"
tools/Images.h:42: erreur: expected primary-expression before «int"
tools/Images.h:42: erreur: expected primary-expression before «int"
tools/Images.h:42: erreur: expected primary-expression before «int"
tools/Images.h:42: erreur: «Uint32" was not declared in this scope
tools/Images.h:42: erreur: initializer liste d'expressions traitée comme une expression composée
tools/Images.h:43: erreur: variable or field «DrawLargeLine" declared void
tools/Images.h:43: erreur: «SDL_Surface" was not declared in this scope
tools/Images.h:43: erreur: «screen" was not declared in this scope
tools/Images.h:43: erreur: expected primary-expression before «int"
tools/Images.h:43: erreur: expected primary-expression before «int"
tools/Images.h:43: erreur: expected primary-expression before «int"
tools/Images.h:43: erreur: expected primary-expression before «int"
tools/Images.h:43: erreur: «Uint32" was not declared in this scope
tools/Images.h:43: erreur: initializer liste d'expressions traitée comme une expression composée
tools/Images.h:176: erreur: expected `)' before «*" token
tools/Images.h:180: erreur: «Uint32" has not been declared
tools/Images.h:214: erreur: «SDL_Rect" has not been declared
tools/Images.h:214: erreur: «SDL_Rect" has not been declared
tools/Images.h:215: erreur: «SDL_Rect" has not been declared
tools/Images.h:219: erreur: «SDL_Rect" has not been declared
tools/Images.h:219: erreur: «SDL_Rect" has not been declared
tools/Images.h:220: erreur: «SDL_Rect" has not been declared
tools/Images.h:225: erreur: «SDL_Rect" does not name a type
tools/Images.h:226: erreur: «SDL_Rect" does not name a type
tools/Images.h:232: erreur: «Uint32" has not been declared
tools/Images.h:232: erreur: «Uint8" has not been declared
tools/Images.h:232: erreur: «Uint8" has not been declared
tools/Images.h:232: erreur: «Uint8" has not been declared
tools/Images.h:232: erreur: «Uint8" has not been declared
tools/Images.h:234: erreur: «Uint32" does not name a type
tools/Images.h:236: erreur: «Uint32" has not been declared
tools/Images.h:238: erreur: «Uint32" does not name a type
tools/Images.h:242: erreur: «Uint32" has not been declared
tools/Images.h:244: erreur: «SDL_Rect" has not been declared
tools/Images.h:244: erreur: «Uint32" has not been declared
tools/Images.h:245: erreur: «SDL_Rect" has not been declared
tools/Images.h:247: erreur: «Uint32" has not been declared
tools/Images.h:255: erreur: «Uint32" does not name a type
tools/Images.h:256: erreur: «Uint32" has not been declared
tools/Images.h:261: erreur: «SDL_Surface" has not been declared
tools/Images.h:263: erreur: ISO C++ forbids declaration of «SDL_Surface" with no type
tools/Images.h:263: erreur: expected «;" before «*" token
tools/Images.h:265: erreur: expected `;' before «bool"
tools/Images.h:281: erreur: ISO C++ forbids declaration of «SDL_Surface" with no type
tools/Images.h:281: erreur: expected «;" before «*" token
tools/Images.h: In constructor «ECImage::ECImage()":
tools/Images.h:179: erreur: class «ECImage" does not have any field named «Img"
tools/Images.h: In member function «int ECImage::GetWidth() const":
tools/Images.h:200: erreur: «Img" was not declared in this scope
tools/Images.h: In member function «int ECImage::GetHeight() const":
tools/Images.h:203: erreur: «Img" was not declared in this scope
tools/Images.h: In member function «void ECImage::Lock()":
tools/Images.h:252: erreur: «Img" was not declared in this scope
tools/Images.h:252: erreur: «SDL_LockSurface" was not declared in this scope
tools/Images.h: In member function «void ECImage::Unlock()":
tools/Images.h:253: erreur: «Img" was not declared in this scope
tools/Images.h:253: erreur: «SDL_UnlockSurface" was not declared in this scope
tools/Images.h: In member function «void ECImage::SetImage(int*, bool)":
tools/Images.h:261: erreur: «Img" was not declared in this scope
tools/Images.h: In member function «bool ECImage::IsNull() const":
tools/Images.h:265: erreur: «Img" was not declared in this scope
tools/Images.h: In member function «unsigned char* ECImage::GetPixels() const":
tools/Images.h:276: erreur: «Img" was not declared in this scope
tools/Font.h: At global scope:
tools/Font.h:61: erreur: ISO C++ forbids declaration of «TTF_Font" with no type
tools/Font.h:61: erreur: expected «;" before «*" token
tools/Font.h:79: erreur: ISO C++ forbids declaration of «TTF_Font" with no type
tools/Font.h:79: erreur: expected «;" before «&" token
tools/Font.h:81: erreur: expected `;' before «void"
tools/Video.h:84: erreur: ISO C++ forbids declaration of «SDL_Surface" with no type
tools/Video.h:84: erreur: expected «;" before «*" token
tools/Font.cpp: In constructor «Font::Font(int)":
tools/Font.cpp:74: erreur: «m_font" was not declared in this scope
tools/Font.cpp: In destructor «Font::~Font()":
tools/Font.cpp:84: erreur: «m_font" was not declared in this scope
tools/Font.cpp:85: erreur: «TTF_CloseFont" was not declared in this scope
tools/Font.cpp: In member function «bool Font::Load(const std::string&, int)":
tools/Font.cpp:103: erreur: «m_font" was not declared in this scope
tools/Font.cpp:103: erreur: «TTF_OpenFont" was not declared in this scope
tools/Font.cpp:112: erreur: «m_font" was not declared in this scope
tools/Font.cpp:112: erreur: «TTF_STYLE_NORMAL" was not declared in this scope
tools/Font.cpp:112: erreur: «TTF_SetFontStyle" was not declared in this scope
tools/Font.cpp: In member function «void Font::Write(int, int, ECImage&)":
tools/Font.cpp:119: erreur: «SDL_Rect" was not declared in this scope
tools/Font.cpp:119: erreur: expected `;' before «pos"
tools/Font.cpp:120: erreur: «pos" was not declared in this scope
tools/Font.cpp: In member function «ECImage Font::CreateSurface(const std::string&, const Color&)":
tools/Font.cpp:165: erreur: «m_font" was not declared in this scope
tools/Font.cpp:165: erreur: «const class Color" has no member named «GetSDLColor"
tools/Font.cpp:165: erreur: «TTF_RenderUTF8_Blended" was not declared in this scope
tools/Font.cpp: In member function «int Font::GetWidth(const std::string&)":
tools/Font.cpp:200: erreur: «m_font" was not declared in this scope
tools/Font.cpp:200: erreur: «TTF_SizeUTF8" was not declared in this scope
tools/Font.cpp: In member function «int Font::GetHeight()":
tools/Font.cpp:207: erreur: «m_font" was not declared in this scope
tools/Font.cpp:207: erreur: «TTF_FontHeight" was not declared in this scope
tools/Font.cpp: In member function «int Font::GetHeight(const std::string&)":
tools/Font.cpp:214: erreur: «m_font" was not declared in this scope
tools/Font.cpp:214: erreur: «TTF_SizeUTF8" was not declared in this scope
make[3]: *** [Font.o] Erreur 1
make[3]: quittant le répertoire « /home/maxiounet/MenAreAnts/src »
make[2]: *** [all-recursive] Erreur 1
make[2]: quittant le répertoire « /home/maxiounet/MenAreAnts/src »
make[1]: *** [all-recursive] Erreur 1
make[1]: quittant le répertoire « /home/maxiounet/MenAreAnts »
make: *** [all] Erreur 2