rendered paste body build07 started "build kde4-kitchensyc.spec" at Fri Oct 26 16:57:22 UTC 2007.
Building kde4-kitchensync for project 'home:felixmoeller2' repository 'openSUSE_Factory' arch 'i586' srcmd5 'add05ce6bfce0dae02f1b7000305bc06
Using BUILD_ROOT=/abuild/root_1/.mount
Using BUILD_ARCH=i586:i486:i386
Doing XEN build in /abuild/root_1/root
processing specfile /abuild/root_1/.build-srcdir/kde4-kitchensyc.spec...
running changelog2spec --target rpm --file /abuild/root_1/.build-srcdir/kde4-kitchensyc.spec
init_buildsystem --rpmlist /abuild/root_1/.rpmlist kde4-kitchensyc.spec ...
preinstalling aaa_base...
preinstalling acl...
preinstalling attr...
preinstalling bash...
preinstalling coreutils...
preinstalling diffutils...
preinstalling filesystem...
preinstalling fillup...
preinstalling glibc...
preinstalling grep...
preinstalling insserv...
preinstalling libacl...
preinstalling libattr...
preinstalling libbz2-1...
preinstalling libgcc42...
preinstalling libxcrypt...
preinstalling m4...
preinstalling ncurses...
preinstalling pam...
preinstalling permissions...
preinstalling popt...
preinstalling libreadline5...
preinstalling rpm...
preinstalling sed...
preinstalling tar...
preinstalling zlib...
preinstalling util-linux...
preinstalling perl-base...
preinstalling libdb-4_5...
preinstalling libvolume_id...
copying packages...
reordering...cycle: libqt4-x11 -> libqt4-qt3support
breaking dependency libqt4-x11 -> libqt4-qt3support
cycle: avahi -> nss-mdns
breaking dependency avahi -> nss-mdns
cycle: avahi -> avahi-glib
breaking dependency avahi-glib -> avahi
cycle: kdebase4-runtime -> kde4-kdialog
breaking dependency kdebase4-runtime -> kde4-kdialog
done
starting xen virtual machine
Bootdata ok (command line is root=/dev/hda1 ro init=/.build/build panic=1 console=ttyS0)
Linux version 2.6.16.46-0.7-xen (geeko@buildhost) (gcc version 4.1.2 20070115 (prerelease) (SUSE Linux)) #1 SMP Mon Apr 23 16:13:18 UTC 2007
BIOS-provided physical RAM map:
Xen: 0000000000000000 - 0000000037800000 (usable)
No mptable found.
Built 1 zonelists
Kernel command line: root=/dev/hda1 ro init=/.build/build panic=1 console=ttyS0
Initializing CPU#0
PID hash table entries: 4096 (order: 12, 131072 bytes)
Xen reported: 2192.836 MHz processor.
Console: colour dummy device 80x25
Dentry cache hash table entries: 131072 (order: 8, 1048576 bytes)
Inode-cache hash table entries: 65536 (order: 7, 524288 bytes)
Software IO TLB disabled
Memory: 871680k/909312k available (1902k kernel code, 28704k reserved, 798k data, 160k init)
Calibrating delay using timer specific routine.. 5484.54 BogoMIPS (lpj=10969092)
Security Framework v1.0.0 initialized
Mount-cache hash table entries: 256
CPU: L1 I Cache: 64K (64 bytes/line), D cache 64K (64 bytes/line)
CPU: L2 Cache: 1024K (64 bytes/line)
checking if image is initramfs... it is
Freeing initrd memory: 7224k freed
Brought up 1 CPUs
migration_cost=0
DMI not present or invalid.
Grant table initialized
NET: Registered protocol family 16
Brought up 1 CPUs
PCI: setting up Xen PCI frontend stub
ACPI: Subsystem revision 20060127
ACPI: Interpreter disabled.
xen_mem: Initialising balloon driver.
Setting mem allocation to 901120 kiB
PCI: System does not support PCI
PCI: System does not support PCI
IA32 emulation $Id: sys_ia32.c,v 1.32 2002/03/24 13:02:28 ak Exp $
audit: initializing netlink socket (disabled)
audit(1193417866.063:1): initialized
VFS: Disk quotas dquot_6.5.1
Dquot-cache hash table entries: 512 (order 0, 4096 bytes)
Initializing Cryptographic API
io scheduler noop registered
io scheduler anticipatory registered
io scheduler deadline registered
io scheduler cfq registered (default)
rtc: IRQ 8 is not free.
Non-volatile memory driver v1.2
i8042.c: No controller found.
RAMDISK driver initialized: 16 RAM disks of 128000K size 1024 blocksize
xencons_init: Initializing xen vfb; pass xencons=tty to prevent this
Xen virtual console successfully installed as xvc0
Event-channel device installed.
mice: PS/2 mouse device common for all mice
input: PC Speaker as /class/input/input0
md: md driver 0.90.3 MAX_MD_DEVS=256, MD_SB_DISKS=27
md: bitmap version 4.39
NET: Registered protocol family 2
IP route cache hash table entries: 32768 (order: 6, 262144 bytes)
TCP established hash table entries: 131072 (order: 9, 2097152 bytes)
TCP bind hash table entries: 65536 (order: 8, 1048576 bytes)
TCP: Hash tables configured (established 131072 bind 65536)
TCP reno registered
NET: Registered protocol family 1
XENBUS: Device with no driver: device/vbd/769
XENBUS: Device with no driver: device/vbd/770
XENBUS: Device with no driver: device/console/0
Starting udevd
Creating devices
Loading xennet
netfront: Initialising virtual ethernet driver.
Loading xenblk
Registering block device major 3
blkfront: hda1: barriers enabled
blkfront: hda2: barriers enabled
Loading reiserfs
Loading jbd
Loading ext3
Waiting for device /dev/hda1 to appear: ok
rootfs: major=3 minor=1 devn=769
Mounting root /dev/hda1
ReiserFS: hda1: found reiserfs format "3.6" with standard journal
ReiserFS: hda1: using ordered data mode
reiserfs: using flush barriers
ReiserFS: hda1: journal params: device hda1, size 8192, journal first block 18, max trans len 1024, max batch 900, max commit age 30, max trans age 30
ReiserFS: hda1: checking transaction log (hda1)
ReiserFS: hda1: Using r5 hash to sort names
machine type: x86_64
switching personality to 134217736...
machine type: i686
reiserfs: enabling write barrier flush mode
swapon on /dev/hda2
Adding 1025016k swap on /dev/hda2. Priority:-1 extents:1 across:1025016k
logging output to //.build.log...
build07 started "build kde4-kitchensyc.spec" at Fri Oct 26 16:57:47 UTC 2007.
Building kde4-kitchensync for project 'home:felixmoeller2' repository 'openSUSE_Factory' arch 'i586' srcmd5 'add05ce6bfce0dae02f1b7000305bc06
Using BUILD_ROOT=/
Using BUILD_ARCH=i586:i486:i386
processing specfile /.build-srcdir/kde4-kitchensyc.spec...
init_buildsystem kde4-kitchensyc.spec ...
running aaa_base preinstall script
running aaa_base postinstall script
Updating etc/sysconfig/language...
Updating etc/sysconfig/backup...
Updating etc/sysconfig/boot...
Updating etc/sysconfig/kernel...
Updating etc/sysconfig/suseconfig...
Updating etc/sysconfig/clock...
Updating etc/sysconfig/proxy...
Updating etc/sysconfig/windowmanager...
Updating etc/sysconfig/sysctl...
Updating etc/sysconfig/cron...
Updating etc/sysconfig/news...
Updating etc/sysconfig/shutdown...
Updating etc/sysconfig/sw_management...
Updating etc/passwd...unchanged
Updating etc/group...unchanged
Updating etc/shadow...new
initializing rpm db...
installing curl-ca-bundle-7.16.4-10
installing desktop-translations-10.3-59
installing filesystem-10.3-47
installing hicolor-icon-theme-0.10-34
installing kde4-filesystem-3.93.0-2
installing openssl-certs-0.9.8e-40
installing glibc-2.6.1-12
warning: /etc/bindresvport.blacklist created as /etc/bindresvport.blacklist.rpmnew
warning: /etc/default/nss created as /etc/default/nss.rpmnew
warning: /etc/nsswitch.conf created as /etc/nsswitch.conf.rpmnew
warning: /etc/rpc created as /etc/rpc.rpmnew
installing oxygen-icon-theme-3.93.0-3
installing audit-libs-1.5.5-10
installing cpp42-4.2.1_20070724-12
installing fdupes-1.40-41
installing fillup-1.42-176
installing gdbm-1.8.3-299
installing glibc-locale-2.6.1-12
installing keyutils-libs-1.2-39
installing libattr-2.4.28-78
installing libbz2-1-1.0.4-39
installing libdb-4_5-4.5.20-26
installing libdrm-2.3.0-40
installing libjpeg-6.2.0-809
installing libltdl-3-1.5.24-14
installing libnl-1.0-78
installing libnscd-2.0.2-40
installing libxcrypt-2.4-68
installing mktemp-1.5-801
installing ncurses-5.6-37
installing net-tools-1.60-647
installing patch-2.5.9-216
installing perl-base-5.8.8-73
installing pkg-config-0.21-35
installing popt-1.7-364
installing xorg-x11-libICE-7.2-57
installing xorg-x11-libXau-7.2-50
installing xorg-x11-libXdmcp-7.2-49
installing zlib-1.2.3-72
installing libattr-devel-2.4.28-78
installing libbz2-devel-1.0.4-39
installing libjpeg-devel-6.2.0-75
installing zlib-devel-1.2.3-72
installing attr-2.4.28-78
installing file-4.21-4
installing freetype2-2.3.5-15
installing libacl-2.2.34-72
installing libpng-1.2.18-12
installing libreadline5-5.2-15
installing pinentry-0.7.2-111
installing pmtools-20061026-41
installing xorg-x11-libSM-7.2-54
installing xorg-x11-libfontenc-7.2-55
installing xorg-x11-libxcb-7.2-46
installing sqlite-3.4.1-10
installing acl-2.2.34-72
installing bash-3.2-56
installing libxml2-2.6.29-17
installing xorg-x11-proto-devel-7.2-62
installing bluez-libs-3.18-2
installing cpp-4.2-21
installing cracklib-2.8.10-34
installing insserv-1.09.0-43
installing libasound2-1.0.14-27
installing libcom_err2-1.40.2-15
installing libdaemon-0.12-14
installing libexpat1-2.0.1-21
installing libgcc42-4.2.1_20070724-12
installing libgomp42-4.2.1_20070724-12
installing libgpg-error-1.4-56
installing libical-0.24.RC4-137
installing libmudflap42-4.2.1_20070724-12
installing libuuid1-1.40.2-15
installing libvolume_id-114-10
installing libzio-0.4-40
installing pth-2.0.7-40
installing bzip2-1.0.4-39
installing freetype2-devel-2.3.5-15
installing iproute2-2.6.22-22
installing timezone-2007g-4
WARNING: Not updating /etc/localtime with new zone file
installing update-desktop-files-10.3-59
installing xorg-x11-libX11-7.2-70
installing less-406-11
installing libopenssl0_9_8-0.9.8e-40
installing libexpat-devel-2.0.1-21
installing libical-devel-0.24.RC4-137
installing libopenssl-devel-0.9.8e-40
installing xorg-x11-libXfixes-7.2-59
installing xorg-x11-libXrender-7.2-59
installing xorg-x11-libxkbfile-7.2-58
installing xorg-x11-xtrans-devel-7.2-52
installing libgpg-error-devel-1.4-56
installing libksba-1.0.2-8
installing libmysqlclient15-5.0.45-15
installing libmysqlclient_r15-5.0.45-15
installing libstdc++42-4.2.1_20070724-12
installing wireless-tools-29pre22-10
installing xorg-x11-fonts-devel-7.2-49
installing xorg-x11-libXau-devel-7.2-50
installing xorg-x11-libXdmcp-devel-7.2-49
installing xorg-x11-libXext-7.2-59
installing xorg-x11-libfontenc-devel-7.2-55
installing wpa_supplicant-0.5.8-21
installing xorg-x11-libXt-7.2-60
installing xorg-x11-util-devel-7.2-50
installing fontconfig-2.4.2-40
installing giflib-4.1.4-80
installing openssl-0.9.8e-40
installing dbus-1-x11-1.0.2-61
installing info-4.9-12
installing pam-0.99.8.1-12
warning: /etc/environment created as /etc/environment.rpmnew
warning: /etc/pam.d/common-account created as /etc/pam.d/common-account.rpmnew
warning: /etc/pam.d/common-auth created as /etc/pam.d/common-auth.rpmnew
warning: /etc/pam.d/common-password created as /etc/pam.d/common-password.rpmnew
warning: /etc/pam.d/common-session created as /etc/pam.d/common-session.rpmnew
warning: /etc/pam.d/other created as /etc/pam.d/other.rpmnew
warning: /etc/securetty created as /etc/securetty.rpmnew
warning: /etc/security/access.conf created as /etc/security/access.conf.rpmnew
warning: /etc/security/group.conf created as /etc/security/group.conf.rpmnew
warning: /etc/security/limits.conf created as /etc/security/limits.conf.rpmnew
warning: /etc/security/namespace.conf created as /etc/security/namespace.conf.rpmnew
warning: /etc/security/namespace.init created as /etc/security/namespace.init.rpmnew
warning: /etc/security/pam_env.conf created as /etc/security/pam_env.conf.rpmnew
warning: /etc/security/time.conf created as /etc/security/time.conf.rpmnew
installing python-2.5.1-32
installing giflib-devel-4.1.4-80
installing python-devel-2.5.1-32
installing automake-1.10-43
installing binutils-2.17.50.20070726-10
installing clucene-core-0.9.16-34
installing cpio-2.9-14
installing diffutils-2.8.7-77
installing findutils-4.2.31-21
installing gawk-3.1.5g-22
installing grep-2.5.2-25
installing gzip-1.3.12-31
installing libidn-1.0-8
installing libtool-1.5.24-14
installing m4-1.4.10-14
installing make-3.81-62
installing pcre-7.2-11
installing sed-4.1.5-61
installing tar-1.17-18
installing xorg-x11-libXv-7.2-55
installing xorg-x11-libxcb-devel-7.2-46
installing gmp-4.2.1-55
installing libgcrypt-1.2.4-35
installing libicu-3.6-10
installing libsmbios-libs-0.13.6-2
installing libusb-0.1.12-69
installing xorg-x11-libICE-devel-7.2-57
installing xorg-x11-libXp-7.2-54
installing gettext-0.16-43
installing libtiff3-3.8.2-65
installing coreutils-6.9-40
warning: /etc/default/su created as /etc/default/su.rpmnew
installing cvs-1.12.12-82
installing parted-1.8.7-34
installing xorg-x11-libXmu-7.2-59
installing aspell-0.60.5-42
installing texinfo-4.9-12
installing xorg-x11-libXpm-7.2-59
installing libidn-devel-1.0-8
installing glib2-2.14.0-3
installing libusb-devel-0.1.12-69
installing linux-kernel-headers-2.6.22-15
post linux-kernel-headers-2.6.22-15 /var/tmp/rpm-tmp.63390 1
`usr/include/asm' -> `asm-bi-x86_64'
installing gmp-devel-4.2.1-55
installing sysvinit-2.86-99
telinit: timeout opening/writing control channel /dev/initctl
installing autoconf-2.61-44
installing libpisock9-0.12.2-20
installing nscd-2.6.1-12
installing sgml-skel-0.6-342
installing libcurl4-7.16.4-10
installing liblcms-1.16-36
installing xorg-x11-libSM-devel-7.2-54
installing libxslt-1.1.20-37
installing boost-1.33.1-102
installing cups-libs-1.2.12-13
installing cyrus-sasl-2.1.22-76
installing resmgr-1.1.0_SVNr143-8
installing xorg-x11-libX11-devel-7.2-70
installing xorg-x11-libXprintUtil-7.2-54
installing groff-1.18.1.1-96
Updating etc/sysconfig/suseconfig...
installing krb5-1.6.2-15
installing libbotan-1_6_3-1.6.3-8
installing perl-5.8.8-73
Updating etc/sysconfig/suseconfig...
installing aaa_base-10.3-78
warning: /etc/DIR_COLORS created as /etc/DIR_COLORS.rpmnew
warning: /etc/inittab created as /etc/inittab.rpmnew
warning: /root/.exrc created as /root/.exrc.rpmnew
Updating etc/sysconfig/language...
Updating etc/sysconfig/backup...
Updating etc/sysconfig/boot...
Updating etc/sysconfig/kernel...
Updating etc/sysconfig/suseconfig...
Updating etc/sysconfig/clock...
Updating etc/sysconfig/proxy...
Updating etc/sysconfig/windowmanager...
Updating etc/sysconfig/sysctl...
Updating etc/sysconfig/cron...
Updating etc/sysconfig/news...
Updating etc/sysconfig/shutdown...
Updating etc/sysconfig/sw_management...
Updating etc/passwd...unchanged
Updating etc/group...unchanged
Updating etc/shadow...unchanged
installing boost-devel-1.33.1-102
installing liblcms-devel-1.16-36
installing libpisock-devel-0.12.2-20
installing libmal1-0.44-16
installing atk-1.19.6-14
installing netcfg-10.3-36
warning: /etc/HOSTNAME created as /etc/HOSTNAME.rpmnew
installing openldap2-client-2.3.37-13
installing dhcp-3.0.6-17
installing libbotan-devel-1.6.3-8
installing libopensync1-0.33_SVN2594-1.1
installing glibc-devel-2.6.1-12
installing libmng-1.0.10-11
installing libxklavier-3.2-17
installing permissions-2007.8.10-8
warning: /etc/permissions.local created as /etc/permissions.local.rpmnew
Updating etc/sysconfig/security...
installing postgresql-libs-8.2.4-21
installing setserial-2.17-651
installing libqt4-4.3.1-13
installing xorg-x11-libXext-devel-7.2-59
installing cmake-2.4.7-12
installing libraptor1-1.4.15-35
installing shared-mime-info-0.22-10
installing xorg-x11-libXfixes-devel-7.2-59
installing xorg-x11-libXrender-devel-7.2-59
installing xorg-x11-libxkbfile-devel-7.2-58
installing man-2.4.3-81
Updating etc/sysconfig/cron...
installing xorg-x11-libXt-devel-7.2-60
installing xorg-x11-libs-7.2-96
installing alsa-devel-1.0.14-27
installing cyrus-sasl-devel-2.1.22-76
installing libdb-4_5-devel-4.5.20-26
installing libmal1-devel-0.44-16
installing librasqal0-0.9.14-34
installing libstdc++42-devel-4.2.1_20070724-12
installing sqlite-devel-3.4.1-10
installing cups-devel-1.2.12-13
installing libraptor-devel-1.4.15-35
installing fontconfig-devel-2.4.2-40
installing libgcrypt-devel-1.2.4-35
installing libmng-devel-1.0.10-11
installing libpng-devel-1.2.18-12
installing libsoprano3-0.9.0-31
installing libxml2-devel-2.6.29-17
installing gettext-devel-0.16-43
installing glib2-devel-2.14.0-3
installing pam-modules-10.3-44
installing gcc42-4.2.1_20070724-12
installing libqca2-2.0.0-4
installing libqt4-sql-4.3.1-13
installing libsmbclient-3.0.25c-3
installing xorg-x11-libXp-devel-7.2-54
installing dhcp-client-3.0.6-17
installing dirmngr-1.0.0-11
installing gnokii-0.6.18-19
installing libmysqlclient-devel-5.0.45-15
installing postgresql-devel-8.2.4-21
installing xorg-x11-libXv-devel-7.2-55
installing Mesa-7.0.1-12
installing rpm-4.4.2-136
Updating etc/sysconfig/services...
installing xorg-x11-libXmu-devel-7.2-59
installing xorg-x11-libXpm-devel-7.2-59
installing util-linux-2.12r+2.13rc2+git20070725-18
warning: /etc/filesystems created as /etc/filesystems.rpmnew
warning: /etc/raw created as /etc/raw.rpmnew
installing libstdc++-devel-4.2-21
installing atk-devel-1.19.6-14
installing gcc-4.2-21
installing gcc42-c++-4.2.1_20070724-12
installing librasqal-devel-0.9.14-34
installing openldap2-devel-2.3.37-13
installing glitz-0.5.6-80
installing pam-config-0.23-6
*** load_obsolete_conf (...)
*** load_config (/etc/pam.d/common-account, account, ...)
**** [account, required, pam_unix2.so, ]
**** parse_config_unix2 (account): ''
*** load_config (/etc/pam.d/common-auth, auth, ...)
**** [auth, required, pam_env.so, ]
**** parse_config_env (auth): ''
**** [auth, required, pam_unix2.so, ]
**** parse_config_unix2 (auth): ''
*** load_config (/etc/pam.d/common-password, password, ...)
**** [password, required, pam_pwcheck.so, nullok cracklib]
**** parse_config_pwcheck (password): 'nullok cracklib'
**** [password, required, pam_unix2.so, nullok use_authtok]
**** parse_config_unix2 (password): 'nullok use_authtok'
*** load_config (/etc/pam.d/common-session, session, ...)
**** [session, required, pam_limits.so, ]
**** parse_config_limits (session): ''
**** [session, required, pam_unix2.so, ]
**** parse_config_unix2 (session): ''
**** [session, optional, pam_umask.so, ]
**** parse_config_umask (session): ''
*** write_config (account, /etc/pam.d/common-account-pc, ...)
**** write_config_unix2 (...)
**** write_config_unix (...)
**** write_config_krb5 (...)
**** write_config_localuser (...)
**** write_config_ldap (...)
**** write_config_nam (...)
**** write_config_winbind (...)
*** write_config (auth, /etc/pam.d/common-auth-pc, ...)
**** write_config_env (...)
**** write_config_pkcs11 (...)
**** write_config_thinkfinger (...)
**** write_config_unix2 (...)
**** write_config_unix (...)
**** write_config_krb5 (...)
**** write_config_ldap (...)
**** write_config_nam (...)
**** write_config_winbind (...)
*** write_config (password, /etc/pam.d/common-password-pc, ...)
**** write_config_winbind (...)
**** write_config_pwcheck (...)
**** write_config_cracklib (...)
**** write_config_unix2 (...)
**** write_config_unix (...)
**** write_config_make (...)
**** write_config_krb5 (...)
**** write_config_ldap (...)
**** write_config_nam (...)
*** write_config (session, /etc/pam.d/common-session-pc, ...)
**** write_config_mkhomedir (...)
**** write_config_limits (...)
**** write_config_unix2 (...)
**** write_config_unix (...)
**** write_config_apparmor (...)
**** write_config_krb5 (...)
**** write_config_ldap (...)
**** write_config_winbind (...)
**** write_config_nam (...)
**** write_config_umask (...)
**** write_config_env (...)
installing libopensync-devel-0.33_SVN2594-1.1
installing libxslt-devel-1.1.20-37
installing libredland0-1.0.6-34
installing pwdutils-3.1.4-20
installing xorg-x11-libXprintUtil-devel-7.2-54
installing gpg2-2.0.4-38
installing gcc-c++-4.2-21
installing gpgme-1.1.5-21
installing pcre-devel-7.2-11
installing aspell-devel-0.60.5-42
installing libtiff-devel-3.8.2-65
installing dbus-1-1.0.2-56
installing soprano-0.9.0-31
installing libredland-devel-1.0.6-34
installing cairo-1.4.10-19
installing xorg-x11-devel-7.2-96
installing Mesa-devel-7.0.1-12
installing dbus-1-devel-1.0.2-56
installing dbus-1-glib-0.74-19
installing dhcdbd-1.14-61
installing libgpgme11-1.1.5-21
installing libqt4-dbus-1-4.3.1-13
installing gnokii-devel-0.6.18-19
installing pango-1.18.1-2
installing glitz-devel-0.5.6-80
installing libgpgme-devel-1.1.5-21
installing libkdecore4-3.93.0-3
installing strigi-0.5.5-11
installing ConsoleKit-0.2.1-48
installing gtk2-2.11.6-20
installing strigi-devel-0.5.5-11
installing libglade2-2.6.2-12
installing PolicyKit-0.4-15
installing cairo-devel-1.4.10-19
installing pango-devel-1.18.1-2
installing hal-0.5.9_git20070831-2
installing sysconfig-0.70.0-10
Updating etc/sysconfig/network/dhcp...
Updating etc/sysconfig/network/config...
Removing old autogenerated device configuration files:
installing gtk2-devel-2.11.6-20
installing NetworkManager-0.6.5-22
installing avahi-glib-0.6.20-31
installing libqt4-x11-4.3.1-13
installing libqt4-qt3support-4.3.1-13
installing avahi-0.6.20-31
installing avahi-compat-mDNSResponder-0.6.20-31
installing avahi-devel-0.6.20-31
installing nss-mdns-0.9-36
installing libkde4-3.93.0-3
installing libqt4-devel-4.3.1-13
installing avahi-compat-mDNSResponder-devel-0.6.20-31
installing libsoprano-devel-0.9.0-31
installing libqca2-devel-2.0.0-4
installing kdelibs4-core-3.93.0-3
installing libkonq4-3.93.0-3
installing kdelibs4-doc-3.93.0-3
installing libkdecore4-devel-3.93.0-3
installing kdelibs4-3.93.0-3
installing libkde4-devel-3.93.0-3
installing libkdepimlibs4-3.93.0-3
installing kdepimlibs4-3.93.0-3
installing libkdepimlibs4-devel-3.93.0-3
installing kdebase4-runtime-3.93.0-3
installing kde4-kdialog-3.93.0-3
installing kdebase4-3.93.0-3
installing kdebase4-workspace-3.93.0-3
installing kdebase4-devel-3.93.0-3
installing kdebase4-workspace-devel-3.93.0-3
removing nis flags from //etc/nsswitch.conf...
now finalizing build dir...
Checking permissions and ownerships - using the permissions files
/tmp/Check.perms.Wo3326
setting /usr/src/packages/SOURCES/ to root:root 1777. (wrong permissions 0755)
setting /usr/src/packages/BUILD/ to root:root 1777. (wrong permissions 0755)
setting /usr/src/packages/RPMS/ to root:root 1777. (wrong permissions 0755)
setting /usr/src/packages/RPMS/athlon/ to root:root 1777. (wrong permissions 0755)
setting /usr/src/packages/RPMS/i386/ to root:root 1777. (wrong permissions 0755)
setting /usr/src/packages/RPMS/i486/ to root:root 1777. (wrong permissions 0755)
setting /usr/src/packages/RPMS/i586/ to root:root 1777. (wrong permissions 0755)
setting /usr/src/packages/RPMS/i686/ to root:root 1777. (wrong permissions 0755)
setting /usr/src/packages/RPMS/noarch/ to root:root 1777. (wrong permissions 0755)
setting /usr/src/packages/SPECS/ to root:root 1777. (wrong permissions 0755)
setting /usr/src/packages/SRPMS/ to root:root 1777. (wrong permissions 0755)
setting /usr/bin/wall to root:tty 2755. (wrong permissions 0755)
setting /usr/bin/write to root:tty 2755. (wrong permissions 0755)
setting /usr/sbin/mgnokiidev to root:uucp 4755. (wrong permissions 0755)
setting /usr/lib/PolicyKit/polkit-grant-helper to root:polkituser 2755. (wrong permissions 0755)
setting /usr/lib/PolicyKit/polkit-grant-helper-pam to root:root 4755. (wrong permissions 0755)
Starting SuSEconfig, the SuSE Configuration Tool...
Running in full featured mode.
Reading /etc/sysconfig and updating the system...
Executing /sbin/conf.d/SuSEconfig.groff...
Executing /sbin/conf.d/SuSEconfig.gtk2...
Executing /sbin/conf.d/SuSEconfig.perl...
Executing /sbin/conf.d/SuSEconfig.permissions...
Finished.
-----------------------------------------------------------------
I have the following modifications for kde4-kitchensyc.spec:
17c17
< Release: 1
---
> Release: 8.1
-----------------------------------------------------------------
----- building kde4-kitchensyc.spec (user abuild)
-----------------------------------------------------------------
-----------------------------------------------------------------
Executing(%prep): /bin/sh -e /var/tmp/rpm-tmp.71866
+ umask 022
+ cd /usr/src/packages/BUILD
+ cd /usr/src/packages/BUILD
+ rm -rf kde4-kitchensync-0.1_SVN729664
+ /usr/bin/bzip2 -dc /usr/src/packages/SOURCES/kde4-kitchensync-0.1_SVN729664.tar.bz2
+ tar -xf -
+ STATUS=0
+ '[' 0 -ne 0 ']'
+ cd kde4-kitchensync-0.1_SVN729664
++ /usr/bin/id -u
+ '[' 99 = 0 ']'
++ /usr/bin/id -u
+ '[' 99 = 0 ']'
+ /bin/chmod -Rf a+rX,u+w,g-w,o-w .
+ echo 'Patch #0 (kitchensync-fix-build.patch):'
Patch #0 (kitchensync-fix-build.patch):
+ patch -p0 -s
+ cd kitchensync
+ cp /usr/src/packages/SOURCES/CMakeLists-kitchensync-standalone.txt CMakeLists.txt
+ exit 0
Executing(%build): /bin/sh -e /var/tmp/rpm-tmp.27667
+ umask 022
+ cd /usr/src/packages/BUILD
+ /bin/rm -rf /var/tmp/kde4-kitchensync-0.1_SVN729664-build
++ dirname /var/tmp/kde4-kitchensync-0.1_SVN729664-build
+ /bin/mkdir -p /var/tmp
+ /bin/mkdir /var/tmp/kde4-kitchensync-0.1_SVN729664-build
+ cd kde4-kitchensync-0.1_SVN729664
+ cd kitchensync
+ export 'CFLAGS=-march=i586 -mtune=i686 -fmessage-length=0 -Wall -D_FORTIFY_SOURCE=2 -fstack-protector -O2'
+ CFLAGS='-march=i586 -mtune=i686 -fmessage-length=0 -Wall -D_FORTIFY_SOURCE=2 -fstack-protector -O2'
++ echo lib
++ cut -b4-
+ _kde_libsuffix=
+ bdir=.
+ dir=build
+ mkdir build
+ cd build
+ bdir=..
+ cmake -DCMAKE_INSTALL_PREFIX=/usr -DLIB_SUFFIX= -DCMAKE_BUILD_TYPE=debug ..
-- Check for working C compiler: /usr/bin/gcc
-- Check for working C compiler: /usr/bin/gcc -- works
-- Check size of void*
-- Check size of void* - done
-- Check for working CXX compiler: /usr/bin/c++
-- Check for working CXX compiler: /usr/bin/c++ -- works
-- Looking for Q_WS_X11
-- Looking for Q_WS_X11 - found
-- Looking for Q_WS_WIN
-- Looking for Q_WS_WIN - not found.
-- Looking for Q_WS_QWS
-- Looking for Q_WS_QWS - not found.
-- Looking for Q_WS_MAC
-- Looking for Q_WS_MAC - not found.
-- Found Qt-Version 4.3.1
-- Looking for XOpenDisplay in /usr/lib/libX11.so;/usr/lib/libXext.so;/usr/lib/libXft.so;/usr/lib/libXau.so;/usr/lib/libXdmcp.so;/usr/lib/libXpm.so
-- Looking for XOpenDisplay in /usr/lib/libX11.so;/usr/lib/libXext.so;/usr/lib/libXft.so;/usr/lib/libXau.so;/usr/lib/libXdmcp.so;/usr/lib/libXpm.so - found
-- Looking for gethostbyname
-- Looking for gethostbyname - found
-- Looking for connect
-- Looking for connect - found
-- Looking for remove
-- Looking for remove - found
-- Looking for shmat
-- Looking for shmat - found
-- Looking for IceConnectionNumber in ICE
-- Looking for IceConnectionNumber in ICE - found
-- Found X11: /usr/lib/libX11.so
-- Looking for pthread.h
-- Looking for pthread.h - found
-- Looking for pthread_create in pthreads
-- Looking for pthread_create in pthreads - not found
-- Looking for pthread_create in pthread
-- Looking for pthread_create in pthread - found
-- Performing Test HAVE_FPIE_SUPPORT
-- Performing Test HAVE_FPIE_SUPPORT - Success
-- Performing Test __KDE_HAVE_NO_THREADSAFE_STATICS
-- Performing Test __KDE_HAVE_NO_THREADSAFE_STATICS - Success
-- Performing Test __KDE_HAVE_GCC_VISIBILITY
-- Performing Test __KDE_HAVE_GCC_VISIBILITY - Success
-- Found KDE 4.0 include dir: /usr/include
-- Found KDE 4 library dir: /usr/lib
-- Found KDE4 kconfig_compiler preprocessor: /usr/bin/kconfig_compiler
-- Found KDE4 automoc: /usr/bin/kde4automoc
-- Found KDE PIM libraries
-- Found GLIB2: /usr/lib/libglib-2.0.so
-- checking for module 'opensync-1.0>=0.33'
-- found opensync-1.0, version 0.33
-- Configuring done
-- Generating done
-- Build files have been written to: /usr/src/packages/BUILD/kde4-kitchensync-0.1_SVN729664/kitchensync/build
+ /usr/bin/make
[ 1%] Generating qopensync_automoc.cpp
Generating callbackhandler.moc
Scanning dependencies of target qopensync
[ 3%] Building CXX object libqopensync/CMakeFiles/qopensync.dir/qopensync_automoc.o
[ 4%] Building CXX object libqopensync/CMakeFiles/qopensync.dir/callbackhandler.o
In file included from /usr/include/glib-2.0/glib/gslice.h:26,
from /usr/include/glib-2.0/glib/gmem.h:30,
from /usr/include/opensync-1.0/opensync/opensync_list.h:32,
from /usr/include/opensync-1.0/opensync/opensync-support.h:61,
from /usr/include/opensync-1.0/opensync/opensync.h:163,
from /usr/src/packages/BUILD/kde4-kitchensync-0.1_SVN729664/kitchensync/libqopensync/callbackhandler.cpp:22:
/usr/include/glib-2.0/glib/gtypes.h:30:24: error: glibconfig.h: No such file or directory
/usr/include/glib-2.0/glib/gtypes.h:351:5: warning: "G_BYTE_ORDER" is not defined
/usr/include/glib-2.0/glib/gtypes.h:371:7: warning: "G_BYTE_ORDER" is not defined
/usr/include/glib-2.0/glib/gtypes.h:392:2: error: #error unknown ENDIAN type
In file included from /usr/include/opensync-1.0/opensync/opensync_list.h:32,
from /usr/include/opensync-1.0/opensync/opensync-support.h:61,
from /usr/include/opensync-1.0/opensync/opensync.h:163,
from /usr/src/packages/BUILD/kde4-kitchensync-0.1_SVN729664/kitchensync/libqopensync/callbackhandler.cpp:22:
/usr/include/glib-2.0/glib/gmem.h:38:5: warning: "GLIB_SIZEOF_VOID_P" is not defined
/usr/include/glib-2.0/glib/gmem.h:38:26: warning: "GLIB_SIZEOF_LONG" is not defined
In file included from /usr/include/glib-2.0/glib/gmem.h:30,
from /usr/include/opensync-1.0/opensync/opensync_list.h:32,
from /usr/include/opensync-1.0/opensync/opensync-support.h:61,
from /usr/include/opensync-1.0/opensync/opensync.h:163,
from /usr/src/packages/BUILD/kde4-kitchensync-0.1_SVN729664/kitchensync/libqopensync/callbackhandler.cpp:22:
/usr/include/glib-2.0/glib/gslice.h:32: error: 'gsize' was not declared in this scope
/usr/include/glib-2.0/glib/gslice.h:32: warning: attributes after parenthesized initializer ignored
/usr/include/glib-2.0/glib/gslice.h:33: error: 'gsize' was not declared in this scope
/usr/include/glib-2.0/glib/gslice.h:33: warning: attributes after parenthesized initializer ignored
/usr/include/glib-2.0/glib/gslice.h:34: error: 'gsize' was not declared in this scope
/usr/include/glib-2.0/glib/gslice.h:35: error: expected primary-expression before 'mem_block'
/usr/include/glib-2.0/glib/gslice.h:35: warning: attributes after parenthesized initializer ignored
/usr/include/glib-2.0/glib/gslice.h:35: error: initializer expression list treated as compound expression
/usr/include/glib-2.0/glib/gslice.h:36: error: variable or field 'g_slice_free1' declared void
/usr/include/glib-2.0/glib/gslice.h:36: error: 'gsize' was not declared in this scope
/usr/include/glib-2.0/glib/gslice.h:37: error: expected primary-expression before 'mem_block'
/usr/include/glib-2.0/glib/gslice.h:38: error: variable or field 'g_slice_free_chain_with_offset' declared void
/usr/include/glib-2.0/glib/gslice.h:38: error: 'gsize' was not declared in this scope
/usr/include/glib-2.0/glib/gslice.h:39: error: expected primary-expression before 'mem_chain'
/usr/include/glib-2.0/glib/gslice.h:40: error: 'gsize' was not declared in this scope
/usr/include/glib-2.0/glib/gslice.h:78: error: 'gint64' has not been declared
/usr/include/glib-2.0/glib/gslice.h:79: error: 'gint64' does not name a type
/usr/include/glib-2.0/glib/gslice.h:80: error: expected constructor, destructor, or type conversion before '*' token
In file included from /usr/include/opensync-1.0/opensync/opensync_list.h:32,
from /usr/include/opensync-1.0/opensync/opensync-support.h:61,
from /usr/include/opensync-1.0/opensync/opensync.h:163,
from /usr/src/packages/BUILD/kde4-kitchensync-0.1_SVN729664/kitchensync/libqopensync/callbackhandler.cpp:22:
/usr/include/glib-2.0/glib/gmem.h:81: error: 'gsize' has not been declared
/usr/include/glib-2.0/glib/gmem.h:83: error: 'gsize' has not been declared
/usr/include/glib-2.0/glib/gmem.h:86: error: 'gsize' has not been declared
/usr/include/glib-2.0/glib/gmem.h:87: error: 'gsize' has not been declared
/usr/include/glib-2.0/glib/gmem.h:88: error: 'gsize' has not been declared
/usr/include/glib-2.0/glib/gmem.h:90: error: 'gsize' has not been declared
make[2]: *** [libqopensync/CMakeFiles/qopensync.dir/callbackhandler.o] Error 1
make[1]: *** [libqopensync/CMakeFiles/qopensync.dir/all] Error 2
make: *** [all] Error 2
error: Bad exit status from /var/tmp/rpm-tmp.27667 (%build)
RPM build errors:
Bad exit status from /var/tmp/rpm-tmp.27667 (%build)
mount: can't find / in /etc/fstab or /etc/mtab
md: stopping all md devices.
xenbus_dev_shutdown: device/console/0: Initialising != Connected, skipping
System halted