# make
"/usr/bin/python2.4" "/home/zope/Zope-2.10.4-final/setup.py" \
build --build-base="/home/zope/Zope-2.10.4-final/build-base/python-2.4" --build-lib="/home/zope/Zope-2.10.4-final/build-base/python-2.4/build-lib" --build-scripts="/home/zope/Zope-2.10.4-final/build-base/python-2.4/build-scripts" --build-temp="/home/zope/Zope-2.10.4-final/build-base/python-2.4/build-temp"
running build
running build_py
running build_ext
creating zope.proxy
copying zope/proxy/proxy.h -> zope.proxy
building 'AccessControl.cAccessControl' extension
gcc -pthread -fno-strict-aliasing -DNDEBUG -g -O2 -Wall -Wstrict-prototypes -fPIC -IExtensionClass -I. -IAcquisition -I/usr/include/python2.4 -c AccessControl/cAccessControl.c -o /home/zope/Zope-2.10.4-final/build-base/python-2.4/build-temp/AccessControl/cAccessControl.o
En el fichero incluído de AccessControl/cAccessControl.c:51:
./ExtensionClass/ExtensionClass.h:83:20: error: Python.h: No existe el fichero ó directorio
./ExtensionClass/ExtensionClass.h:84:20: error: import.h: No existe el fichero ó directorio
In file included from AccessControl/cAccessControl.c:51:
./ExtensionClass/ExtensionClass.h:95: error: expected specifier-qualifier-list before ‘PyObject_HEAD’
./ExtensionClass/ExtensionClass.h:108: error: expected specifier-qualifier-list before ‘PyObject’
./ExtensionClass/ExtensionClass.h:114: error: ‘NULL’ no se declaró aquí (no en una función)
In file included from AccessControl/cAccessControl.c:52:
./Acquisition/Acquisition.h:19: error: expected specifier-qualifier-list before ‘PyObject’
AccessControl/cAccessControl.c:54:19: error: stdio.h: No existe el fichero ó directorio
AccessControl/cAccessControl.c:55:20: error: stdlib.h: No existe el fichero ó directorio
AccessControl/cAccessControl.c:59: error: expected ‘)’ before ‘*’ token
AccessControl/cAccessControl.c:69: error: expected ‘=’, ‘,’, ‘;’, ‘asm’ or ‘__attribute__’ before ‘*’ token
AccessControl/cAccessControl.c:83: error: expected ‘=’, ‘,’, ‘;’, ‘asm’ or ‘__attribute__’ before ‘*’ token
AccessControl/cAccessControl.c:91: error: expected ‘=’, ‘,’, ‘;’, ‘asm’ or ‘__attribute__’ before ‘*’ token
AccessControl/cAccessControl.c:107: error: expected ‘=’, ‘,’, ‘;’, ‘asm’ or ‘__attribute__’ before ‘*’ token
AccessControl/cAccessControl.c:128: error: expected ‘=’, ‘,’, ‘;’, ‘asm’ or ‘__attribute__’ before ‘*’ token
AccessControl/cAccessControl.c:151: error: expected ‘=’, ‘,’, ‘;’, ‘asm’ or ‘__attribute__’ before ‘*’ token
AccessControl/cAccessControl.c:176: error: expected ‘=’, ‘,’, ‘;’, ‘asm’ or ‘__attribute__’ before ‘*’ token
AccessControl/cAccessControl.c:205: error: expected ‘)’ before ‘*’ token
AccessControl/cAccessControl.c:222: error: expected ‘)’ before ‘*’ token
AccessControl/cAccessControl.c:240: error: expected ‘)’ before ‘*’ token
AccessControl/cAccessControl.c:259: error: expected ‘)’ before ‘*’ token
AccessControl/cAccessControl.c:280: error: expected ‘)’ before ‘*’ token
AccessControl/cAccessControl.c:308: error: expected specifier-qualifier-list before ‘PyObject_HEAD’
AccessControl/cAccessControl.c:312: error: expected specifier-qualifier-list before ‘PyObject_HEAD’
AccessControl/cAccessControl.c:321: error: expected specifier-qualifier-list before ‘PyObject_HEAD’
AccessControl/cAccessControl.c:328: error: expected specifier-qualifier-list before ‘PyObject_HEAD’
...
AccessControl/cAccessControl.c:2268: error: ‘aq_validate’ no se declaró aquí (primer uso en esta función)
AccessControl/cAccessControl.c:2274: error: ‘Containers’ no se declaró aquí (primer uso en esta función)
AccessControl/cAccessControl.c:2275: error: ‘ContainerAssertions’ no se declaró aquí (primer uso en esta función)
AccessControl/cAccessControl.c:2284: error: ‘getRoles’ no se declaró aquí (primer uso en esta función)
AccessControl/cAccessControl.c:2293: error: ‘Unauthorized’ no se declaró aquí (primer uso en esta función)
AccessControl/cAccessControl.c:2301: error: ‘getSecurityManager’ no se declaró aquí (primer uso en esta función)
AccessControl/cAccessControl.c:2309: error: ‘warn’ no se declaró aquí (primer uso en esta función)
error: command 'gcc' failed with exit status 1
make: *** [build] Error 1
root@rwork:/home/zope/Zope-2.10.4-final#