/home/jivan/RT73_Linux_STA_Drv1.0.4.0/Module/rtmp.h:3062: error: expected declaration specifiers or ‘...’ before ‘PUCHAR’
/home/jivan/RT73_Linux_STA_Drv1.0.4.0/Module/rtmp.h:3063: error: expected declaration specifiers or ‘...’ before ‘PUCHAR’
/home/jivan/RT73_Linux_STA_Drv1.0.4.0/Module/rtmp.h:3064: error: expected declaration specifiers or ‘...’ before ‘u32’
/home/jivan/RT73_Linux_STA_Drv1.0.4.0/Module/rtmp.h:3066: error: expected ‘=’, ‘,’, ‘;’, ‘asm’ or ‘__attribute__’ before ‘RTMP_CALC_FCS32’
/home/jivan/RT73_Linux_STA_Drv1.0.4.0/Module/rtmp.h:3073: error: expected declaration specifiers or ‘...’ before ‘PUCHAR’
/home/jivan/RT73_Linux_STA_Drv1.0.4.0/Module/rtmp.h:3080: error: expected declaration specifiers or ‘...’ before ‘PUCHAR’
/home/jivan/RT73_Linux_STA_Drv1.0.4.0/Module/rtmp.h:3081: error: expected declaration specifiers or ‘...’ before ‘u8’
/home/jivan/RT73_Linux_STA_Drv1.0.4.0/Module/rtmp.h:3082: error: expected declaration specifiers or ‘...’ before ‘PUCHAR’
/home/jivan/RT73_Linux_STA_Drv1.0.4.0/Module/rtmp.h:3083: error: expected declaration specifiers or ‘...’ before ‘PUCHAR’
/home/jivan/RT73_Linux_STA_Drv1.0.4.0/Module/rtmp.h:3084: error: expected declaration specifiers or ‘...’ before ‘PUCHAR’
/home/jivan/RT73_Linux_STA_Drv1.0.4.0/Module/rtmp.h:3085: error: expected declaration specifiers or ‘...’ before ‘PULONG’
/home/jivan/RT73_Linux_STA_Drv1.0.4.0/Module/rtmp.h:3086: error: expected declaration specifiers or ‘...’ before ‘PULONG’
/home/jivan/RT73_Linux_STA_Drv1.0.4.0/Module/rtmp.h:3090: error: expected declaration specifiers or ‘...’ before ‘PUCHAR’
/home/jivan/RT73_Linux_STA_Drv1.0.4.0/Module/rtmp.h:3091: error: expected declaration specifiers or ‘...’ before ‘PUCHAR’
/home/jivan/RT73_Linux_STA_Drv1.0.4.0/Module/rtmp.h:3092: error: expected declaration specifiers or ‘...’ before ‘PUCHAR’
/home/jivan/RT73_Linux_STA_Drv1.0.4.0/Module/rtmp.h:3093: error: expected declaration specifiers or ‘...’ before ‘u8’
/home/jivan/RT73_Linux_STA_Drv1.0.4.0/Module/rtmp.h:3094: error: expected declaration specifiers or ‘...’ before ‘PUCHAR’
/home/jivan/RT73_Linux_STA_Drv1.0.4.0/Module/rtmp.h:3096: error: expected ‘=’, ‘,’, ‘;’, ‘asm’ or ‘__attribute__’ before ‘RTMPTkipCompareMICValue’
/home/jivan/RT73_Linux_STA_Drv1.0.4.0/Module/rtmp.h:3107: error: expected declaration specifiers or ‘...’ before ‘PUCHAR’
/home/jivan/RT73_Linux_STA_Drv1.0.4.0/Module/rtmp.h:3110: error: expected ‘=’, ‘,’, ‘;’, ‘asm’ or ‘__attribute__’ before ‘RTMPTkipCompareMICValueWithLLC’
/home/jivan/RT73_Linux_STA_Drv1.0.4.0/Module/rtmp.h:3121: error: expected declaration specifiers or ‘...’ before ‘PUCHAR’
/home/jivan/RT73_Linux_STA_Drv1.0.4.0/Module/rtmp.h:3122: error: expected declaration specifiers or ‘...’ before ‘u32’
/home/jivan/RT73_Linux_STA_Drv1.0.4.0/Module/rtmp.h:3130: error: expected ‘=’, ‘,’, ‘;’, ‘asm’ or ‘__attribute__’ before ‘WpaMsgTypeSubst’
/home/jivan/RT73_Linux_STA_Drv1.0.4.0/Module/rtmp.h:3158: error: expected declaration specifiers or ‘...’ before ‘u8’
/home/jivan/RT73_Linux_STA_Drv1.0.4.0/Module/rtmp.h:3159: error: expected declaration specifiers or ‘...’ before ‘PUCHAR’
/home/jivan/RT73_Linux_STA_Drv1.0.4.0/Module/rtmp.h:3171: error: expected declaration specifiers or ‘...’ before ‘PUCHAR’
/home/jivan/RT73_Linux_STA_Drv1.0.4.0/Module/rtmp.h:3172: error: expected declaration specifiers or ‘...’ before ‘u8’
/home/jivan/RT73_Linux_STA_Drv1.0.4.0/Module/rtmp.h:3173: error: expected declaration specifiers or ‘...’ before ‘u8’
/home/jivan/RT73_Linux_STA_Drv1.0.4.0/Module/rtmp.h:3174: error: expected declaration specifiers or ‘...’ before ‘u8’
/home/jivan/RT73_Linux_STA_Drv1.0.4.0/Module/rtmp.h:3183: error: expected declaration specifiers or ‘...’ before ‘PUCHAR’
/home/jivan/RT73_Linux_STA_Drv1.0.4.0/Module/rtmp.h:3184: error: expected declaration specifiers or ‘...’ before ‘u32’
/home/jivan/RT73_Linux_STA_Drv1.0.4.0/Module/rtmp.h:3187: error: expected ‘)’ before ‘*’ token
/home/jivan/RT73_Linux_STA_Drv1.0.4.0/Module/rtmp.h:3194: error: expected ‘)’ before ‘*’ token
/home/jivan/RT73_Linux_STA_Drv1.0.4.0/Module/rtmp.h:3204: error: expected ‘)’ before ‘*’ token
/home/jivan/RT73_Linux_STA_Drv1.0.4.0/Module/rtmp.h:3214: error: expected declaration specifiers or ‘...’ before ‘u8’
/home/jivan/RT73_Linux_STA_Drv1.0.4.0/Module/rtmp.h:3217: error: expected ‘)’ before ‘*’ token
/home/jivan/RT73_Linux_STA_Drv1.0.4.0/Module/rtmp.h:3225: error: expected declaration specifiers or ‘...’ before ‘PUCHAR’
/home/jivan/RT73_Linux_STA_Drv1.0.4.0/Module/rtmp.h:3226: error: expected declaration specifiers or ‘...’ before ‘u32’
/home/jivan/RT73_Linux_STA_Drv1.0.4.0/Module/rtmp.h:3227: error: expected declaration specifiers or ‘...’ before ‘u32’
/home/jivan/RT73_Linux_STA_Drv1.0.4.0/Module/rtmp.h:3264: error: expected declaration specifiers or ‘...’ before ‘u32’
/home/jivan/RT73_Linux_STA_Drv1.0.4.0/Module/rtmp.h:3272: error: expected declaration specifiers or ‘...’ before ‘PUCHAR’
/home/jivan/RT73_Linux_STA_Drv1.0.4.0/Module/rtmp.h:3276: error: expected declaration specifiers or ‘...’ before ‘PUCHAR’
/home/jivan/RT73_Linux_STA_Drv1.0.4.0/Module/rtmp.h:3280: error: expected declaration specifiers or ‘...’ before ‘PUCHAR’
/home/jivan/RT73_Linux_STA_Drv1.0.4.0/Module/rtmp.h:3284: error: expected declaration specifiers or ‘...’ before ‘PUCHAR’
/home/jivan/RT73_Linux_STA_Drv1.0.4.0/Module/rtmp.h:3288: error: expected declaration specifiers or ‘...’ before ‘PUCHAR’
/home/jivan/RT73_Linux_STA_Drv1.0.4.0/Module/rtmp.h:3292: error: expected declaration specifiers or ‘...’ before ‘PUCHAR’
/home/jivan/RT73_Linux_STA_Drv1.0.4.0/Module/rtmp.h:3296: error: expected declaration specifiers or ‘...’ before ‘PUCHAR’
/home/jivan/RT73_Linux_STA_Drv1.0.4.0/Module/rtmp.h:3300: error: expected declaration specifiers or ‘...’ before ‘PUCHAR’
/home/jivan/RT73_Linux_STA_Drv1.0.4.0/Module/rtmp.h:3310: error: expected declaration specifiers or ‘...’ before ‘PUCHAR’
/home/jivan/RT73_Linux_STA_Drv1.0.4.0/Module/rtmp.h:3314: error: expected declaration specifiers or ‘...’ before ‘PUCHAR’
/home/jivan/RT73_Linux_STA_Drv1.0.4.0/Module/rtmp.h:3318: error: expected declaration specifiers or ‘...’ before ‘PUCHAR’
/home/jivan/RT73_Linux_STA_Drv1.0.4.0/Module/rtmp.h:3322: error: expected declaration specifiers or ‘...’ before ‘PUCHAR’
/home/jivan/RT73_Linux_STA_Drv1.0.4.0/Module/rtmp.h:3326: error: expected declaration specifiers or ‘...’ before ‘PUCHAR’
/home/jivan/RT73_Linux_STA_Drv1.0.4.0/Module/rtmp.h:3336: error: expected declaration specifiers or ‘...’ before ‘PUCHAR’
/home/jivan/RT73_Linux_STA_Drv1.0.4.0/Module/rtmp.h:3346: error: expected declaration specifiers or ‘...’ before ‘PUCHAR’
/home/jivan/RT73_Linux_STA_Drv1.0.4.0/Module/rtmp.h:3350: error: expected declaration specifiers or ‘...’ before ‘PUCHAR’
/home/jivan/RT73_Linux_STA_Drv1.0.4.0/Module/rtmp.h:3354: error: expected declaration specifiers or ‘...’ before ‘PUCHAR’
/home/jivan/RT73_Linux_STA_Drv1.0.4.0/Module/rtmp.h:3358: error: expected declaration specifiers or ‘...’ before ‘PUCHAR’
/home/jivan/RT73_Linux_STA_Drv1.0.4.0/Module/rtmp.h:3362: error: expected declaration specifiers or ‘...’ before ‘PUCHAR’
/home/jivan/RT73_Linux_STA_Drv1.0.4.0/Module/rtmp.h:3366: error: expected declaration specifiers or ‘...’ before ‘PUCHAR’
/home/jivan/RT73_Linux_STA_Drv1.0.4.0/Module/rtmp.h:3370: error: expected declaration specifiers or ‘...’ before ‘PUCHAR’
/home/jivan/RT73_Linux_STA_Drv1.0.4.0/Module/rtmp.h:3374: error: expected declaration specifiers or ‘...’ before ‘PUCHAR’
/home/jivan/RT73_Linux_STA_Drv1.0.4.0/Module/rtmp.h:3378: error: expected declaration specifiers or ‘...’ before ‘PUCHAR’
/home/jivan/RT73_Linux_STA_Drv1.0.4.0/Module/rtmp.h:3382: error: expected declaration specifiers or ‘...’ before ‘PUCHAR’
/home/jivan/RT73_Linux_STA_Drv1.0.4.0/Module/rtmp.h:3386: error: expected declaration specifiers or ‘...’ before ‘PUCHAR’
/home/jivan/RT73_Linux_STA_Drv1.0.4.0/Module/rtmp.h:3390: error: expected declaration specifiers or ‘...’ before ‘PUCHAR’
/home/jivan/RT73_Linux_STA_Drv1.0.4.0/Module/rtmp.h:3394: error: expected declaration specifiers or ‘...’ before ‘PUCHAR’
/home/jivan/RT73_Linux_STA_Drv1.0.4.0/Module/rtmp.h:3423: error: expected declaration specifiers or ‘...’ before ‘u8’
/home/jivan/RT73_Linux_STA_Drv1.0.4.0/Module/rtmp.h:3705: error: expected ‘=’, ‘,’, ‘;’, ‘asm’ or ‘__attribute__’ before ‘BackDoorProbeRspSanity’
In file included from /home/jivan/RT73_Linux_STA_Drv1.0.4.0/Module/rtmp_main.c:40:
/home/jivan/RT73_Linux_STA_Drv1.0.4.0/Module/rt_config.h:221:5: warning: "LINUX_VERSION_CODE" is not defined
/home/jivan/RT73_Linux_STA_Drv1.0.4.0/Module/rtmp_main.c:42: error: expected ‘=’, ‘,’, ‘;’, ‘asm’ or ‘__attribute__’ before ‘RTDebugLevel’
/home/jivan/RT73_Linux_STA_Drv1.0.4.0/Module/rtmp_main.c:66: error: unknown field ‘match_flags’ specified in initializer
/home/jivan/RT73_Linux_STA_Drv1.0.4.0/Module/rtmp_main.c:66: warning: excess elements in struct initializer
/home/jivan/RT73_Linux_STA_Drv1.0.4.0/Module/rtmp_main.c:66: warning: (near initialization for ‘rtusb_usb_id[0]’)
/home/jivan/RT73_Linux_STA_Drv1.0.4.0/Module/rtmp_main.c:66: error: unknown field ‘idVendor’ specified in initializer
/home/jivan/RT73_Linux_STA_Drv1.0.4.0/Module/rtmp_main.c:66: warning: excess elements in struct initializer
/home/jivan/RT73_Linux_STA_Drv1.0.4.0/Module/rtmp_main.c:66: warning: (near initialization for ‘rtusb_usb_id[0]’)
/home/jivan/RT73_Linux_STA_Drv1.0.4.0/Module/rtmp_main.c:66: error: unknown field ‘idProduct’ specified in initializer
/home/jivan/RT73_Linux_STA_Drv1.0.4.0/Module/rtmp_main.c:66: warning: excess elements in struct initializer
/home/jivan/RT73_Linux_STA_Drv1.0.4.0/Module/rtmp_main.c:66: warning: (near initialization for ‘rtusb_usb_id[0]’)
/home/jivan/RT73_Linux_STA_Drv1.0.4.0/Module/rtmp_main.c:66: error: unknown field ‘match_flags’ specified in initializer
/home/jivan/RT73_Linux_STA_Drv1.0.4.0/Module/rtmp_main.c:66: warning: excess elements in struct initializer
/home/jivan/RT73_Linux_STA_Drv1.0.4.0/Module/rtmp_main.c:66: warning: (near initialization for ‘rtusb_usb_id[1]’)
/home/jivan/RT73_Linux_STA_Drv1.0.4.0/Module/rtmp_main.c:66: error: unknown field ‘idVendor’ specified in initializer
/home/jivan/RT73_Linux_STA_Drv1.0.4.0/Module/rtmp_main.c:66: warning: excess elements in struct initializer
/home/jivan/RT73_Linux_STA_Drv1.0.4.0/Module/rtmp_main.c:66: warning: (near initialization for ‘rtusb_usb_id[1]’)
/home/jivan/RT73_Linux_STA_Drv1.0.4.0/Module/rtmp_main.c:66: error: unknown field ‘idProduct’ specified in initializer
/home/jivan/RT73_Linux_STA_Drv1.0.4.0/Module/rtmp_main.c:66: warning: excess elements in struct initializer
/home/jivan/RT73_Linux_STA_Drv1.0.4.0/Module/rtmp_main.c:66: warning: (near initialization for ‘rtusb_usb_id[1]’)
/home/jivan/RT73_Linux_STA_Drv1.0.4.0/Module/rtmp_main.c:66: error: unknown field ‘match_flags’ specified in initializer
/home/jivan/RT73_Linux_STA_Drv1.0.4.0/Module/rtmp_main.c:66: warning: excess elements in struct initializer
/home/jivan/RT73_Linux_STA_Drv1.0.4.0/Module/rtmp_main.c:66: warning: (near initialization for ‘rtusb_usb_id[2]’)
/home/jivan/RT73_Linux_STA_Drv1.0.4.0/Module/rtmp_main.c:66: error: unknown field ‘idVendor’ specified in initializer
/home/jivan/RT73_Linux_STA_Drv1.0.4.0/Module/rtmp_main.c:66: warning: excess elements in struct initializer
/home/jivan/RT73_Linux_STA_Drv1.0.4.0/Module/rtmp_main.c:66: warning: (near initialization for ‘rtusb_usb_id[2]’)
/home/jivan/RT73_Linux_STA_Drv1.0.4.0/Module/rtmp_main.c:66: error: unknown field ‘idProduct’ specified in initializer
/home/jivan/RT73_Linux_STA_Drv1.0.4.0/Module/rtmp_main.c:66: warning: excess elements in struct initializer
/home/jivan/RT73_Linux_STA_Drv1.0.4.0/Module/rtmp_main.c:66: warning: (near initialization for ‘rtusb_usb_id[2]’)
/home/jivan/RT73_Linux_STA_Drv1.0.4.0/Module/rtmp_main.c:66: error: unknown field ‘match_flags’ specified in initializer
/home/jivan/RT73_Linux_STA_Drv1.0.4.0/Module/rtmp_main.c:66: warning: excess elements in struct initializer
/home/jivan/RT73_Linux_STA_Drv1.0.4.0/Module/rtmp_main.c:66: warning: (near initialization for ‘rtusb_usb_id[3]’)
/home/jivan/RT73_Linux_STA_Drv1.0.4.0/Module/rtmp_main.c:66: error: unknown field ‘idVendor’ specified in initializer
/home/jivan/RT73_Linux_STA_Drv1.0.4.0/Module/rtmp_main.c:66: warning: excess elements in struct initializer
/home/jivan/RT73_Linux_STA_Drv1.0.4.0/Module/rtmp_main.c:66: warning: (near initialization for ‘rtusb_usb_id[3]’)
/home/jivan/RT73_Linux_STA_Drv1.0.4.0/Module/rtmp_main.c:66: error: unknown field ‘idProduct’ specified in initializer
/home/jivan/RT73_Linux_STA_Drv1.0.4.0/Module/rtmp_main.c:66: warning: excess elements in struct initializer
/home/jivan/RT73_Linux_STA_Drv1.0.4.0/Module/rtmp_main.c:66: warning: (near initialization for ‘rtusb_usb_id[3]’)
/home/jivan/RT73_Linux_STA_Drv1.0.4.0/Module/rtmp_main.c:66: error: unknown field ‘match_flags’ specified in initializer
/home/jivan/RT73_Linux_STA_Drv1.0.4.0/Module/rtmp_main.c:66: warning: excess elements in struct initializer
/home/jivan/RT73_Linux_STA_Drv1.0.4.0/Module/rtmp_main.c:66: warning: (near initialization for ‘rtusb_usb_id[4]’)
/home/jivan/RT73_Linux_STA_Drv1.0.4.0/Module/rtmp_main.c:66: error: unknown field ‘idVendor’ specified in initializer
/home/jivan/RT73_Linux_STA_Drv1.0.4.0/Module/rtmp_main.c:66: warning: excess elements in struct initializer
/home/jivan/RT73_Linux_STA_Drv1.0.4.0/Module/rtmp_main.c:66: warning: (near initialization for ‘rtusb_usb_id[4]’)
/home/jivan/RT73_Linux_STA_Drv1.0.4.0/Module/rtmp_main.c:66: error: unknown field ‘idProduct’ specified in initializer
/home/jivan/RT73_Linux_STA_Drv1.0.4.0/Module/rtmp_main.c:66: warning: excess elements in struct initializer
/home/jivan/RT73_Linux_STA_Drv1.0.4.0/Module/rtmp_main.c:66: warning: (near initialization for ‘rtusb_usb_id[4]’)
/home/jivan/RT73_Linux_STA_Drv1.0.4.0/Module/rtmp_main.c:66: error: unknown field ‘match_flags’ specified in initializer
/home/jivan/RT73_Linux_STA_Drv1.0.4.0/Module/rtmp_main.c:66: warning: excess elements in struct initializer
/home/jivan/RT73_Linux_STA_Drv1.0.4.0/Module/rtmp_main.c:66: warning: (near initialization for ‘rtusb_usb_id[5]’)
/home/jivan/RT73_Linux_STA_Drv1.0.4.0/Module/rtmp_main.c:66: error: unknown field ‘idVendor’ specified in initializer
/home/jivan/RT73_Linux_STA_Drv1.0.4.0/Module/rtmp_main.c:66: warning: excess elements in struct initializer
/home/jivan/RT73_Linux_STA_Drv1.0.4.0/Module/rtmp_main.c:66: warning: (near initialization for ‘rtusb_usb_id[5]’)
/home/jivan/RT73_Linux_STA_Drv1.0.4.0/Module/rtmp_main.c:66: error: unknown field ‘idProduct’ specified in initializer
/home/jivan/RT73_Linux_STA_Drv1.0.4.0/Module/rtmp_main.c:66: warning: excess elements in struct initializer
/home/jivan/RT73_Linux_STA_Drv1.0.4.0/Module/rtmp_main.c:66: warning: (near initialization for ‘rtusb_usb_id[5]’)
/home/jivan/RT73_Linux_STA_Drv1.0.4.0/Module/rtmp_main.c:66: error: unknown field ‘match_flags’ specified in initializer
/home/jivan/RT73_Linux_STA_Drv1.0.4.0/Module/rtmp_main.c:66: warning: excess elements in struct initializer
/home/jivan/RT73_Linux_STA_Drv1.0.4.0/Module/rtmp_main.c:66: warning: (near initialization for ‘rtusb_usb_id[6]’)
/home/jivan/RT73_Linux_STA_Drv1.0.4.0/Module/rtmp_main.c:66: error: unknown field ‘idVendor’ specified in initializer
/home/jivan/RT73_Linux_STA_Drv1.0.4.0/Module/rtmp_main.c:66: warning: excess elements in struct initializer
/home/jivan/RT73_Linux_STA_Drv1.0.4.0/Module/rtmp_main.c:66: warning: (near initialization for ‘rtusb_usb_id[6]’)
/home/jivan/RT73_Linux_STA_Drv1.0.4.0/Module/rtmp_main.c:66: error: unknown field ‘idProduct’ specified in initializer
/home/jivan/RT73_Linux_STA_Drv1.0.4.0/Module/rtmp_main.c:66: warning: excess elements in struct initializer
/home/jivan/RT73_Linux_STA_Drv1.0.4.0/Module/rtmp_main.c:66: warning: (near initialization for ‘rtusb_usb_id[6]’)
/home/jivan/RT73_Linux_STA_Drv1.0.4.0/Module/rtmp_main.c:66: error: unknown field ‘match_flags’ specified in initializer
/home/jivan/RT73_Linux_STA_Drv1.0.4.0/Module/rtmp_main.c:66: warning: excess elements in struct initializer
/home/jivan/RT73_Linux_STA_Drv1.0.4.0/Module/rtmp_main.c:66: warning: (near initialization for ‘rtusb_usb_id[7]’)
/home/jivan/RT73_Linux_STA_Drv1.0.4.0/Module/rtmp_main.c:66: error: unknown field ‘idVendor’ specified in initializer
/home/jivan/RT73_Linux_STA_Drv1.0.4.0/Module/rtmp_main.c:66: warning: excess elements in struct initializer
/home/jivan/RT73_Linux_STA_Drv1.0.4.0/Module/rtmp_main.c:66: warning: (near initialization for ‘rtusb_usb_id[7]’)
/home/jivan/RT73_Linux_STA_Drv1.0.4.0/Module/rtmp_main.c:66: error: unknown field ‘idProduct’ specified in initializer
/home/jivan/RT73_Linux_STA_Drv1.0.4.0/Module/rtmp_main.c:66: warning: excess elements in struct initializer
/home/jivan/RT73_Linux_STA_Drv1.0.4.0/Module/rtmp_main.c:66: warning: (near initialization for ‘rtusb_usb_id[7]’)
/home/jivan/RT73_Linux_STA_Drv1.0.4.0/Module/rtmp_main.c:66: error: unknown field ‘match_flags’ specified in initializer
/home/jivan/RT73_Linux_STA_Drv1.0.4.0/Module/rtmp_main.c:66: warning: excess elements in struct initializer
/home/jivan/RT73_Linux_STA_Drv1.0.4.0/Module/rtmp_main.c:66: warning: (near initialization for ‘rtusb_usb_id[8]’)
/home/jivan/RT73_Linux_STA_Drv1.0.4.0/Module/rtmp_main.c:66: error: unknown field ‘idVendor’ specified in initializer
/home/jivan/RT73_Linux_STA_Drv1.0.4.0/Module/rtmp_main.c:66: warning: excess elements in struct initializer
/home/jivan/RT73_Linux_STA_Drv1.0.4.0/Module/rtmp_main.c:66: warning: (near initialization for ‘rtusb_usb_id[8]’)
/home/jivan/RT73_Linux_STA_Drv1.0.4.0/Module/rtmp_main.c:66: error: unknown field ‘idProduct’ specified in initializer
/home/jivan/RT73_Linux_STA_Drv1.0.4.0/Module/rtmp_main.c:66: warning: excess elements in struct initializer
/home/jivan/RT73_Linux_STA_Drv1.0.4.0/Module/rtmp_main.c:66: warning: (near initialization for ‘rtusb_usb_id[8]’)
/home/jivan/RT73_Linux_STA_Drv1.0.4.0/Module/rtmp_main.c:66: error: unknown field ‘match_flags’ specified in initializer
/home/jivan/RT73_Linux_STA_Drv1.0.4.0/Module/rtmp_main.c:66: warning: excess elements in struct initializer
/home/jivan/RT73_Linux_STA_Drv1.0.4.0/Module/rtmp_main.c:66: warning: (near initialization for ‘rtusb_usb_id[9]’)
/home/jivan/RT73_Linux_STA_Drv1.0.4.0/Module/rtmp_main.c:66: error: unknown field ‘idVendor’ specified in initializer
/home/jivan/RT73_Linux_STA_Drv1.0.4.0/Module/rtmp_main.c:66: warning: excess elements in struct initializer
/home/jivan/RT73_Linux_STA_Drv1.0.4.0/Module/rtmp_main.c:66: warning: (near initialization for ‘rtusb_usb_id[9]’)
/home/jivan/RT73_Linux_STA_Drv1.0.4.0/Module/rtmp_main.c:66: error: unknown field ‘idProduct’ specified in initializer
/home/jivan/RT73_Linux_STA_Drv1.0.4.0/Module/rtmp_main.c:66: warning: excess elements in struct initializer
/home/jivan/RT73_Linux_STA_Drv1.0.4.0/Module/rtmp_main.c:66: warning: (near initialization for ‘rtusb_usb_id[9]’)
/home/jivan/RT73_Linux_STA_Drv1.0.4.0/Module/rtmp_main.c:66: error: unknown field ‘match_flags’ specified in initializer
/home/jivan/RT73_Linux_STA_Drv1.0.4.0/Module/rtmp_main.c:66: warning: excess elements in struct initializer
/home/jivan/RT73_Linux_STA_Drv1.0.4.0/Module/rtmp_main.c:66: warning: (near initialization for ‘rtusb_usb_id[10]’)
/home/jivan/RT73_Linux_STA_Drv1.0.4.0/Module/rtmp_main.c:66: error: unknown field ‘idVendor’ specified in initializer
/home/jivan/RT73_Linux_STA_Drv1.0.4.0/Module/rtmp_main.c:66: warning: excess elements in struct initializer
/home/jivan/RT73_Linux_STA_Drv1.0.4.0/Module/rtmp_main.c:66: warning: (near initialization for ‘rtusb_usb_id[10]’)
/home/jivan/RT73_Linux_STA_Drv1.0.4.0/Module/rtmp_main.c:66: error: unknown field ‘idProduct’ specified in initializer
/home/jivan/RT73_Linux_STA_Drv1.0.4.0/Module/rtmp_main.c:66: warning: excess elements in struct initializer
/home/jivan/RT73_Linux_STA_Drv1.0.4.0/Module/rtmp_main.c:66: warning: (near initialization for ‘rtusb_usb_id[10]’)
/home/jivan/RT73_Linux_STA_Drv1.0.4.0/Module/rtmp_main.c:66: error: unknown field ‘match_flags’ specified in initializer
/home/jivan/RT73_Linux_STA_Drv1.0.4.0/Module/rtmp_main.c:66: warning: excess elements in struct initializer
/home/jivan/RT73_Linux_STA_Drv1.0.4.0/Module/rtmp_main.c:66: warning: (near initialization for ‘rtusb_usb_id[11]’)
/home/jivan/RT73_Linux_STA_Drv1.0.4.0/Module/rtmp_main.c:66: error: unknown field ‘idVendor’ specified in initializer
/home/jivan/RT73_Linux_STA_Drv1.0.4.0/Module/rtmp_main.c:66: warning: excess elements in struct initializer
/home/jivan/RT73_Linux_STA_Drv1.0.4.0/Module/rtmp_main.c:66: warning: (near initialization for ‘rtusb_usb_id[11]’)
/home/jivan/RT73_Linux_STA_Drv1.0.4.0/Module/rtmp_main.c:66: error: unknown field ‘idProduct’ specified in initializer
/home/jivan/RT73_Linux_STA_Drv1.0.4.0/Module/rtmp_main.c:66: warning: excess elements in struct initializer
/home/jivan/RT73_Linux_STA_Drv1.0.4.0/Module/rtmp_main.c:66: warning: (near initialization for ‘rtusb_usb_id[11]’)
/home/jivan/RT73_Linux_STA_Drv1.0.4.0/Module/rtmp_main.c:66: error: unknown field ‘match_flags’ specified in initializer
/home/jivan/RT73_Linux_STA_Drv1.0.4.0/Module/rtmp_main.c:66: warning: excess elements in struct initializer
/home/jivan/RT73_Linux_STA_Drv1.0.4.0/Module/rtmp_main.c:66: warning: (near initialization for ‘rtusb_usb_id[12]’)
/home/jivan/RT73_Linux_STA_Drv1.0.4.0/Module/rtmp_main.c:66: error: unknown field ‘idVendor’ specified in initializer
/home/jivan/RT73_Linux_STA_Drv1.0.4.0/Module/rtmp_main.c:66: warning: excess elements in struct initializer
/home/jivan/RT73_Linux_STA_Drv1.0.4.0/Module/rtmp_main.c:66: warning: (near initialization for ‘rtusb_usb_id[12]’)
/home/jivan/RT73_Linux_STA_Drv1.0.4.0/Module/rtmp_main.c:66: error: unknown field ‘idProduct’ specified in initializer
/home/jivan/RT73_Linux_STA_Drv1.0.4.0/Module/rtmp_main.c:66: warning: excess elements in struct initializer
/home/jivan/RT73_Linux_STA_Drv1.0.4.0/Module/rtmp_main.c:66: warning: (near initialization for ‘rtusb_usb_id[12]’)
/home/jivan/RT73_Linux_STA_Drv1.0.4.0/Module/rtmp_main.c:66: error: unknown field ‘match_flags’ specified in initializer
/home/jivan/RT73_Linux_STA_Drv1.0.4.0/Module/rtmp_main.c:66: warning: excess elements in struct initializer
/home/jivan/RT73_Linux_STA_Drv1.0.4.0/Module/rtmp_main.c:66: warning: (near initialization for ‘rtusb_usb_id[13]’)
/home/jivan/RT73_Linux_STA_Drv1.0.4.0/Module/rtmp_main.c:66: error: unknown field ‘idVendor’ specified in initializer
/home/jivan/RT73_Linux_STA_Drv1.0.4.0/Module/rtmp_main.c:66: warning: excess elements in struct initializer
/home/jivan/RT73_Linux_STA_Drv1.0.4.0/Module/rtmp_main.c:66: warning: (near initialization for ‘rtusb_usb_id[13]’)
/home/jivan/RT73_Linux_STA_Drv1.0.4.0/Module/rtmp_main.c:66: error: unknown field ‘idProduct’ specified in initializer
/home/jivan/RT73_Linux_STA_Drv1.0.4.0/Module/rtmp_main.c:66: warning: excess elements in struct initializer
/home/jivan/RT73_Linux_STA_Drv1.0.4.0/Module/rtmp_main.c:66: warning: (near initialization for ‘rtusb_usb_id[13]’)
/home/jivan/RT73_Linux_STA_Drv1.0.4.0/Module/rtmp_main.c:66: error: unknown field ‘match_flags’ specified in initializer
/home/jivan/RT73_Linux_STA_Drv1.0.4.0/Module/rtmp_main.c:66: warning: excess elements in struct initializer
/home/jivan/RT73_Linux_STA_Drv1.0.4.0/Module/rtmp_main.c:66: warning: (near initialization for ‘rtusb_usb_id[14]’)
/home/jivan/RT73_Linux_STA_Drv1.0.4.0/Module/rtmp_main.c:66: error: unknown field ‘idVendor’ specified in initializer
/home/jivan/RT73_Linux_STA_Drv1.0.4.0/Module/rtmp_main.c:66: warning: excess elements in struct initializer
/home/jivan/RT73_Linux_STA_Drv1.0.4.0/Module/rtmp_main.c:66: warning: (near initialization for ‘rtusb_usb_id[14]’)
/home/jivan/RT73_Linux_STA_Drv1.0.4.0/Module/rtmp_main.c:66: error: unknown field ‘idProduct’ specified in initializer
/home/jivan/RT73_Linux_STA_Drv1.0.4.0/Module/rtmp_main.c:66: warning: excess elements in struct initializer
/home/jivan/RT73_Linux_STA_Drv1.0.4.0/Module/rtmp_main.c:66: warning: (near initialization for ‘rtusb_usb_id[14]’)
/home/jivan/RT73_Linux_STA_Drv1.0.4.0/Module/rtmp_main.c:66: error: unknown field ‘match_flags’ specified in initializer
/home/jivan/RT73_Linux_STA_Drv1.0.4.0/Module/rtmp_main.c:66: warning: excess elements in struct initializer
/home/jivan/RT73_Linux_STA_Drv1.0.4.0/Module/rtmp_main.c:66: warning: (near initialization for ‘rtusb_usb_id[15]’)
/home/jivan/RT73_Linux_STA_Drv1.0.4.0/Module/rtmp_main.c:66: error: unknown field ‘idVendor’ specified in initializer
/home/jivan/RT73_Linux_STA_Drv1.0.4.0/Module/rtmp_main.c:66: warning: excess elements in struct initializer
/home/jivan/RT73_Linux_STA_Drv1.0.4.0/Module/rtmp_main.c:66: warning: (near initialization for ‘rtusb_usb_id[15]’)
/home/jivan/RT73_Linux_STA_Drv1.0.4.0/Module/rtmp_main.c:66: error: unknown field ‘idProduct’ specified in initializer
/home/jivan/RT73_Linux_STA_Drv1.0.4.0/Module/rtmp_main.c:66: warning: excess elements in struct initializer
/home/jivan/RT73_Linux_STA_Drv1.0.4.0/Module/rtmp_main.c:66: warning: (near initialization for ‘rtusb_usb_id[15]’)
/home/jivan/RT73_Linux_STA_Drv1.0.4.0/Module/rtmp_main.c:66: error: unknown field ‘match_flags’ specified in initializer
/home/jivan/RT73_Linux_STA_Drv1.0.4.0/Module/rtmp_main.c:66: warning: excess elements in struct initializer
/home/jivan/RT73_Linux_STA_Drv1.0.4.0/Module/rtmp_main.c:66: warning: (near initialization for ‘rtusb_usb_id[16]’)
/home/jivan/RT73_Linux_STA_Drv1.0.4.0/Module/rtmp_main.c:66: error: unknown field ‘idVendor’ specified in initializer
/home/jivan/RT73_Linux_STA_Drv1.0.4.0/Module/rtmp_main.c:66: warning: excess elements in struct initializer
/home/jivan/RT73_Linux_STA_Drv1.0.4.0/Module/rtmp_main.c:66: warning: (near initialization for ‘rtusb_usb_id[16]’)
/home/jivan/RT73_Linux_STA_Drv1.0.4.0/Module/rtmp_main.c:66: error: unknown field ‘idProduct’ specified in initializer
/home/jivan/RT73_Linux_STA_Drv1.0.4.0/Module/rtmp_main.c:66: warning: excess elements in struct initializer
/home/jivan/RT73_Linux_STA_Drv1.0.4.0/Module/rtmp_main.c:66: warning: (near initialization for ‘rtusb_usb_id[16]’)
/home/jivan/RT73_Linux_STA_Drv1.0.4.0/Module/rtmp_main.c:66: error: unknown field ‘match_flags’ specified in initializer
/home/jivan/RT73_Linux_STA_Drv1.0.4.0/Module/rtmp_main.c:66: warning: excess elements in struct initializer
/home/jivan/RT73_Linux_STA_Drv1.0.4.0/Module/rtmp_main.c:66: warning: (near initialization for ‘rtusb_usb_id[17]’)
/home/jivan/RT73_Linux_STA_Drv1.0.4.0/Module/rtmp_main.c:66: error: unknown field ‘idVendor’ specified in initializer
/home/jivan/RT73_Linux_STA_Drv1.0.4.0/Module/rtmp_main.c:66: warning: excess elements in struct initializer
/home/jivan/RT73_Linux_STA_Drv1.0.4.0/Module/rtmp_main.c:66: warning: (near initialization for ‘rtusb_usb_id[17]’)
/home/jivan/RT73_Linux_STA_Drv1.0.4.0/Module/rtmp_main.c:66: error: unknown field ‘idProduct’ specified in initializer
/home/jivan/RT73_Linux_STA_Drv1.0.4.0/Module/rtmp_main.c:66: warning: excess elements in struct initializer
/home/jivan/RT73_Linux_STA_Drv1.0.4.0/Module/rtmp_main.c:66: warning: (near initialization for ‘rtusb_usb_id[17]’)
/home/jivan/RT73_Linux_STA_Drv1.0.4.0/Module/rtmp_main.c:66: error: unknown field ‘match_flags’ specified in initializer
/home/jivan/RT73_Linux_STA_Drv1.0.4.0/Module/rtmp_main.c:66: warning: excess elements in struct initializer
/home/jivan/RT73_Linux_STA_Drv1.0.4.0/Module/rtmp_main.c:66: warning: (near initialization for ‘rtusb_usb_id[18]’)
/home/jivan/RT73_Linux_STA_Drv1.0.4.0/Module/rtmp_main.c:66: error: unknown field ‘idVendor’ specified in initializer
/home/jivan/RT73_Linux_STA_Drv1.0.4.0/Module/rtmp_main.c:66: warning: excess elements in struct initializer
/home/jivan/RT73_Linux_STA_Drv1.0.4.0/Module/rtmp_main.c:66: warning: (near initialization for ‘rtusb_usb_id[18]’)
/home/jivan/RT73_Linux_STA_Drv1.0.4.0/Module/rtmp_main.c:66: error: unknown field ‘idProduct’ specified in initializer
/home/jivan/RT73_Linux_STA_Drv1.0.4.0/Module/rtmp_main.c:66: warning: excess elements in struct initializer
/home/jivan/RT73_Linux_STA_Drv1.0.4.0/Module/rtmp_main.c:66: warning: (near initialization for ‘rtusb_usb_id[18]’)
/home/jivan/RT73_Linux_STA_Drv1.0.4.0/Module/rtmp_main.c:66: error: unknown field ‘match_flags’ specified in initializer
/home/jivan/RT73_Linux_STA_Drv1.0.4.0/Module/rtmp_main.c:66: warning: excess elements in struct initializer
/home/jivan/RT73_Linux_STA_Drv1.0.4.0/Module/rtmp_main.c:66: warning: (near initialization for ‘rtusb_usb_id[19]’)
/home/jivan/RT73_Linux_STA_Drv1.0.4.0/Module/rtmp_main.c:66: error: unknown field ‘idVendor’ specified in initializer
/home/jivan/RT73_Linux_STA_Drv1.0.4.0/Module/rtmp_main.c:66: warning: excess elements in struct initializer
/home/jivan/RT73_Linux_STA_Drv1.0.4.0/Module/rtmp_main.c:66: warning: (near initialization for ‘rtusb_usb_id[19]’)
/home/jivan/RT73_Linux_STA_Drv1.0.4.0/Module/rtmp_main.c:66: error: unknown field ‘idProduct’ specified in initializer
/home/jivan/RT73_Linux_STA_Drv1.0.4.0/Module/rtmp_main.c:66: warning: excess elements in struct initializer
/home/jivan/RT73_Linux_STA_Drv1.0.4.0/Module/rtmp_main.c:66: warning: (near initialization for ‘rtusb_usb_id[19]’)
/home/jivan/RT73_Linux_STA_Drv1.0.4.0/Module/rtmp_main.c:66: error: unknown field ‘match_flags’ specified in initializer
/home/jivan/RT73_Linux_STA_Drv1.0.4.0/Module/rtmp_main.c:66: warning: excess elements in struct initializer
/home/jivan/RT73_Linux_STA_Drv1.0.4.0/Module/rtmp_main.c:66: warning: (near initialization for ‘rtusb_usb_id[20]’)
/home/jivan/RT73_Linux_STA_Drv1.0.4.0/Module/rtmp_main.c:66: error: unknown field ‘idVendor’ specified in initializer
/home/jivan/RT73_Linux_STA_Drv1.0.4.0/Module/rtmp_main.c:66: warning: excess elements in struct initializer
/home/jivan/RT73_Linux_STA_Drv1.0.4.0/Module/rtmp_main.c:66: warning: (near initialization for ‘rtusb_usb_id[20]’)
/home/jivan/RT73_Linux_STA_Drv1.0.4.0/Module/rtmp_main.c:66: error: unknown field ‘idProduct’ specified in initializer
/home/jivan/RT73_Linux_STA_Drv1.0.4.0/Module/rtmp_main.c:66: warning: excess elements in struct initializer
/home/jivan/RT73_Linux_STA_Drv1.0.4.0/Module/rtmp_main.c:66: warning: (near initialization for ‘rtusb_usb_id[20]’)
/home/jivan/RT73_Linux_STA_Drv1.0.4.0/Module/rtmp_main.c:66: error: unknown field ‘match_flags’ specified in initializer
/home/jivan/RT73_Linux_STA_Drv1.0.4.0/Module/rtmp_main.c:66: warning: excess elements in struct initializer
/home/jivan/RT73_Linux_STA_Drv1.0.4.0/Module/rtmp_main.c:66: warning: (near initialization for ‘rtusb_usb_id[21]’)
/home/jivan/RT73_Linux_STA_Drv1.0.4.0/Module/rtmp_main.c:66: error: unknown field ‘idVendor’ specified in initializer
/home/jivan/RT73_Linux_STA_Drv1.0.4.0/Module/rtmp_main.c:66: warning: excess elements in struct initializer
/home/jivan/RT73_Linux_STA_Drv1.0.4.0/Module/rtmp_main.c:66: warning: (near initialization for ‘rtusb_usb_id[21]’)
/home/jivan/RT73_Linux_STA_Drv1.0.4.0/Module/rtmp_main.c:66: error: unknown field ‘idProduct’ specified in initializer
/home/jivan/RT73_Linux_STA_Drv1.0.4.0/Module/rtmp_main.c:66: warning: excess elements in struct initializer
/home/jivan/RT73_Linux_STA_Drv1.0.4.0/Module/rtmp_main.c:66: warning: (near initialization for ‘rtusb_usb_id[21]’)
/home/jivan/RT73_Linux_STA_Drv1.0.4.0/Module/rtmp_main.c:66: error: unknown field ‘match_flags’ specified in initializer
/home/jivan/RT73_Linux_STA_Drv1.0.4.0/Module/rtmp_main.c:66: warning: excess elements in struct initializer
/home/jivan/RT73_Linux_STA_Drv1.0.4.0/Module/rtmp_main.c:66: warning: (near initialization for ‘rtusb_usb_id[22]’)
/home/jivan/RT73_Linux_STA_Drv1.0.4.0/Module/rtmp_main.c:66: error: unknown field ‘idVendor’ specified in initializer
/home/jivan/RT73_Linux_STA_Drv1.0.4.0/Module/rtmp_main.c:66: warning: excess elements in struct initializer
/home/jivan/RT73_Linux_STA_Drv1.0.4.0/Module/rtmp_main.c:66: warning: (near initialization for ‘rtusb_usb_id[22]’)
/home/jivan/RT73_Linux_STA_Drv1.0.4.0/Module/rtmp_main.c:66: error: unknown field ‘idProduct’ specified in initializer
/home/jivan/RT73_Linux_STA_Drv1.0.4.0/Module/rtmp_main.c:66: warning: excess elements in struct initializer
/home/jivan/RT73_Linux_STA_Drv1.0.4.0/Module/rtmp_main.c:66: warning: (near initialization for ‘rtusb_usb_id[22]’)
/home/jivan/RT73_Linux_STA_Drv1.0.4.0/Module/rtmp_main.c:66: error: unknown field ‘match_flags’ specified in initializer
/home/jivan/RT73_Linux_STA_Drv1.0.4.0/Module/rtmp_main.c:66: warning: excess elements in struct initializer
/home/jivan/RT73_Linux_STA_Drv1.0.4.0/Module/rtmp_main.c:66: warning: (near initialization for ‘rtusb_usb_id[23]’)
/home/jivan/RT73_Linux_STA_Drv1.0.4.0/Module/rtmp_main.c:66: error: unknown field ‘idVendor’ specified in initializer
/home/jivan/RT73_Linux_STA_Drv1.0.4.0/Module/rtmp_main.c:66: warning: excess elements in struct initializer
/home/jivan/RT73_Linux_STA_Drv1.0.4.0/Module/rtmp_main.c:66: warning: (near initialization for ‘rtusb_usb_id[23]’)
/home/jivan/RT73_Linux_STA_Drv1.0.4.0/Module/rtmp_main.c:66: error: unknown field ‘idProduct’ specified in initializer
/home/jivan/RT73_Linux_STA_Drv1.0.4.0/Module/rtmp_main.c:66: warning: excess elements in struct initializer
/home/jivan/RT73_Linux_STA_Drv1.0.4.0/Module/rtmp_main.c:66: warning: (near initialization for ‘rtusb_usb_id[23]’)
/home/jivan/RT73_Linux_STA_Drv1.0.4.0/Module/rtmp_main.c:66: error: unknown field ‘match_flags’ specified in initializer
/home/jivan/RT73_Linux_STA_Drv1.0.4.0/Module/rtmp_main.c:66: warning: excess elements in struct initializer
/home/jivan/RT73_Linux_STA_Drv1.0.4.0/Module/rtmp_main.c:66: warning: (near initialization for ‘rtusb_usb_id[24]’)
/home/jivan/RT73_Linux_STA_Drv1.0.4.0/Module/rtmp_main.c:66: error: unknown field ‘idVendor’ specified in initializer
/home/jivan/RT73_Linux_STA_Drv1.0.4.0/Module/rtmp_main.c:66: warning: excess elements in struct initializer
/home/jivan/RT73_Linux_STA_Drv1.0.4.0/Module/rtmp_main.c:66: warning: (near initialization for ‘rtusb_usb_id[24]’)
/home/jivan/RT73_Linux_STA_Drv1.0.4.0/Module/rtmp_main.c:66: error: unknown field ‘idProduct’ specified in initializer
/home/jivan/RT73_Linux_STA_Drv1.0.4.0/Module/rtmp_main.c:66: warning: excess elements in struct initializer
/home/jivan/RT73_Linux_STA_Drv1.0.4.0/Module/rtmp_main.c:66: warning: (near initialization for ‘rtusb_usb_id[24]’)
/home/jivan/RT73_Linux_STA_Drv1.0.4.0/Module/rtmp_main.c:66: error: unknown field ‘match_flags’ specified in initializer
/home/jivan/RT73_Linux_STA_Drv1.0.4.0/Module/rtmp_main.c:66: warning: excess elements in struct initializer
/home/jivan/RT73_Linux_STA_Drv1.0.4.0/Module/rtmp_main.c:66: warning: (near initialization for ‘rtusb_usb_id[25]’)
/home/jivan/RT73_Linux_STA_Drv1.0.4.0/Module/rtmp_main.c:66: error: unknown field ‘idVendor’ specified in initializer
/home/jivan/RT73_Linux_STA_Drv1.0.4.0/Module/rtmp_main.c:66: warning: excess elements in struct initializer
/home/jivan/RT73_Linux_STA_Drv1.0.4.0/Module/rtmp_main.c:66: warning: (near initialization for ‘rtusb_usb_id[25]’)
/home/jivan/RT73_Linux_STA_Drv1.0.4.0/Module/rtmp_main.c:66: error: unknown field ‘idProduct’ specified in initializer
/home/jivan/RT73_Linux_STA_Drv1.0.4.0/Module/rtmp_main.c:66: warning: excess elements in struct initializer
/home/jivan/RT73_Linux_STA_Drv1.0.4.0/Module/rtmp_main.c:66: warning: (near initialization for ‘rtusb_usb_id[25]’)
/home/jivan/RT73_Linux_STA_Drv1.0.4.0/Module/rtmp_main.c:66: error: unknown field ‘match_flags’ specified in initializer
/home/jivan/RT73_Linux_STA_Drv1.0.4.0/Module/rtmp_main.c:66: warning: excess elements in struct initializer
/home/jivan/RT73_Linux_STA_Drv1.0.4.0/Module/rtmp_main.c:66: warning: (near initialization for ‘rtusb_usb_id[26]’)
/home/jivan/RT73_Linux_STA_Drv1.0.4.0/Module/rtmp_main.c:66: error: unknown field ‘idVendor’ specified in initializer
/home/jivan/RT73_Linux_STA_Drv1.0.4.0/Module/rtmp_main.c:66: warning: excess elements in struct initializer
/home/jivan/RT73_Linux_STA_Drv1.0.4.0/Module/rtmp_main.c:66: warning: (near initialization for ‘rtusb_usb_id[26]’)
/home/jivan/RT73_Linux_STA_Drv1.0.4.0/Module/rtmp_main.c:66: error: unknown field ‘idProduct’ specified in initializer
/home/jivan/RT73_Linux_STA_Drv1.0.4.0/Module/rtmp_main.c:66: warning: excess elements in struct initializer
/home/jivan/RT73_Linux_STA_Drv1.0.4.0/Module/rtmp_main.c:66: warning: (near initialization for ‘rtusb_usb_id[26]’)
/home/jivan/RT73_Linux_STA_Drv1.0.4.0/Module/rtmp_main.c:66: error: unknown field ‘match_flags’ specified in initializer
/home/jivan/RT73_Linux_STA_Drv1.0.4.0/Module/rtmp_main.c:66: warning: excess elements in struct initializer
/home/jivan/RT73_Linux_STA_Drv1.0.4.0/Module/rtmp_main.c:66: warning: (near initialization for ‘rtusb_usb_id[27]’)
/home/jivan/RT73_Linux_STA_Drv1.0.4.0/Module/rtmp_main.c:66: error: unknown field ‘idVendor’ specified in initializer
/home/jivan/RT73_Linux_STA_Drv1.0.4.0/Module/rtmp_main.c:66: warning: excess elements in struct initializer
/home/jivan/RT73_Linux_STA_Drv1.0.4.0/Module/rtmp_main.c:66: warning: (near initialization for ‘rtusb_usb_id[27]’)
/home/jivan/RT73_Linux_STA_Drv1.0.4.0/Module/rtmp_main.c:66: error: unknown field ‘idProduct’ specified in initializer
/home/jivan/RT73_Linux_STA_Drv1.0.4.0/Module/rtmp_main.c:66: warning: excess elements in struct initializer
/home/jivan/RT73_Linux_STA_Drv1.0.4.0/Module/rtmp_main.c:66: warning: (near initialization for ‘rtusb_usb_id[27]’)
/home/jivan/RT73_Linux_STA_Drv1.0.4.0/Module/rtmp_main.c:66: error: unknown field ‘match_flags’ specified in initializer
/home/jivan/RT73_Linux_STA_Drv1.0.4.0/Module/rtmp_main.c:66: warning: excess elements in struct initializer
/home/jivan/RT73_Linux_STA_Drv1.0.4.0/Module/rtmp_main.c:66: warning: (near initialization for ‘rtusb_usb_id[28]’)
/home/jivan/RT73_Linux_STA_Drv1.0.4.0/Module/rtmp_main.c:66: error: unknown field ‘idVendor’ specified in initializer
/home/jivan/RT73_Linux_STA_Drv1.0.4.0/Module/rtmp_main.c:66: warning: excess elements in struct initializer
/home/jivan/RT73_Linux_STA_Drv1.0.4.0/Module/rtmp_main.c:66: warning: (near initialization for ‘rtusb_usb_id[28]’)
/home/jivan/RT73_Linux_STA_Drv1.0.4.0/Module/rtmp_main.c:66: error: unknown field ‘idProduct’ specified in initializer
/home/jivan/RT73_Linux_STA_Drv1.0.4.0/Module/rtmp_main.c:66: warning: excess elements in struct initializer
/home/jivan/RT73_Linux_STA_Drv1.0.4.0/Module/rtmp_main.c:66: warning: (near initialization for ‘rtusb_usb_id[28]’)
/home/jivan/RT73_Linux_STA_Drv1.0.4.0/Module/rtmp_main.c:66: error: unknown field ‘match_flags’ specified in initializer
/home/jivan/RT73_Linux_STA_Drv1.0.4.0/Module/rtmp_main.c:66: warning: excess elements in struct initializer
/home/jivan/RT73_Linux_STA_Drv1.0.4.0/Module/rtmp_main.c:66: warning: (near initialization for ‘rtusb_usb_id[29]’)
/home/jivan/RT73_Linux_STA_Drv1.0.4.0/Module/rtmp_main.c:66: error: unknown field ‘idVendor’ specified in initializer
/home/jivan/RT73_Linux_STA_Drv1.0.4.0/Module/rtmp_main.c:66: warning: excess elements in struct initializer
/home/jivan/RT73_Linux_STA_Drv1.0.4.0/Module/rtmp_main.c:66: warning: (near initialization for ‘rtusb_usb_id[29]’)
/home/jivan/RT73_Linux_STA_Drv1.0.4.0/Module/rtmp_main.c:66: error: unknown field ‘idProduct’ specified in initializer
/home/jivan/RT73_Linux_STA_Drv1.0.4.0/Module/rtmp_main.c:66: warning: excess elements in struct initializer
/home/jivan/RT73_Linux_STA_Drv1.0.4.0/Module/rtmp_main.c:66: warning: (near initialization for ‘rtusb_usb_id[29]’)
/home/jivan/RT73_Linux_STA_Drv1.0.4.0/Module/rtmp_main.c:66: error: unknown field ‘match_flags’ specified in initializer
/home/jivan/RT73_Linux_STA_Drv1.0.4.0/Module/rtmp_main.c:66: warning: excess elements in struct initializer
/home/jivan/RT73_Linux_STA_Drv1.0.4.0/Module/rtmp_main.c:66: warning: (near initialization for ‘rtusb_usb_id[30]’)
/home/jivan/RT73_Linux_STA_Drv1.0.4.0/Module/rtmp_main.c:66: error: unknown field ‘idVendor’ specified in initializer
/home/jivan/RT73_Linux_STA_Drv1.0.4.0/Module/rtmp_main.c:66: warning: excess elements in struct initializer
/home/jivan/RT73_Linux_STA_Drv1.0.4.0/Module/rtmp_main.c:66: warning: (near initialization for ‘rtusb_usb_id[30]’)
/home/jivan/RT73_Linux_STA_Drv1.0.4.0/Module/rtmp_main.c:66: error: unknown field ‘idProduct’ specified in initializer
/home/jivan/RT73_Linux_STA_Drv1.0.4.0/Module/rtmp_main.c:66: warning: excess elements in struct initializer
/home/jivan/RT73_Linux_STA_Drv1.0.4.0/Module/rtmp_main.c:66: warning: (near initialization for ‘rtusb_usb_id[30]’)
/home/jivan/RT73_Linux_STA_Drv1.0.4.0/Module/rtmp_main.c:67: warning: division by zero
/home/jivan/RT73_Linux_STA_Drv1.0.4.0/Module/rtmp_main.c:67: error: initializer element is not computable at load time
/home/jivan/RT73_Linux_STA_Drv1.0.4.0/Module/rtmp_main.c:81:5: warning: "LINUX_VERSION_CODE" is not defined
/home/jivan/RT73_Linux_STA_Drv1.0.4.0/Module/rtmp_main.c:85: error: expected declaration specifiers or ‘...’ before ‘u32’
/home/jivan/RT73_Linux_STA_Drv1.0.4.0/Module/rtmp_main.c:90: warning: initialization from incompatible pointer type
/home/jivan/RT73_Linux_STA_Drv1.0.4.0/Module/rtmp_main.c:91: warning: initialization from incompatible pointer type
/home/jivan/RT73_Linux_STA_Drv1.0.4.0/Module/rtmp_main.c: In function ‘rt73_get_ether_stats’:
/home/jivan/RT73_Linux_STA_Drv1.0.4.0/Module/rtmp_main.c:126: error: ‘struct _RTMP_ADAPTER’ has no member named ‘stats’
/home/jivan/RT73_Linux_STA_Drv1.0.4.0/Module/rtmp_main.c:126: error: ‘struct _RTMP_ADAPTER’ has no member named ‘WlanCounters’
/home/jivan/RT73_Linux_STA_Drv1.0.4.0/Module/rtmp_main.c:127: error: ‘struct _RTMP_ADAPTER’ has no member named ‘stats’
/home/jivan/RT73_Linux_STA_Drv1.0.4.0/Module/rtmp_main.c:127: error: ‘struct _RTMP_ADAPTER’ has no member named ‘WlanCounters’
/home/jivan/RT73_Linux_STA_Drv1.0.4.0/Module/rtmp_main.c:129: error: ‘struct _RTMP_ADAPTER’ has no member named ‘stats’
/home/jivan/RT73_Linux_STA_Drv1.0.4.0/Module/rtmp_main.c:129: error: ‘struct _RTMP_ADAPTER’ has no member named ‘RalinkCounters’
/home/jivan/RT73_Linux_STA_Drv1.0.4.0/Module/rtmp_main.c:130: error: ‘struct _RTMP_ADAPTER’ has no member named ‘stats’
/home/jivan/RT73_Linux_STA_Drv1.0.4.0/Module/rtmp_main.c:130: error: ‘struct _RTMP_ADAPTER’ has no member named ‘RalinkCounters’
/home/jivan/RT73_Linux_STA_Drv1.0.4.0/Module/rtmp_main.c:132: error: ‘struct _RTMP_ADAPTER’ has no member named ‘stats’
/home/jivan/RT73_Linux_STA_Drv1.0.4.0/Module/rtmp_main.c:132: error: ‘struct _RTMP_ADAPTER’ has no member named ‘Counters8023’
/home/jivan/RT73_Linux_STA_Drv1.0.4.0/Module/rtmp_main.c:133: error: ‘struct _RTMP_ADAPTER’ has no member named ‘stats’
/home/jivan/RT73_Linux_STA_Drv1.0.4.0/Module/rtmp_main.c:133: error: ‘struct _RTMP_ADAPTER’ has no member named ‘Counters8023’
/home/jivan/RT73_Linux_STA_Drv1.0.4.0/Module/rtmp_main.c:135: error: ‘struct _RTMP_ADAPTER’ has no member named ‘stats’
/home/jivan/RT73_Linux_STA_Drv1.0.4.0/Module/rtmp_main.c:135: error: ‘struct _RTMP_ADAPTER’ has no member named ‘Counters8023’
/home/jivan/RT73_Linux_STA_Drv1.0.4.0/Module/rtmp_main.c:136: error: ‘struct _RTMP_ADAPTER’ has no member named ‘stats’
/home/jivan/RT73_Linux_STA_Drv1.0.4.0/Module/rtmp_main.c:136: error: ‘struct _RTMP_ADAPTER’ has no member named ‘WlanCounters’
/home/jivan/RT73_Linux_STA_Drv1.0.4.0/Module/rtmp_main.c:138: error: ‘struct _RTMP_ADAPTER’ has no member named ‘stats’
/home/jivan/RT73_Linux_STA_Drv1.0.4.0/Module/rtmp_main.c:138: error: ‘struct _RTMP_ADAPTER’ has no member named ‘WlanCounters’
/home/jivan/RT73_Linux_STA_Drv1.0.4.0/Module/rtmp_main.c:139: error: ‘struct _RTMP_ADAPTER’ has no member named ‘stats’
/home/jivan/RT73_Linux_STA_Drv1.0.4.0/Module/rtmp_main.c:139: error: ‘struct _RTMP_ADAPTER’ has no member named ‘Counters8023’
/home/jivan/RT73_Linux_STA_Drv1.0.4.0/Module/rtmp_main.c:139: error: ‘struct _RTMP_ADAPTER’ has no member named ‘Counters8023’
/home/jivan/RT73_Linux_STA_Drv1.0.4.0/Module/rtmp_main.c:141: error: ‘struct _RTMP_ADAPTER’ has no member named ‘stats’
/home/jivan/RT73_Linux_STA_Drv1.0.4.0/Module/rtmp_main.c:142: error: ‘struct _RTMP_ADAPTER’ has no member named ‘stats’
/home/jivan/RT73_Linux_STA_Drv1.0.4.0/Module/rtmp_main.c:142: error: ‘struct _RTMP_ADAPTER’ has no member named ‘Counters8023’
/home/jivan/RT73_Linux_STA_Drv1.0.4.0/Module/rtmp_main.c:143: error: ‘struct _RTMP_ADAPTER’ has no member named ‘stats’
/home/jivan/RT73_Linux_STA_Drv1.0.4.0/Module/rtmp_main.c:144: error: ‘struct _RTMP_ADAPTER’ has no member named ‘stats’
/home/jivan/RT73_Linux_STA_Drv1.0.4.0/Module/rtmp_main.c:144: error: ‘struct _RTMP_ADAPTER’ has no member named ‘Counters8023’
/home/jivan/RT73_Linux_STA_Drv1.0.4.0/Module/rtmp_main.c:145: error: ‘struct _RTMP_ADAPTER’ has no member named ‘stats’
/home/jivan/RT73_Linux_STA_Drv1.0.4.0/Module/rtmp_main.c:145: error: ‘struct _RTMP_ADAPTER’ has no member named ‘Counters8023’
/home/jivan/RT73_Linux_STA_Drv1.0.4.0/Module/rtmp_main.c:146: error: ‘struct _RTMP_ADAPTER’ has no member named ‘stats’
/home/jivan/RT73_Linux_STA_Drv1.0.4.0/Module/rtmp_main.c:149: error: ‘struct _RTMP_ADAPTER’ has no member named ‘stats’
/home/jivan/RT73_Linux_STA_Drv1.0.4.0/Module/rtmp_main.c:150: error: ‘struct _RTMP_ADAPTER’ has no member named ‘stats’
/home/jivan/RT73_Linux_STA_Drv1.0.4.0/Module/rtmp_main.c:151: error: ‘struct _RTMP_ADAPTER’ has no member named ‘stats’
/home/jivan/RT73_Linux_STA_Drv1.0.4.0/Module/rtmp_main.c:152: error: ‘struct _RTMP_ADAPTER’ has no member named ‘stats’
/home/jivan/RT73_Linux_STA_Drv1.0.4.0/Module/rtmp_main.c:153: error: ‘struct _RTMP_ADAPTER’ has no member named ‘stats’
/home/jivan/RT73_Linux_STA_Drv1.0.4.0/Module/rtmp_main.c:156: error: ‘struct _RTMP_ADAPTER’ has no member named ‘stats’
/home/jivan/RT73_Linux_STA_Drv1.0.4.0/Module/rtmp_main.c:157: error: ‘struct _RTMP_ADAPTER’ has no member named ‘stats’
/home/jivan/RT73_Linux_STA_Drv1.0.4.0/Module/rtmp_main.c:159: error: ‘struct _RTMP_ADAPTER’ has no member named ‘stats’
/home/jivan/RT73_Linux_STA_Drv1.0.4.0/Module/rtmp_main.c: At top level:
/home/jivan/RT73_Linux_STA_Drv1.0.4.0/Module/rtmp_main.c:214: error: expected declaration specifiers or ‘...’ before ‘u8’
/home/jivan/RT73_Linux_STA_Drv1.0.4.0/Module/rtmp_main.c: In function ‘RTUSBHalt’:
/home/jivan/RT73_Linux_STA_Drv1.0.4.0/Module/rtmp_main.c:226: error: ‘struct _RTMP_ADAPTER’ has no member named ‘Flags’
/home/jivan/RT73_Linux_STA_Drv1.0.4.0/Module/rtmp_main.c:228: error: ‘struct _RTMP_ADAPTER’ has no member named ‘PortCfg’
/home/jivan/RT73_Linux_STA_Drv1.0.4.0/Module/rtmp_main.c:230: error: ‘MLME_DISASSOC_REQ_STRUCT’ has no member named ‘Addr’
/home/jivan/RT73_Linux_STA_Drv1.0.4.0/Module/rtmp_main.c:230: error: ‘struct _RTMP_ADAPTER’ has no member named ‘PortCfg’
/home/jivan/RT73_Linux_STA_Drv1.0.4.0/Module/rtmp_main.c:230: error: too many arguments to function ‘memcpy’
/home/jivan/RT73_Linux_STA_Drv1.0.4.0/Module/rtmp_main.c:231: error: ‘MLME_DISASSOC_REQ_STRUCT’ has no member named ‘Reason’
/home/jivan/RT73_Linux_STA_Drv1.0.4.0/Module/rtmp_main.c:233: error: ‘MLME_QUEUE_ELEM’ has no member named ‘Machine’
/home/jivan/RT73_Linux_STA_Drv1.0.4.0/Module/rtmp_main.c:234: error: ‘MLME_QUEUE_ELEM’ has no member named ‘MsgType’
/home/jivan/RT73_Linux_STA_Drv1.0.4.0/Module/rtmp_main.c:235: error: ‘MLME_QUEUE_ELEM’ has no member named ‘MsgLen’
/home/jivan/RT73_Linux_STA_Drv1.0.4.0/Module/rtmp_main.c:236: error: ‘MLME_QUEUE_ELEM’ has no member named ‘Msg’
/home/jivan/RT73_Linux_STA_Drv1.0.4.0/Module/rtmp_main.c:236: error: too many arguments to function ‘RTMPMoveMemory’
/home/jivan/RT73_Linux_STA_Drv1.0.4.0/Module/rtmp_main.c:239: warning: implicit declaration of function ‘RTMPusecDelay’
/home/jivan/RT73_Linux_STA_Drv1.0.4.0/Module/rtmp_main.c:245: error: too many arguments to function ‘RTUSBWriteMACRegister’
/home/jivan/RT73_Linux_STA_Drv1.0.4.0/Module/rtmp_main.c:248: error: too many arguments to function ‘RTMPSendNullFrame’
/home/jivan/RT73_Linux_STA_Drv1.0.4.0/Module/rtmp_main.c:254: error: too many arguments to function ‘RTMPSetLED’
/home/jivan/RT73_Linux_STA_Drv1.0.4.0/Module/rtmp_main.c:258: error: ‘struct _RTMP_ADAPTER’ has no member named ‘Flags’
/home/jivan/RT73_Linux_STA_Drv1.0.4.0/Module/rtmp_main.c:263: error: ‘struct _RTMP_ADAPTER’ has no member named ‘PortCfg’
/home/jivan/RT73_Linux_STA_Drv1.0.4.0/Module/rtmp_main.c:264: error: ‘struct _RTMP_ADAPTER’ has no member named ‘RxAnt’
/home/jivan/RT73_Linux_STA_Drv1.0.4.0/Module/rtmp_main.c:279: error: ‘IsFree’ undeclared (first use in this function)
/home/jivan/RT73_Linux_STA_Drv1.0.4.0/Module/rtmp_main.c:279: error: too many arguments to function ‘ReleaseAdapter’
/home/jivan/RT73_Linux_STA_Drv1.0.4.0/Module/rtmp_main.c:281: error: ‘struct _RTMP_ADAPTER’ has no member named ‘Flags’
/home/jivan/RT73_Linux_STA_Drv1.0.4.0/Module/rtmp_main.c: In function ‘usb_rtusb_open’:
/home/jivan/RT73_Linux_STA_Drv1.0.4.0/Module/rtmp_main.c:288: error: ‘u8’ undeclared (first use in this function)
/home/jivan/RT73_Linux_STA_Drv1.0.4.0/Module/rtmp_main.c:288: error: expected ‘;’ before ‘TmpPhy’
/home/jivan/RT73_Linux_STA_Drv1.0.4.0/Module/rtmp_main.c:294: error: ‘struct _RTMP_ADAPTER’ has no member named ‘PortCfg’
/home/jivan/RT73_Linux_STA_Drv1.0.4.0/Module/rtmp_main.c:331: error: ‘u32’ undeclared (first use in this function)
/home/jivan/RT73_Linux_STA_Drv1.0.4.0/Module/rtmp_main.c:331: error: expected ‘;’ before ‘MacCsr0’
/home/jivan/RT73_Linux_STA_Drv1.0.4.0/Module/rtmp_main.c:335: error: ‘MacCsr0’ undeclared (first use in this function)
/home/jivan/RT73_Linux_STA_Drv1.0.4.0/Module/rtmp_main.c:335: error: too many arguments to function ‘RTUSBReadMACRegister’
/home/jivan/RT73_Linux_STA_Drv1.0.4.0/Module/rtmp_main.c:341: error: ‘Index’ undeclared (first use in this function)
/home/jivan/RT73_Linux_STA_Drv1.0.4.0/Module/rtmp_main.c:371: error: ‘struct _RTMP_ADAPTER’ has no member named ‘NicConfig2’
/home/jivan/RT73_Linux_STA_Drv1.0.4.0/Module/rtmp_main.c:373: error: ‘struct _RTMP_ADAPTER’ has no member named ‘BbpTuning’
/home/jivan/RT73_Linux_STA_Drv1.0.4.0/Module/rtmp_main.c:374: error: ‘struct _RTMP_ADAPTER’ has no member named ‘BbpTuning’
/home/jivan/RT73_Linux_STA_Drv1.0.4.0/Module/rtmp_main.c:375: error: ‘struct _RTMP_ADAPTER’ has no member named ‘BbpTuning’
/home/jivan/RT73_Linux_STA_Drv1.0.4.0/Module/rtmp_main.c:376: error: ‘struct _RTMP_ADAPTER’ has no member named ‘BbpTuning’
/home/jivan/RT73_Linux_STA_Drv1.0.4.0/Module/rtmp_main.c:381: error: ‘TmpPhy’ undeclared (first use in this function)
/home/jivan/RT73_Linux_STA_Drv1.0.4.0/Module/rtmp_main.c:381: error: ‘struct _RTMP_ADAPTER’ has no member named ‘PortCfg’
/home/jivan/RT73_Linux_STA_Drv1.0.4.0/Module/rtmp_main.c:382: error: ‘struct _RTMP_ADAPTER’ has no member named ‘PortCfg’
/home/jivan/RT73_Linux_STA_Drv1.0.4.0/Module/rtmp_main.c:383: error: too many arguments to function ‘RTMPSetPhyMode’
/home/jivan/RT73_Linux_STA_Drv1.0.4.0/Module/rtmp_main.c:385: error: ‘struct _RTMP_ADAPTER’ has no member named ‘PortCfg’
/home/jivan/RT73_Linux_STA_Drv1.0.4.0/Module/rtmp_main.c:388: error: ‘RateIdToMbps’ undeclared (first use in this function)
/home/jivan/RT73_Linux_STA_Drv1.0.4.0/Module/rtmp_main.c:388: error: ‘struct _RTMP_ADAPTER’ has no member named ‘PortCfg’
/home/jivan/RT73_Linux_STA_Drv1.0.4.0/Module/rtmp_main.c:406: error: ‘struct _RTMP_ADAPTER’ has no member named ‘CurrentAddress’
/home/jivan/RT73_Linux_STA_Drv1.0.4.0/Module/rtmp_main.c:406: error: too many arguments to function ‘memcpy’
/home/jivan/RT73_Linux_STA_Drv1.0.4.0/Module/rtmp_main.c:410: error: ‘struct _RTMP_ADAPTER’ has no member named ‘Flags’
/home/jivan/RT73_Linux_STA_Drv1.0.4.0/Module/rtmp_main.c:411: error: ‘struct _RTMP_ADAPTER’ has no member named ‘Flags’
/home/jivan/RT73_Linux_STA_Drv1.0.4.0/Module/rtmp_main.c:413: error: ‘struct _RTMP_ADAPTER’ has no member named ‘Flags’
/home/jivan/RT73_Linux_STA_Drv1.0.4.0/Module/rtmp_main.c:416: error: too many arguments to function ‘RTUSBWriteMACRegister’
/home/jivan/RT73_Linux_STA_Drv1.0.4.0/Module/rtmp_main.c:418: error: ‘struct _RTMP_ADAPTER’ has no member named ‘PortCfg’
/home/jivan/RT73_Linux_STA_Drv1.0.4.0/Module/rtmp_main.c:418: error: too many arguments to function ‘AsicSwitchChannel’
/home/jivan/RT73_Linux_STA_Drv1.0.4.0/Module/rtmp_main.c:419: error: ‘struct _RTMP_ADAPTER’ has no member named ‘PortCfg’
/home/jivan/RT73_Linux_STA_Drv1.0.4.0/Module/rtmp_main.c:419: error: too many arguments to function ‘AsicLockChannel’
/home/jivan/RT73_Linux_STA_Drv1.0.4.0/Module/rtmp_main.c:424: error: ‘struct _RTMP_ADAPTER’ has no member named ‘VendorDesc’
/home/jivan/RT73_Linux_STA_Drv1.0.4.0/Module/rtmp_main.c:435: error: too many arguments to function ‘ReleaseAdapter’
/home/jivan/RT73_Linux_STA_Drv1.0.4.0/Module/rtmp_main.c:440:5: warning: "LINUX_VERSION_CODE" is not defined
/home/jivan/RT73_Linux_STA_Drv1.0.4.0/Module/rtmp_main.c: In function ‘usb_rtusb_close’:
/home/jivan/RT73_Linux_STA_Drv1.0.4.0/Module/rtmp_main.c:448: error: ‘current’ undeclared (first use in this function)
/home/jivan/RT73_Linux_STA_Drv1.0.4.0/Module/rtmp_main.c:458: error: ‘struct _RTMP_ADAPTER’ has no member named ‘wait’
/home/jivan/RT73_Linux_STA_Drv1.0.4.0/Module/rtmp_main.c:460: error: ‘struct _RTMP_ADAPTER’ has no member named ‘PendingRx’
/home/jivan/RT73_Linux_STA_Drv1.0.4.0/Module/rtmp_main.c:465: error: ‘struct _RTMP_ADAPTER’ has no member named ‘wait’
/home/jivan/RT73_Linux_STA_Drv1.0.4.0/Module/rtmp_main.c:468: error: ‘struct _RTMP_ADAPTER’ has no member named ‘MLMEThr_pid’
/home/jivan/RT73_Linux_STA_Drv1.0.4.0/Module/rtmp_main.c:471: error: ‘struct _RTMP_ADAPTER’ has no member named ‘MLMEThr_pid’
/home/jivan/RT73_Linux_STA_Drv1.0.4.0/Module/rtmp_main.c:471: warning: implicit declaration of function ‘up’
/home/jivan/RT73_Linux_STA_Drv1.0.4.0/Module/rtmp_main.c:472: warning: implicit declaration of function ‘wmb’
/home/jivan/RT73_Linux_STA_Drv1.0.4.0/Module/rtmp_main.c:473: warning: implicit declaration of function ‘kill_proc’
/home/jivan/RT73_Linux_STA_Drv1.0.4.0/Module/rtmp_main.c:473: error: ‘struct _RTMP_ADAPTER’ has no member named ‘MLMEThr_pid’
/home/jivan/RT73_Linux_STA_Drv1.0.4.0/Module/rtmp_main.c:473: error: ‘SIGTERM’ undeclared (first use in this function)
/home/jivan/RT73_Linux_STA_Drv1.0.4.0/Module/rtmp_main.c:476: error: ‘struct _RTMP_ADAPTER’ has no member named ‘MLMEThr_pid’
/home/jivan/RT73_Linux_STA_Drv1.0.4.0/Module/rtmp_main.c:480: error: ‘struct _RTMP_ADAPTER’ has no member named ‘MLMEThr_pid’
/home/jivan/RT73_Linux_STA_Drv1.0.4.0/Module/rtmp_main.c:482: error: ‘struct _RTMP_ADAPTER’ has no member named ‘RTUSBCmdThr_pid’
/home/jivan/RT73_Linux_STA_Drv1.0.4.0/Module/rtmp_main.c:485: error: ‘struct _RTMP_ADAPTER’ has no member named ‘RTUSBCmdThr_pid’
/home/jivan/RT73_Linux_STA_Drv1.0.4.0/Module/rtmp_main.c:487: error: ‘struct _RTMP_ADAPTER’ has no member named ‘RTUSBCmdThr_pid’
/home/jivan/RT73_Linux_STA_Drv1.0.4.0/Module/rtmp_main.c:490: error: ‘struct _RTMP_ADAPTER’ has no member named ‘RTUSBCmdThr_pid’
/home/jivan/RT73_Linux_STA_Drv1.0.4.0/Module/rtmp_main.c:494: error: ‘struct _RTMP_ADAPTER’ has no member named ‘RTUSBCmdThr_pid’
/home/jivan/RT73_Linux_STA_Drv1.0.4.0/Module/rtmp_main.c:497: error: too many arguments to function ‘RTUSBHalt’
/home/jivan/RT73_Linux_STA_Drv1.0.4.0/Module/rtmp_main.c:499: error: ‘struct _RTMP_ADAPTER’ has no member named ‘Flags’
/home/jivan/RT73_Linux_STA_Drv1.0.4.0/Module/rtmp_main.c: In function ‘MlmeThread’:
/home/jivan/RT73_Linux_STA_Drv1.0.4.0/Module/rtmp_main.c:512: error: too few arguments to function ‘daemonize’
/home/jivan/RT73_Linux_STA_Drv1.0.4.0/Module/rtmp_main.c:513: error: ‘current’ undeclared (first use in this function)
/home/jivan/RT73_Linux_STA_Drv1.0.4.0/Module/rtmp_main.c:525: warning: implicit declaration of function ‘down’
/home/jivan/RT73_Linux_STA_Drv1.0.4.0/Module/rtmp_main.c: In function ‘RTUSBCmdThread’:
/home/jivan/RT73_Linux_STA_Drv1.0.4.0/Module/rtmp_main.c:579: error: too few arguments to function ‘daemonize’
/home/jivan/RT73_Linux_STA_Drv1.0.4.0/Module/rtmp_main.c:580: error: ‘current’ undeclared (first use in this function)
/home/jivan/RT73_Linux_STA_Drv1.0.4.0/Module/rtmp_main.c: At top level:
/home/jivan/RT73_Linux_STA_Drv1.0.4.0/Module/rtmp_main.c:622: error: expected declaration specifiers or ‘...’ before ‘u32’
/home/jivan/RT73_Linux_STA_Drv1.0.4.0/Module/rtmp_main.c: In function ‘usb_rtusb_probe’:
/home/jivan/RT73_Linux_STA_Drv1.0.4.0/Module/rtmp_main.c:628: error: ‘ENOMEM’ undeclared (first use in this function)
/home/jivan/RT73_Linux_STA_Drv1.0.4.0/Module/rtmp_main.c:632: error: ‘struct usb_device_descriptor’ has no member named ‘idVendor’
/home/jivan/RT73_Linux_STA_Drv1.0.4.0/Module/rtmp_main.c:632: error: ‘struct usb_device_id’ has no member named ‘idVendor’
/home/jivan/RT73_Linux_STA_Drv1.0.4.0/Module/rtmp_main.c:633: error: ‘struct usb_device_descriptor’ has no member named ‘idProduct’
/home/jivan/RT73_Linux_STA_Drv1.0.4.0/Module/rtmp_main.c:633: error: ‘struct usb_device_id’ has no member named ‘idProduct’
/home/jivan/RT73_Linux_STA_Drv1.0.4.0/Module/rtmp_main.c:635: error: ‘struct usb_device_descriptor’ has no member named ‘idVendor’
/home/jivan/RT73_Linux_STA_Drv1.0.4.0/Module/rtmp_main.c:635: error: ‘struct usb_device_descriptor’ has no member named ‘idProduct’
/home/jivan/RT73_Linux_STA_Drv1.0.4.0/Module/rtmp_main.c:649: error: ‘MOD_DEC_USE_COUNT’ undeclared (first use in this function)
/home/jivan/RT73_Linux_STA_Drv1.0.4.0/Module/rtmp_main.c:650: warning: implicit declaration of function ‘usb_dec_dev_use’
/home/jivan/RT73_Linux_STA_Drv1.0.4.0/Module/rtmp_main.c:663: error: too many arguments to function ‘RTMPZeroMemory’
/home/jivan/RT73_Linux_STA_Drv1.0.4.0/Module/rtmp_main.c:666: warning: assignment from incompatible pointer type
/home/jivan/RT73_Linux_STA_Drv1.0.4.0/Module/rtmp_main.c:671: error: ‘struct net_device’ has no member named ‘open’
/home/jivan/RT73_Linux_STA_Drv1.0.4.0/Module/rtmp_main.c:673: error: ‘struct net_device’ has no member named ‘stop’
/home/jivan/RT73_Linux_STA_Drv1.0.4.0/Module/rtmp_main.c:680: error: ‘struct net_device’ has no member named ‘do_ioctl’
/home/jivan/RT73_Linux_STA_Drv1.0.4.0/Module/rtmp_main.c:686: error: ‘struct _RTMP_ADAPTER’ has no member named ‘PortCfg’
/home/jivan/RT73_Linux_STA_Drv1.0.4.0/Module/rtmp_main.c:692: error: ‘interface’ undeclared (first use in this function)
/home/jivan/RT73_Linux_STA_Drv1.0.4.0/Module/rtmp_main.c:701: error: ‘dev_base’ undeclared (first use in this function)
/home/jivan/RT73_Linux_STA_Drv1.0.4.0/Module/rtmp_main.c:701: error: ‘struct net_device’ has no member named ‘next’
/home/jivan/RT73_Linux_STA_Drv1.0.4.0/Module/rtmp_main.c:703: error: too many arguments to function ‘strncmp’
/home/jivan/RT73_Linux_STA_Drv1.0.4.0/Module/rtmp_main.c:723: error: ‘struct usb_interface’ has no member named ‘act_altsetting’
/home/jivan/RT73_Linux_STA_Drv1.0.4.0/Module/rtmp_main.c:724: error: ‘struct usb_interface_descriptor’ has no member named ‘endpoint’
/home/jivan/RT73_Linux_STA_Drv1.0.4.0/Module/rtmp_main.c:726: error: ‘struct _RTMP_ADAPTER’ has no member named ‘BulkOutMaxPacketSize’
/home/jivan/RT73_Linux_STA_Drv1.0.4.0/Module/rtmp_main.c:726: error: ‘u16’ undeclared (first use in this function)
/home/jivan/RT73_Linux_STA_Drv1.0.4.0/Module/rtmp_main.c:726: error: expected ‘;’ before ‘ep’
/home/jivan/RT73_Linux_STA_Drv1.0.4.0/Module/rtmp_main.c:737: error: ‘struct _RTMP_ADAPTER’ has no member named ‘Flags’
/home/jivan/RT73_Linux_STA_Drv1.0.4.0/Module/rtmp_main.c: In function ‘usb_rtusb_disconnect’:
/home/jivan/RT73_Linux_STA_Drv1.0.4.0/Module/rtmp_main.c:755: error: ‘struct _RTMP_ADAPTER’ has no member named ‘Flags’
/home/jivan/RT73_Linux_STA_Drv1.0.4.0/Module/rtmp_main.c:757: warning: implicit declaration of function ‘udelay’
/home/jivan/RT73_Linux_STA_Drv1.0.4.0/Module/rtmp_main.c:777: error: ‘MOD_IN_USE’ undeclared (first use in this function)
/home/jivan/RT73_Linux_STA_Drv1.0.4.0/Module/rtmp_main.c:778: error: ‘MOD_DEC_USE_COUNT’ undeclared (first use in this function)
make[2]: *** [/home/jivan/RT73_Linux_STA_Drv1.0.4.0/Module/rtmp_main.o] Error 1
make[1]: *** [_module_/home/jivan/RT73_Linux_STA_Drv1.0.4.0/Module] Error 2
make[1]: Leaving directory `/usr/src/linux-2.6.22-sabayon'
make: *** [all] Error 2