rendered paste body1>------ Build started: Project: login_sql, Configuration: Release Win32 ------
2>------ Build started: Project: char_sql, Configuration: Release Win32 ------
2>Compiling...
1>Compiling...
1>socket.c
2>timer.c
1>nullpo.c
2>nullpo.c
1>md5calc.c
2>md5calc.c
1>malloc.c
2>malloc.c
1>login.c
2>lock.c
2>inter.c
1>lock.c
2>int_status.c
1>httpd.c
1>grfio.c
2>int_homun.c
1>graph.c
2>int_mail.c
1>db.c
1>core.c
2>int_storage.c
1>atnwinsvc.c
2>int_pet.c
1>Generating Code...
2>int_party.c
2>int_guild.c
2>httpd.c
2>grfio.c
2>graph.c
2>db.c
2>core.c
2>char.c
2>atnwinsvc.c
2>Generating Code...
1>Compiling manifest to resources...
2>Compiling manifest to resources...
2>Microsoft (R) Windows (R) Resource Compiler Version 6.0.5724.0
2>Copyright (C) Microsoft Corporation. All rights reserved.
1>Microsoft (R) Windows (R) Resource Compiler Version 6.0.5724.0
1>Copyright (C) Microsoft Corporation. All rights reserved.
1>Linking...
2>Linking...
1>LINK : fatal error LNK1104: cannot open file '.\release_sql\timer.obj'
2>LINK : fatal error LNK1104: cannot open file '.\release_sql\socket.obj'
1>Build log was saved at "file://c:\Documents and Settings\Administrator\Desktop\Aurora\src\login\Release_sql\BuildLog.htm"
1>login_sql - 1 error(s), 0 warning(s)
2>Build log was saved at "file://c:\Documents and Settings\Administrator\Desktop\Aurora\src\char\Release_sql\BuildLog.htm"
2>char_sql - 1 error(s), 0 warning(s)
3>------ Build started: Project: converter, Configuration: Release Win32 ------
3>Compiling...
3>timer.c
4>------ Build started: Project: map, Configuration: Release Win32 ------
4>Compiling...
4>mail.c
3>socket.c
4>homun.c
3>md5calc.c
3>malloc.c
3>login-converter.c
4>vending.c
3>inter-converter.c
4>unit.c
3>httpd.c
3>db.c
4>trade.c
3>core.c
4>timer.c
3>converter.c
4>storage.c
3>char-converter.c
4>status.c
3>Generating Code...
4>socket.c
3>Compiling manifest to resources...
3>Microsoft (R) Windows (R) Resource Compiler Version 6.0.5724.0
3>Copyright (C) Microsoft Corporation. All rights reserved.
3>Linking...
4>skill.c
3>malloc.obj : error LNK2019: unresolved external symbol _ShowDebug referenced in function _do_init_memmgr
3>../../txt-converter.exe : fatal error LNK1120: 1 unresolved externals
3>Build log was saved at "file://c:\Documents and Settings\Administrator\Desktop\Aurora\src\converter\Release\BuildLog.htm"
3>converter - 2 error(s), 0 warning(s)
4>script.c
4>ranking.c
4>pet.c
4>pc.c
4>path.c
4>party.c
4>nullpo.c
4>npc.c
4>mob.c
4>md5calc.c
4>Generating Code...
4>Compiling...
4>map.c
4>malloc.c
4>lock.c
4>itemdb.c
4>intif.c
4>httpd.c
4>guild.c
4>grfio.c
4>graph.c
4>friend.c
4>db.c
4>date.c
4>core.c
4>clif.c
4>chrif.c
4>chat.c
4>battle.c
4>atcommand.c
4>atnwinsvc.c
4>Generating Code...
4>Compiling manifest to resources...
4>Microsoft (R) Windows (R) Resource Compiler Version 6.0.5724.0
4>Copyright (C) Microsoft Corporation. All rights reserved.
4>Linking...
4>pet.obj : error LNK2001: unresolved external symbol _ShowStatus
4>skill.obj : error LNK2001: unresolved external symbol _ShowStatus
4>status.obj : error LNK2019: unresolved external symbol _ShowStatus referenced in function _status_calc_pc
4>homun.obj : error LNK2001: unresolved external symbol _ShowStatus
4>itemdb.obj : error LNK2001: unresolved external symbol _ShowStatus
4>mob.obj : error LNK2001: unresolved external symbol _ShowStatus
4>npc.obj : error LNK2001: unresolved external symbol _ShowStatus
4>pc.obj : error LNK2001: unresolved external symbol _ShowStatus
4>chrif.obj : error LNK2001: unresolved external symbol _ShowStatus
4>clif.obj : error LNK2001: unresolved external symbol _ShowStatus
4>grfio.obj : error LNK2001: unresolved external symbol _ShowStatus
4>guild.obj : error LNK2001: unresolved external symbol _ShowStatus
4>homun.obj : error LNK2001: unresolved external symbol _ShowError
4>pc.obj : error LNK2001: unresolved external symbol _ShowError
4>pet.obj : error LNK2001: unresolved external symbol _ShowError
4>skill.obj : error LNK2001: unresolved external symbol _ShowError
4>status.obj : error LNK2001: unresolved external symbol _ShowError
4>chrif.obj : error LNK2019: unresolved external symbol _ShowError referenced in function _chrif_changemapserverack
4>clif.obj : error LNK2001: unresolved external symbol _ShowError
4>guild.obj : error LNK2001: unresolved external symbol _ShowError
4>mob.obj : error LNK2001: unresolved external symbol _ShowError
4>mob.obj : error LNK2001: unresolved external symbol _ShowDebug
4>pc.obj : error LNK2019: unresolved external symbol _ShowDebug referenced in function _pc_bonus
4>skill.obj : error LNK2001: unresolved external symbol _ShowDebug
4>status.obj : error LNK2001: unresolved external symbol _ShowDebug
4>chrif.obj : error LNK2001: unresolved external symbol _ShowDebug
4>clif.obj : error LNK2001: unresolved external symbol _ShowDebug
4>guild.obj : error LNK2001: unresolved external symbol _ShowDebug
4>malloc.obj : error LNK2001: unresolved external symbol _ShowDebug
4>chrif.obj : error LNK2019: unresolved external symbol _ShowInfo referenced in function _chrif_mapactive
4>skill.obj : error LNK2019: unresolved external symbol _ShowWarning referenced in function _skill_unit_onplace
4>status.obj : error LNK2001: unresolved external symbol _ShowWarning
4>homun.obj : error LNK2001: unresolved external symbol _ShowWarning
4>mob.obj : error LNK2001: unresolved external symbol _ShowWarning
4>npc.obj : error LNK2001: unresolved external symbol _ShowWarning
4>pc.obj : error LNK2001: unresolved external symbol _ShowWarning
4>pet.obj : error LNK2001: unresolved external symbol _ShowWarning
4>chrif.obj : error LNK2001: unresolved external symbol _ShowWarning
4>clif.obj : error LNK2001: unresolved external symbol _ShowWarning
4>guild.obj : error LNK2001: unresolved external symbol _ShowWarning
4>itemdb.obj : error LNK2001: unresolved external symbol _ShowWarning
4>clif.obj : error LNK2019: unresolved external symbol _ShowFatalError referenced in function _packetdb_readdb
4>status.obj : error LNK2001: unresolved external symbol _ShowFatalError
4>../../map-server.exe : fatal error LNK1120: 6 unresolved externals
4>Build log was saved at "file://c:\Documents and Settings\Administrator\Desktop\Aurora\src\map\Release\BuildLog.htm"
4>map - 44 error(s), 0 warning(s)
========== Build: 0 succeeded, 4 failed, 1 up-to-date, 0 skipped ==========