All pastes #747986 Raw Edit

Something

public text v1 · immutable
#747986 ·published 2007-10-24 14:26 UTC
rendered paste body
if g++ -DHAVE_CONFIG_H -I. -I. -I..   -I/usr/include/freetype2  -pthread -DORBIT2=1 -I/opt/gnome2.22/include/gnome-vfs-2.0 -I/opt/gnome2.22/lib/gnome-vfs-2.0/include -I/opt/gnome2.22/include/gconf/2 -I/opt/gnome2.22/include/orbit-2.0 -I/opt/gnome2.22/include/glib-2.0 -I/opt/gnome2.22/lib/glib-2.0/include    -I/usr/include/freetype2   -I/opt/gnome2.22/include/gtk-unix-print-2.0 -I/opt/gnome2.22/include/gtk-2.0 -I/opt/gnome2.22/include/atk-1.0 -I/opt/gnome2.22/include/cairo -I/opt/gnome2.22/lib/gtk-2.0/include -I/opt/gnome2.22/include/pango-1.0 -I/opt/gnome2.22/include/glib-2.0 -I/opt/gnome2.22/lib/glib-2.0/include -I/usr/include/freetype2 -I/usr/include/libpng12   -I/opt/gnome2.22/include/poppler   -I/opt/gnome2.22/include/poppler/glib -I/opt/gnome2.22/include/poppler -I/opt/gnome2.22/include/gtk-2.0 -I/opt/gnome2.22/lib/gtk-2.0/include -I/opt/gnome2.22/include/cairo -I/opt/gnome2.22/include/glib-2.0 -I/opt/gnome2.22/lib/glib-2.0/include -I/opt/gnome2.22/include/pango-1.0 -I/usr/include/freetype2 -I/usr/include/libpng12   -DPOTRACE=\"potrace\" -pthread -I/opt/gnome2.22/include/gdkmm-2.4 -I/opt/gnome2.22/lib/gdkmm-2.4/include -I/opt/gnome2.22/include/glibmm-2.4 -I/opt/gnome2.22/lib/glibmm-2.4/include -I/opt/gnome2.22/include/pangomm-1.4 -I/opt/gnome2.22/include/gtk-2.0 -I/opt/gnome2.22/lib/gtk-2.0/include -I/opt/gnome2.22/include/cairomm-1.0 -I/opt/gnome2.22/include/sigc++-2.0 -I/opt/gnome2.22/lib/sigc++-2.0/include -I/opt/gnome2.22/include/glib-2.0 -I/opt/gnome2.22/lib/glib-2.0/include -I/opt/gnome2.22/include/pango-1.0 -I/opt/gnome2.22/include/cairo -I/opt/gnome2.22/include/gtkmm-2.4 -I/opt/gnome2.22/lib/gtkmm-2.4/include -I/opt/gnome2.22/include/atkmm-1.6 -I/opt/gnome2.22/include/atk-1.0 -I/opt/gnome2.22/include/gtkspell-2.0 -I/usr/include/freetype2 -I/usr/include/libpng12 -I/usr/include/libxml2   -I../cxxtest    -Wall -Wformat-security -W -Wpointer-arith -Wcast-align -Wsign-compare -Woverloaded-virtual -Wswitch -D_FORTIFY_SOURCE=2 -Wno-unused-parameter -g -O2 -MT extension/internal/cairo-ps-out.o -MD -MP -MF "extension/internal/.deps/cairo-ps-out.Tpo" \
          -c -o extension/internal/cairo-ps-out.o `test -f 'extension/internal/cairo-ps-out.cpp' || echo './'`extension/internal/cairo-ps-out.cpp; \
        then mv -f "extension/internal/.deps/cairo-ps-out.Tpo" "extension/internal/.deps/cairo-ps-out.Po"; \
        else rm -f "extension/internal/.deps/cairo-ps-out.Tpo"; exit 1; \
        fi
extension/internal/pdf-input-cairo.cpp:25:34: error: poppler/glib/poppler.h: No such file or directory
extension/internal/pdf-input-cairo.cpp:26:43: error: poppler/glib/poppler-document.h: No such file or directory
extension/internal/pdf-input-cairo.cpp:27:39: error: poppler/glib/poppler-page.h: No such file or directory
extension/internal/pdf-input-cairo.cpp: In member function ‘virtual SPDocument* Inkscape::Extension::Internal::PdfInputCairo::open(Inkscape::Extension::Input*, const gchar*)’:
extension/internal/pdf-input-cairo.cpp:40: error: ‘PopplerDocument’ was not declared in this scope
extension/internal/pdf-input-cairo.cpp:40: error: ‘document’ was not declared in this scope
extension/internal/pdf-input-cairo.cpp:40: error: ‘poppler_document_new_from_file’ was not declared in this scope
extension/internal/pdf-input-cairo.cpp:45: error: ‘PopplerPage’ was not declared in this scope
extension/internal/pdf-input-cairo.cpp:45: error: ‘page’ was not declared in this scope
extension/internal/pdf-input-cairo.cpp:45: error: ‘poppler_document_get_page’ was not declared in this scope
extension/internal/pdf-input-cairo.cpp:46: error: ‘poppler_page_get_size’ was not declared in this scope
extension/internal/pdf-input-cairo.cpp:53: error: ‘poppler_page_render’ was not declared in this scope
make[2]: *** [extension/internal/pdf-input-cairo.o] Error 1
make[2]: *** Waiting for unfinished jobs....
make[2]: Leaving directory `/home/nx/code/svn/inkscape/src'
make[1]: *** [all-recursive] Error 1
make[1]: Leaving directory `/home/nx/code/svn/inkscape'
make: *** [all] Error 2