All pastes #747981 Raw Edit

Miscellany

public text v1 · immutable
#747981 ·published 2007-10-24 14:24 UTC
rendered paste body
make[1]: Entering directory `/home/andy/Desktop/install/mythstream-0.18_1/mythstream'
g++ -c -pipe -Wall -W -O2 -fomit-frame-pointer -D_REENTRANT -fPIC  -DPERL=1 -DSHELL=2 -DEXEC=3 -DPARSER=PERL -D_GNU_SOURCE -DPREFIX=\"/usr\" -DVERSION=\"0.18_1\" -DTARGET=\"mythstream\" -DSUBPATH=\"mythtv/mythstream\" -DPLAYLIST=\".pls.asx.ram.rm.pls.m3u\" -DMYTHTV -DQT_NO_DEBUG -DQT_THREAD_SUPPORT -DQT_PLUGIN -DQT_SHARED -DQT_TABLET_SUPPORT -I/usr/share/qt3/mkspecs/default -I. -I/usr/include -I/usr/include/qt3 -o main.o main.cpp
In file included from main.cpp:31:
mythstream.h:31:28: error: mythtv/uitypes.h: No such file or directory
mythstream.h:32:29: error: mythtv/xmlparse.h: No such file or directory
mythstream.h:33:32: error: mythtv/oldsettings.h: No such file or directory
mythstream.h:34:32: error: mythtv/mythwidgets.h: No such file or directory
mythstream.h:35:32: error: mythtv/mythdialogs.h: No such file or directory
In file included from ../libs/streamstatus.h:40,
                 from ../libs/streambrowser.h:36,
                 from mythstream.h:41,
                 from main.cpp:31:
../libs/configelements.h:33:36: error: mythtv/virtualkeyboard.h: No such file or directory
main.cpp:35:32: error: mythtv/mythcontext.h: No such file or directory
main.cpp:37:30: error: mythtv/mythmedia.h: No such file or directory
main.cpp:38:31: error: mythtv/mythplugin.h: No such file or directory
main.cpp:39:45: error: mythtv/libmythui/myththemedmenu.h: No such file or directory
/usr/include/qt3/qsqldatabase.h:63: warning: ‘class QSqlDriverCreatorBase’ has virtual functions but non-virtual destructor
../libs/configelements.h:194: error: ISO C++ forbids declaration of ‘MythLineEdit’ with no type
../libs/configelements.h:194: error: expected ‘;’ before ‘*’ token
../libs/storageconfig.h:48: error: ‘MythDialog’ does not name a type
../libs/storageconfig.h:49: error: ‘MythMainWindow’ does not name a type
../libs/storageconfig.h:58: error: expected class-name before ‘{’ token
../libs/storageconfig.h:62: error: expected `)' before ‘*’ token
../libs/storageconfig.h:58: warning: ‘class StorageConfig’ has virtual functions but non-virtual destructor
../libs/streamconfig.h:51: error: ‘MythDialog’ does not name a type
../libs/streamconfig.h:52: error: ‘MythMainWindow’ does not name a type
../libs/streamconfig.h:106: error: expected class-name before ‘{’ token
../libs/streamconfig.h:110: error: expected `)' before ‘*’ token
../libs/streamconfig.h:106: warning: ‘class Readme’ has virtual functions but non-virtual destructor
../libs/streamconfig.h:141: error: expected class-name before ‘{’ token
../libs/streamconfig.h:145: error: expected `)' before ‘*’ token
../libs/streamconfig.h:177: error: ISO C++ forbids declaration of ‘MythLineEdit’ with no type
../libs/streamconfig.h:177: error: expected ‘;’ before ‘*’ token
../libs/streamconfig.h:178: error: ISO C++ forbids declaration of ‘MythLineEdit’ with no type
../libs/streamconfig.h:178: error: expected ‘;’ before ‘*’ token
../libs/streamconfig.h:179: error: ISO C++ forbids declaration of ‘MythLineEdit’ with no type
../libs/streamconfig.h:179: error: expected ‘;’ before ‘*’ token
../libs/streamconfig.h:180: error: ISO C++ forbids declaration of ‘MythLineEdit’ with no type
../libs/streamconfig.h:180: error: expected ‘;’ before ‘*’ token
../libs/streamconfig.h:141: warning: ‘class StreamConfig’ has virtual functions but non-virtual destructor
mythstream.h:118: error: expected class-name before ‘{’ token
mythstream.h:123: error: expected `)' before ‘*’ token
mythstream.h:166: error: ‘UIImageType’ has not been declared
mythstream.h:171: error: ISO C++ forbids declaration of ‘UITextType’ with no type
mythstream.h:171: error: expected ‘;’ before ‘*’ token
mythstream.h:183: error: ISO C++ forbids declaration of ‘XMLParse’ with no type
mythstream.h:183: error: expected ‘;’ before ‘*’ token
mythstream.h:219: error: ISO C++ forbids declaration of ‘MythPopupBox’ with no type
mythstream.h:219: error: expected ‘;’ before ‘*’ token
mythstream.h:220: error: ISO C++ forbids declaration of ‘MythLineEdit’ with no type
mythstream.h:220: error: expected ‘;’ before ‘*’ token
mythstream.h:118: warning: ‘class MythStream’ has virtual functions but non-virtual destructor
main.cpp: In function ‘void MyCallback(void*, QString&)’:
main.cpp:59: error: ‘gContext’ was not declared in this scope
main.cpp:60: error: ‘class StreamConfig’ has no member named ‘exec’
main.cpp:64: error: ‘gContext’ was not declared in this scope
main.cpp:65: error: ‘class StorageConfig’ has no member named ‘exec’
main.cpp: In function ‘void runMenu(QString, const QString&)’:
main.cpp:76: error: ‘MythThemedMenu’ was not declared in this scope
main.cpp:76: error: ‘diag’ was not declared in this scope
main.cpp:76: error: expected type-specifier before ‘MythThemedMenu’
main.cpp:76: error: expected `;' before ‘MythThemedMenu’
main.cpp:86: error: ‘GetMythMainWindow’ was not declared in this scope
main.cpp: At global scope:
main.cpp:74: warning: unused parameter ‘which_menu’
main.cpp: In function ‘void setupKeys()’:
main.cpp:105: error: ‘REG_JUMP’ was not declared in this scope
main.cpp:107: error: ‘REG_KEY’ was not declared in this scope
main.cpp: In function ‘int mythplugin_init(const char*)’:
main.cpp:138: error: ‘gContext’ was not declared in this scope
main.cpp:140: error: ‘MYTH_BINARY_VERSION’ was not declared in this scope
main.cpp: In function ‘void runStream()’:
main.cpp:150: error: ‘gContext’ was not declared in this scope
main.cpp:152: error: ‘class MythStream’ has no member named ‘exec’
main.cpp: In function ‘int mythplugin_config()’:
main.cpp:165: error: ‘gContext’ was not declared in this scope
make[1]: *** [main.o] Error 1
make[1]: Leaving directory `/home/andy/Desktop/install/mythstream-0.18_1/mythstream'
make: *** [sub-mythstream] Error 2