All pastes #746932 Raw Edit

Someone

public text v1 · immutable
·published 2007-10-23 16:31 UTC
rendered paste body
In file included from parser/../src/ft2_font.hpp:28,
                 from parser/builder.cpp:35:
/usr/include/ft2build.h:56:38: error: freetype/config/ftheader.h: No such file or directory
In file included from parser/builder.cpp:35:
parser/../src/ft2_font.hpp:29:10: error: #include expects "FILENAME" or <FILENAME>
parser/../src/ft2_font.hpp:30:10: error: #include expects "FILENAME" or <FILENAME>
 i586-pc-linux-gnu-g++ -DHAVE_CONFIG_H -I. -I../../.. -DSYS_LINUX -I../../../include -D_FILE_OFFSET_BITS=64 -D__USE_UNIX98 -D_LARGEFILE64_SOURCE -D_REENTRANT -D_THREAD_SAFE -DLOCALEDIR=\"/usr/share/locale\" -DDATA_PATH=\"/usr/share/vlc\" -DPLUGIN_PATH=\"/usr/lib/vlc\" -O0 -D__LIBVLC__ -D__PLUGIN__ -Imodules/gui/skins2 -DX11_SKINS -DMODULE_NAME=skins2 -DMODULE_NAME_IS_skins2 -O2 -fno-rtti -Os -march=i586 -mno-tls-direct-seg-refs -mmmx -m32 -MT libskins2_plugin_la-expr_evaluator.lo -MD -MP -MF .deps/libskins2_plugin_la-expr_evaluator.Tpo -c parser/expr_evaluator.cpp  -fPIC -DPIC -o .libs/libskins2_plugin_la-expr_evaluator.o
parser/../src/ft2_font.hpp:60: error: 'FT_Glyph' does not name a type
parser/../src/ft2_font.hpp:61: error: 'FT_BBox' does not name a type
parser/../src/ft2_font.hpp:74: error: 'FT_Library' does not name a type
parser/../src/ft2_font.hpp:76: error: 'FT_Face' does not name a type
make[6]: *** [libskins2_plugin_la-builder.lo] Error 1
make[6]: *** Waiting for unfinished jobs....
 i586-pc-linux-gnu-g++ -DHAVE_CONFIG_H -I. -I../../.. -DSYS_LINUX -I../../../include -D_FILE_OFFSET_BITS=64 -D__USE_UNIX98 -D_LARGEFILE64_SOURCE -D_REENTRANT -D_THREAD_SAFE -DLOCALEDIR=\"/usr/share/locale\" -DDATA_PATH=\"/usr/share/vlc\" -DPLUGIN_PATH=\"/usr/lib/vlc\" -O0 -D__LIBVLC__ -D__PLUGIN__ -Imodules/gui/skins2 -DX11_SKINS -DMODULE_NAME=skins2 -DMODULE_NAME_IS_skins2 -O2 -fno-rtti -Os -march=i586 -mno-tls-direct-seg-refs -mmmx -m32 -MT libskins2_plugin_la-interpreter.lo -MD -MP -MF .deps/libskins2_plugin_la-interpreter.Tpo -c parser/interpreter.cpp  -fPIC -DPIC -o .libs/libskins2_plugin_la-interpreter.o
make[5]: *** [all-modules] Error 1
make[4]: *** [all-recursive] Error 1
make[3]: *** [all] Error 2
make[2]: *** [all-recursive] Error 1
make[1]: *** [all-recursive] Error 1
make: *** [all] Error 2
 * 
 * ERROR: media-video/vlc-0.9.0_alpha20071009 failed.
 * Call stack:
 *                        ebuild.sh, line 1695:  Called dyn_compile
 *                        ebuild.sh, line 1033:  Called qa_call 'src_compile'
 *                        ebuild.sh, line   44:  Called src_compile
 *   vlc-0.9.0_alpha20071009.ebuild, line  310:  Called die
 * The specific snippet of code:
 *      emake || die "make of VLC failed"
 *  The die message:
 *   make of VLC failed
 * 
 * If you need support, post the topmost build error, and the call stack if relevant.
 * A complete build log is located at '/var/tmp/portage/media-video/vlc-0.9.0_alpha20071009/temp/build.log'.
 * 

 * Messages for package media-video/vlc-0.9.0_alpha20071009:

 * USE=skins requires truetype, skins will be disabled.
 * USE=cdda requires cdio, cdda will be disabled.
 * 
 * ERROR: media-video/vlc-0.9.0_alpha20071009 failed.
 * Call stack:
 *                        ebuild.sh, line 1695:  Called dyn_compile
 *                        ebuild.sh, line 1033:  Called qa_call 'src_compile'
 *                        ebuild.sh, line   44:  Called src_compile
 *   vlc-0.9.0_alpha20071009.ebuild, line  310:  Called die
 * The specific snippet of code:
 *      emake || die "make of VLC failed"
 *  The die message:
 *   make of VLC failed
 * 
 * If you need support, post the topmost build error, and the call stack if relevant.
 * A complete build log is located at '/var/tmp/portage/media-video/vlc-0.9.0_alpha20071009/temp/build.log'.
 *