nerochiaro@blackcat:~/projects/neuros/osd/neuros-bsp$ ./build-helper.sh all
Making and installing everything, in right order
~/projects/neuros/osd/neuros-bsp ~/projects/neuros/osd/neuros-bsp
Neuros BSP is now ready to be configured.
Please source the BSP environment: "source neuros-env"
Please run from the top level "make help", and choose a configuration method.
make[1]: Entering directory `/home/nerochiaro/projects/neuros/osd/neuros-bsp/scripts/kconfig'
rm -f *.o *~ core mconf.o checklist.o menubox.o textbox.o yesno.o inputbox.o util.o msgbox.o conf.o \
conf mconf zconf.tab.c zconf.tab.h lex.zconf.c lkc_defs.h
make[1]: Leaving directory `/home/nerochiaro/projects/neuros/osd/neuros-bsp/scripts/kconfig'
make[1]: Entering directory `/home/nerochiaro/projects/neuros/osd/neuros-bsp/bootloader'
Makefile:58: /home/nerochiaro/projects/neuros/osd/neuros-bsp/.config/bsp_config: No such file or directory
Makefile:62: *** Error loading "bsp_config"! Please run "make menuconfig" from BSP top level. Stop.
make[1]: Leaving directory `/home/nerochiaro/projects/neuros/osd/neuros-bsp/bootloader'
make[1]: Entering directory `/home/nerochiaro/projects/neuros/osd/neuros-bsp/sysapps'
make[1]: Leaving directory `/home/nerochiaro/projects/neuros/osd/neuros-bsp/sysapps'
make[1]: Entering directory `/home/nerochiaro/projects/neuros/osd/neuros-bsp/kernels/linux-2.6.15'
make[1]: Leaving directory `/home/nerochiaro/projects/neuros/osd/neuros-bsp/kernels/linux-2.6.15'
make[1]: Entering directory `/home/nerochiaro/projects/neuros/osd/neuros-bsp/rootfs'
make[1]: Leaving directory `/home/nerochiaro/projects/neuros/osd/neuros-bsp/rootfs'
make[1]: Entering directory `/home/nerochiaro/projects/neuros/osd/neuros-bsp/bootloader'
Makefile:58: /home/nerochiaro/projects/neuros/osd/neuros-bsp/.config/bsp_config: No such file or directory
Makefile:62: *** Error loading "bsp_config"! Please run "make menuconfig" from BSP top level. Stop.
make[1]: Leaving directory `/home/nerochiaro/projects/neuros/osd/neuros-bsp/bootloader'
make[1]: Entering directory `/home/nerochiaro/projects/neuros/osd/neuros-bsp/sysapps'
make[1]: Leaving directory `/home/nerochiaro/projects/neuros/osd/neuros-bsp/sysapps'
make[1]: Entering directory `/home/nerochiaro/projects/neuros/osd/neuros-bsp/kernels/linux-2.6.15'
make[1]: Leaving directory `/home/nerochiaro/projects/neuros/osd/neuros-bsp/kernels/linux-2.6.15'
Cleaning up user-installed libraries and headers
mkdir -p /home/nerochiaro/projects/neuros/osd/neuros-bsp/toolchain/arm-linux/usr/lib
mkdir -p /home/nerochiaro/projects/neuros/osd/neuros-bsp/toolchain/arm-linux/usr/include
make[1]: Entering directory `/home/nerochiaro/projects/neuros/osd/neuros-bsp/scripts/kconfig'
gcc -Wall -Wstrict-prototypes -O2 -fomit-frame-pointer -I. -c conf.c -o conf.o
conf.c:6:19: error: ctype.h: No such file or directory
conf.c:7:20: error: stdlib.h: No such file or directory
conf.c:8:20: error: string.h: No such file or directory
conf.c:9:20: error: unistd.h: No such file or directory
conf.c:10:18: error: time.h: No such file or directory
conf.c:11:22: error: sys/stat.h: No such file or directory
In file included from lkc.h:9,
from conf.c:14:
expr.h:13:19: error: stdio.h: No such file or directory
In file included from lkc.h:9,
from conf.c:14:
expr.h:176: error: expected declaration specifiers or ‘...’ before ‘FILE’
In file included from conf.c:14:
lkc.h:27: error: expected ‘)’ before ‘*’ token
lkc.h:31: error: expected ‘=’, ‘,’, ‘;’, ‘asm’ or ‘__attribute__’ before ‘*’ token
conf.c: In function ‘strip’:
conf.c:44: warning: implicit declaration of function ‘isspace’
conf.c:46: warning: implicit declaration of function ‘strlen’
conf.c:46: warning: incompatible implicit declaration of built-in function ‘strlen’
conf.c:48: warning: implicit declaration of function ‘memmove’
conf.c:48: warning: incompatible implicit declaration of built-in function ‘memmove’
conf.c: In function ‘check_stdin’:
conf.c:59: warning: implicit declaration of function ‘printf’
conf.c:59: warning: incompatible implicit declaration of built-in function ‘printf’
conf.c:62: warning: implicit declaration of function ‘exit’
conf.c:62: warning: incompatible implicit declaration of built-in function ‘exit’
conf.c: In function ‘conf_askvalue’:
conf.c:72: warning: incompatible implicit declaration of built-in function ‘printf’
conf.c:93: warning: implicit declaration of function ‘fflush’
conf.c:93: error: ‘stdout’ undeclared (first use in this function)
conf.c:93: error: (Each undeclared identifier is reported only once
conf.c:93: error: for each function it appears in.)
conf.c:94: warning: implicit declaration of function ‘fgets’
conf.c:94: error: ‘stdin’ undeclared (first use in this function)
conf.c:145: warning: implicit declaration of function ‘random’
conf.c: In function ‘conf_string’:
conf.c:167: warning: incompatible implicit declaration of built-in function ‘printf’
conf.c:183: error: ‘NULL’ undeclared (first use in this function)
conf.c:187: warning: incompatible implicit declaration of built-in function ‘strlen’
conf.c: In function ‘conf_sym’:
conf.c:203: warning: incompatible implicit declaration of built-in function ‘printf’
conf.c:207: warning: implicit declaration of function ‘putchar’
conf.c:236: warning: implicit declaration of function ‘strcmp’
conf.c: In function ‘conf_choice’:
conf.c:295: warning: incompatible implicit declaration of built-in function ‘printf’
conf.c:305: warning: incompatible implicit declaration of built-in function ‘printf’
conf.c:349: error: ‘stdout’ undeclared (first use in this function)
conf.c:350: error: ‘stdin’ undeclared (first use in this function)
conf.c:359: warning: implicit declaration of function ‘isdigit’
conf.c:360: warning: implicit declaration of function ‘atoi’
conf.c:384: warning: incompatible implicit declaration of built-in function ‘strlen’
conf.c: In function ‘conf’:
conf.c:422: warning: incompatible implicit declaration of built-in function ‘printf’
conf.c: In function ‘check_conf’:
conf.c:473: warning: incompatible implicit declaration of built-in function ‘printf’
conf.c: In function ‘main’:
conf.c:489: error: storage size of ‘tmpstat’ isn’t known
conf.c:498: warning: implicit declaration of function ‘isatty’
conf.c:507: warning: incompatible implicit declaration of built-in function ‘printf’
conf.c:509: warning: incompatible implicit declaration of built-in function ‘exit’
conf.c:523: warning: implicit declaration of function ‘srandom’
conf.c:523: warning: implicit declaration of function ‘time’
conf.c:523: error: ‘NULL’ undeclared (first use in this function)
conf.c:527: warning: incompatible implicit declaration of built-in function ‘printf’
conf.c:528: warning: incompatible implicit declaration of built-in function ‘exit’
conf.c:533: warning: incompatible implicit declaration of built-in function ‘printf’
conf.c:542: warning: incompatible implicit declaration of built-in function ‘printf’
conf.c:545: warning: incompatible implicit declaration of built-in function ‘exit’
conf.c:550: warning: implicit declaration of function ‘stat’
conf.c:551: warning: incompatible implicit declaration of built-in function ‘printf’
conf.c:557: warning: incompatible implicit declaration of built-in function ‘exit’
conf.c:580: warning: implicit declaration of function ‘fprintf’
conf.c:580: warning: incompatible implicit declaration of built-in function ‘fprintf’
conf.c:580: error: ‘stderr’ undeclared (first use in this function)
conf.c:489: warning: unused variable ‘tmpstat’
make[1]: *** [conf.o] Error 1
make[1]: Leaving directory `/home/nerochiaro/projects/neuros/osd/neuros-bsp/scripts/kconfig'
make: *** [ntosd-dm320_defconfig] Error 2
nerochiaro@blackcat:~/projects/neuros/osd/neuros-bsp$