All pastes #745884 Raw Edit

Zeug

public text v1 · immutable
·published 2007-10-22 19:29 UTC
rendered paste body
CPAN: Storable loaded ok
Going to read /root/.cpan/Metadata
  Database was generated on Mon, 22 Oct 2007 17:36:38 GMT
Running install for module Email::MIME::Creator
Running make for R/RJ/RJBS/Email-MIME-Creator-1.454.tar.gz
CPAN: Digest::MD5 loaded ok
CPAN: Compress::Zlib loaded ok
Checksum for /root/.cpan/sources/authors/id/R/RJ/RJBS/Email-MIME-Creator-1.454.tar.gz ok
Scanning cache /root/.cpan/build for sizes
CPAN: Archive::Tar loaded ok
Email-MIME-Creator-1.454/
Email-MIME-Creator-1.454/Changes
Email-MIME-Creator-1.454/LICENSE
Email-MIME-Creator-1.454/MANIFEST
Email-MIME-Creator-1.454/META.yml
Email-MIME-Creator-1.454/Makefile.PL
Email-MIME-Creator-1.454/README
Email-MIME-Creator-1.454/lib/
Email-MIME-Creator-1.454/lib/Email/
Email-MIME-Creator-1.454/lib/Email/MIME/
Email-MIME-Creator-1.454/lib/Email/MIME/Creator.pm
Email-MIME-Creator-1.454/t/
Email-MIME-Creator-1.454/t/auto_create.t
Email-MIME-Creator-1.454/t/multipart.t
Email-MIME-Creator-1.454/t/nested-parts.t
Email-MIME-Creator-1.454/t/pod-coverage.t
Email-MIME-Creator-1.454/t/pod.t
Email-MIME-Creator-1.454/t/singlepart.t
Removing previously used /root/.cpan/build/Email-MIME-Creator-1.454

  CPAN.pm: Going to build R/RJ/RJBS/Email-MIME-Creator-1.454.tar.gz

WARNING: LICENSE is not a known parameter.
Checking if your kit is complete...
Looks good
Warning: prerequisite Email::MIME::Modifier 1.440 not found. We have 1.43.
Warning: prerequisite Email::Simple::Creator 1.4 not found.
'LICENSE' is not a known MakeMaker parameter name.
Writing Makefile for Email::MIME::Creator
---- Unsatisfied dependencies detected during [R/RJ/RJBS/Email-MIME-Creator-1.454.tar.gz] -----
    Email::Simple::Creator
    Email::MIME::Modifier
Running make test
  Delayed until after prerequisites
Running make install
  Delayed until after prerequisites
Running install for module Email::Simple::Creator
Running make for R/RJ/RJBS/Email-Simple-Creator-1.422.tar.gz
Checksum for /root/.cpan/sources/authors/id/R/RJ/RJBS/Email-Simple-Creator-1.422.tar.gz ok
Email-Simple-Creator-1.422/
Email-Simple-Creator-1.422/Changes
Email-Simple-Creator-1.422/LICENSE
Email-Simple-Creator-1.422/MANIFEST
Email-Simple-Creator-1.422/META.yml
Email-Simple-Creator-1.422/Makefile.PL
Email-Simple-Creator-1.422/README
Email-Simple-Creator-1.422/lib/
Email-Simple-Creator-1.422/lib/Email/
Email-Simple-Creator-1.422/lib/Email/Simple/
Email-Simple-Creator-1.422/lib/Email/Simple/Creator.pm
Email-Simple-Creator-1.422/t/
Email-Simple-Creator-1.422/t/create.t
Email-Simple-Creator-1.422/t/pod-coverage.t
Email-Simple-Creator-1.422/t/pod.t
Removing previously used /root/.cpan/build/Email-Simple-Creator-1.422

  CPAN.pm: Going to build R/RJ/RJBS/Email-Simple-Creator-1.422.tar.gz

WARNING: LICENSE is not a known parameter.
Checking if your kit is complete...
Looks good
'LICENSE' is not a known MakeMaker parameter name.
Writing Makefile for Email::Simple::Creator
cp lib/Email/Simple/Creator.pm blib/lib/Email/Simple/Creator.pm
Manifying blib/man3/Email::Simple::Creator.3pm
  /usr/bin/make  -- OK
Running make test
PERL_DL_NONLAZY=1 /usr/bin/perl5.8.8 "-MExtUtils::Command::MM" "-e" "test_harness(0, 'blib/lib', 'blib/arch')" t/*.t
t/create..........
#   Failed test 'crlf: message has no LF that aren't preceded by CR'
#   at t/create.t line 28.
#                   'Date: Mon, 22 Oct 2007 21:28:16 +0200
#
# This body uses
# LF only, and not
# CRLF like it might ought to do.
# '
#           matches '(?-xism:(?<!\x0d)\x0a)'

#   Failed test 'auto_date: message has no LF that aren't preceded by CR'
#   at t/create.t line 28.
#                   'Date: Mon, 22 Oct 2007 21:28:16 +0200
#
# test test
# '
#           matches '(?-xism:(?<!\x0d)\x0a)'

#   Failed test 'argless: message has no LF that aren't preceded by CR'
#   at t/create.t line 28.
#                   'Date: Mon, 22 Oct 2007 21:28:16 +0200
#
#
# '
#           matches '(?-xism:(?<!\x0d)\x0a)'

#   Failed test 'has_crlf: message has no LF that aren't preceded by CR'
#   at t/create.t line 28.
#                   'Date: Mon, 22 Oct 2007 21:28:16 +0200
#
# test test
# '
#           matches '(?-xism:(?<!\x0d)\x0a)'

#   Failed test 'has_date: message has no LF that aren't preceded by CR'
#   at t/create.t line 28.
#                   'Date: Mon, 22 Oct 2007 21:28:16 +0200
#
# This is a multi-
#     line message.
# '
#           matches '(?-xism:(?<!\x0d)\x0a)'

#   Failed test 'we got just the string we expected'
#   at t/create.t line 111.
#          got: 'Date: Mon, 22 Oct 2007 21:28:16 +0200
#
# This is a multi-
#     line message.
# '
#     expected: 'Date: testing
# X-Header: one
# X-Header: two
# X-Header: three
#
# This is a multi-
#     line message.
# '

#   Failed test 'falsies: message has no LF that aren't preceded by CR'
#   at t/create.t line 28.
#                   'Date: Mon, 22 Oct 2007 21:28:16 +0200
#
# The body is uninteresting.
# '
#           matches '(?-xism:(?<!\x0d)\x0a)'

#   Failed test 'got the false headers back we want'
#   at t/create.t line 128.
#     Structures begin differing at:
#          $got->[1] = 'Mon, 22 Oct 2007 21:28:16 +0200'
#     $expected->[1] = ''

#   Failed test 'we got just the string we expected'
#   at t/create.t line 149.
#          got: 'Date: Mon, 22 Oct 2007 21:28:16 +0200
#
# The body is uninteresting.
# '
#     expected: 'Date:
# Zero: 0
# Empty:
#
# The body is uninteresting.
# '
# Looks like you failed 9 tests of 25.
t/create..........dubious
        Test returned status 9 (wstat 2304, 0x900)
DIED. FAILED tests 5, 8, 12, 16, 19-20, 23-25
        Failed 9/25 tests, 64.00% okay
t/pod-coverage....ok
t/pod.............ok
Failed Test Stat Wstat Total Fail  List of Failed
-------------------------------------------------------------------------------
t/create.t     9  2304    25    9  5 8 12 16 19-20 23-25
Failed 1/3 test scripts. 9/27 subtests failed.
Files=3, Tests=27,  0 wallclock secs ( 0.17 cusr +  0.04 csys =  0.21 CPU)
Failed 1/3 test programs. 9/27 subtests failed.
make: *** [test_dynamic] Fehler 255
  /usr/bin/make test -- NOT OK
Running make install
  make test had returned bad status, won't install without force
Running install for module Email::MIME::Modifier
Running make for R/RJ/RJBS/Email-MIME-Modifier-1.442.tar.gz
Checksum for /root/.cpan/sources/authors/id/R/RJ/RJBS/Email-MIME-Modifier-1.442.tar.gz ok
Email-MIME-Modifier-1.442/
Email-MIME-Modifier-1.442/Changes
Email-MIME-Modifier-1.442/MANIFEST
Email-MIME-Modifier-1.442/META.yml
Email-MIME-Modifier-1.442/Makefile.PL
Email-MIME-Modifier-1.442/README
Email-MIME-Modifier-1.442/lib/
Email-MIME-Modifier-1.442/lib/Email/
Email-MIME-Modifier-1.442/lib/Email/MIME/
Email-MIME-Modifier-1.442/lib/Email/MIME/Modifier.pm
Email-MIME-Modifier-1.442/t/
Email-MIME-Modifier-1.442/t/content_id.t
Email-MIME-Modifier-1.442/t/ct_attrs.t
Email-MIME-Modifier-1.442/t/disposition.t
Email-MIME-Modifier-1.442/t/encoding.t
Email-MIME-Modifier-1.442/t/parts.t
Email-MIME-Modifier-1.442/t/pod-coverage.t
Email-MIME-Modifier-1.442/t/pod.t
Removing previously used /root/.cpan/build/Email-MIME-Modifier-1.442

  CPAN.pm: Going to build R/RJ/RJBS/Email-MIME-Modifier-1.442.tar.gz

WARNING: LICENSE is not a known parameter.
Checking if your kit is complete...
Looks good
'LICENSE' is not a known MakeMaker parameter name.
Writing Makefile for Email::MIME::Modifier
cp lib/Email/MIME/Modifier.pm blib/lib/Email/MIME/Modifier.pm
Manifying blib/man3/Email::MIME::Modifier.3pm
  /usr/bin/make  -- OK
Running make test
PERL_DL_NONLAZY=1 /usr/bin/perl5.8.8 "-MExtUtils::Command::MM" "-e" "test_harness(0, 'blib/lib', 'blib/arch')" t/*.t
t/content_id......Use of uninitialized value in pattern match (m//) at /usr/lib/perl5/site_perl/5.8.8/Email/MIME/ContentType.pm line 24.
Use of uninitialized value in pattern match (m//) at /usr/lib/perl5/site_perl/5.8.8/Email/MIME/ContentType.pm line 24.
Use of uninitialized value in pattern match (m//) at /usr/lib/perl5/site_perl/5.8.8/Email/MIME/ContentType.pm line 24.
Use of uninitialized value in pattern match (m//) at /usr/lib/perl5/site_perl/5.8.8/Email/MIME/ContentType.pm line 24.
Use of uninitialized value in pattern match (m//) at /usr/lib/perl5/site_perl/5.8.8/Email/MIME/ContentType.pm line 24.

#   Failed test 'two parts'
#   at t/content_id.t line 21.
#          got: '1'
#     expected: '2'

#   Failed test 'two content ids'
#   at t/content_id.t line 30.
#          got: '0'
#     expected: '2'

#   Failed test 'not the same'
#   at t/content_id.t line 32.
#     undef
#         ne
#     undef
Use of uninitialized value in pattern match (m//) at /usr/lib/perl5/site_perl/5.8.8/Email/MIME/ContentType.pm line 24.
Use of uninitialized value in pattern match (m//) at /usr/lib/perl5/site_perl/5.8.8/Email/MIME/ContentType.pm line 24.
Use of uninitialized value in pattern match (m//) at /usr/lib/perl5/site_perl/5.8.8/Email/MIME/ContentType.pm line 24.

#   Failed test 'two parts'
#   at t/content_id.t line 40.
#          got: '1'
#     expected: '2'

#   Failed test 'two content ids'
#   at t/content_id.t line 49.
#          got: '0'
#     expected: '2'
# Looks like you planned 15 tests but only ran 11.
# Looks like you failed 5 tests of 11 run.
t/content_id......dubious
        Test returned status 5 (wstat 1280, 0x500)
DIED. FAILED tests 4, 6-8, 10, 12-15
        Failed 9/15 tests, 40.00% okay
t/ct_attrs........ok
t/disposition.....Use of uninitialized value in pattern match (m//) at /usr/lib/perl5/site_perl/5.8.8/Email/MIME/ContentType.pm line 24.
t/disposition.....ok
t/encoding........Premature end of base64 data at /usr/lib/perl5/site_perl/5.8.8/Email/MIME/Encodings.pm line 26.
Premature end of base64 data at /usr/lib/perl5/site_perl/5.8.8/Email/MIME/Encodings.pm line 26.

#   Failed test 'base64 works'
#   at t/encoding.t line 20.
#          got: 'H
                   1ó}5ï­'
#     expected: 'Hello World!
# I like you!
# '
Premature end of base64 data at /usr/lib/perl5/site_perl/5.8.8/Email/MIME/Encodings.pm line 26.

#   Failed test 'binary works'
#   at t/encoding.t line 26.
#          got: 'SCALAR(0x82e7a6c)'
#     expected: 'Hello World!
# I like you!
# '

#   Failed test 'binary raw works'
#   at t/encoding.t line 27.
#          got: 'H
                   1ó}5ï­'
#     expected: 'Hello World!
# I like you!
# '

#   Failed test 'quoted-printable + body_set works'
#   at t/encoding.t line 37.
#          got: 'SCALAR(0x82e79dc)'
#     expected: 'Long line! Long line! Long line! Long line! Long line! Long line! Long line! Long line! Long line! Long line! Long line! Long line! Long line! Long line! Long line! Long line! Long line! Long line! Long line! Long line! Long line! Long line! Long line! Long line! Long line! Long line! Long line! Long line! Long line! Long line! Long line! Long line! Long line! Long line! Long line! Long line! Long line! Long line! Long line! Long line! Long line! Long line! Long line! Long line! Long line! Long line! Long line! Long line! Long line! Long line! Long line! Long line! Long line! Long line! Long line! Long line! Long line! Long line! Long line! Long line! Long line! Long line! Long line! Long line! Long line! Long line! Long line! Long line! Long line! Long line! Long line! Long line! Long line! Long line! Long line! Long line! Long line! Long line! Long line! Long line! Long line! Long line! Long line! Long line! Long line! Long line! Long line! Long line! Long line! Long line! Long line! Long line! Long line! Long line! Long line! Long line! Long line! Long line! Long line! Long line!
# '
# Looks like you failed 4 tests of 14.
t/encoding........dubious
        Test returned status 4 (wstat 1024, 0x400)
DIED. FAILED tests 6, 9-10, 12
        Failed 4/14 tests, 71.43% okay
t/parts...........ok 1/22Use of uninitialized value in pattern match (m//) at /usr/lib/perl5/site_perl/5.8.8/Email/MIME/ContentType.pm line 24.
Use of uninitialized value in pattern match (m//) at /usr/lib/perl5/site_perl/5.8.8/Email/MIME/ContentType.pm line 24.
Use of uninitialized value in pattern match (m//) at /usr/lib/perl5/site_perl/5.8.8/Email/MIME/ContentType.pm line 24.

#   Failed test 'two parts'
#   at t/parts.t line 27.
#          got: '1'
#     expected: '2'
Can't call method "body" on an undefined value at t/parts.t line 28.
# Looks like you planned 22 tests but only ran 5.
# Looks like you failed 1 test of 5 run.
# Looks like your test died just after 5.
t/parts...........dubious
        Test returned status 255 (wstat 65280, 0xff00)
DIED. FAILED tests 5-22
        Failed 18/22 tests, 18.18% okay
t/pod-coverage....ok
t/pod.............ok
Failed Test    Stat Wstat Total Fail  List of Failed
-------------------------------------------------------------------------------
t/content_id.t    5  1280    15   13  4 6-8 10 12-15
t/encoding.t      4  1024    14    4  6 9-10 12
t/parts.t       255 65280    22   35  5-22
Failed 3/7 test scripts. 31/70 subtests failed.
Files=7, Tests=70,  1 wallclock secs ( 0.41 cusr +  0.08 csys =  0.49 CPU)
Failed 3/7 test programs. 31/70 subtests failed.
make: *** [test_dynamic] Fehler 255
  /usr/bin/make test -- NOT OK
Running make install
  make test had returned bad status, won't install without force
Running make for R/RJ/RJBS/Email-MIME-Creator-1.454.tar.gz
  Is already unwrapped into directory /root/.cpan/build/Email-MIME-Creator-1.454

  CPAN.pm: Going to build R/RJ/RJBS/Email-MIME-Creator-1.454.tar.gz

cp lib/Email/MIME/Creator.pm blib/lib/Email/MIME/Creator.pm
Manifying blib/man3/Email::MIME::Creator.3pm
  /usr/bin/make  -- OK
Running make test
PERL_DL_NONLAZY=1 /usr/bin/perl5.8.8 "-MExtUtils::Command::MM" "-e" "test_harness(0, 'blib/lib', 'blib/arch')" t/*.t
t/auto_create.....
#   Failed test 'use Email::MIME::Creator;'
#   at t/auto_create.t line 5.
#     Tried to use 'Email::MIME::Creator'.
#     Error:  Base class package "Email::Simple::Creator" is empty.
#     (Perhaps you need to 'use' the module which defines that package first.)
#  at /root/.cpan/build/Email-MIME-Creator-1.454/blib/lib/Email/MIME/Creator.pm line 7
# BEGIN failed--compilation aborted at t/auto_create.t line 5.
# Compilation failed in require at (eval 3) line 2.
# BEGIN failed--compilation aborted at (eval 3) line 2.
Can't locate object method "create" via package "Email::MIME" at t/auto_create.t line 8.
# Looks like you failed 1 test of 1.
# Looks like your test died just after 1.
t/auto_create.....dubious
        Test returned status 255 (wstat 65280, 0xff00)
DIED. FAILED test 1
        Failed 1/1 tests, 0.00% okay
t/multipart.......
#   Failed test 'use Email::MIME::Creator;'
#   at t/multipart.t line 7.
#     Tried to use 'Email::MIME::Creator'.
#     Error:  Base class package "Email::Simple::Creator" is empty.
#     (Perhaps you need to 'use' the module which defines that package first.)
#  at /root/.cpan/build/Email-MIME-Creator-1.454/blib/lib/Email/MIME/Creator.pm line 7
# BEGIN failed--compilation aborted at t/multipart.t line 7.
# Compilation failed in require at (eval 3) line 2.
# BEGIN failed--compilation aborted at (eval 3) line 2.
Can't locate object method "create" via package "Email::MIME" at t/multipart.t line 9.
# Looks like you failed 1 test of 1.
# Looks like your test died just after 1.
t/multipart.......dubious
        Test returned status 255 (wstat 65280, 0xff00)
DIED. FAILED test 1
        Failed 1/1 tests, 0.00% okay
t/nested-parts....Base class package "Email::Simple::Creator" is empty.
    (Perhaps you need to 'use' the module which defines that package first.)
 at /root/.cpan/build/Email-MIME-Creator-1.454/blib/lib/Email/MIME/Creator.pm line 7
BEGIN failed--compilation aborted at /root/.cpan/build/Email-MIME-Creator-1.454/blib/lib/Email/MIME/Creator.pm line 7.
Compilation failed in require at t/nested-parts.t line 6.
BEGIN failed--compilation aborted at t/nested-parts.t line 6.
t/nested-parts....dubious
        Test returned status 2 (wstat 512, 0x200)
t/pod-coverage....
#   Failed test 'Pod coverage on Email::MIME::Creator'
#   at /usr/lib/perl5/site_perl/5.8.8/Test/Pod/Coverage.pm line 126.
# Email::MIME::Creator: Couldn't compile 'Email::MIME::Creator' to inspect: Base class package "Email::Simple::Creator" is empty.
#     (Perhaps you need to 'use' the module which defines that package first.)
#  at /root/.cpan/build/Email-MIME-Creator-1.454/blib/lib/Email/MIME/Creator.pm line 7
# BEGIN failed--compilation aborted at /root/.cpan/build/Email-MIME-Creator-1.454/blib/lib/Email/MIME/Creator.pm line 7.
# Compilation failed in require at (eval 10) line 3.
# Looks like you failed 1 test of 1.
t/pod-coverage....dubious
        Test returned status 1 (wstat 256, 0x100)
DIED. FAILED test 1
        Failed 1/1 tests, 0.00% okay
t/pod.............ok
t/singlepart......
#   Failed test 'use Email::MIME::Creator;'
#   at t/singlepart.t line 5.
#     Tried to use 'Email::MIME::Creator'.
#     Error:  Base class package "Email::Simple::Creator" is empty.
#     (Perhaps you need to 'use' the module which defines that package first.)
#  at /root/.cpan/build/Email-MIME-Creator-1.454/blib/lib/Email/MIME/Creator.pm line 7
# BEGIN failed--compilation aborted at t/singlepart.t line 5.
# Compilation failed in require at (eval 3) line 2.
# BEGIN failed--compilation aborted at (eval 3) line 2.
Can't locate object method "create" via package "Email::MIME" at t/singlepart.t line 7.
# Looks like you failed 1 test of 1.
# Looks like your test died just after 1.
t/singlepart......dubious
        Test returned status 255 (wstat 65280, 0xff00)
DIED. FAILED test 1
        Failed 1/1 tests, 0.00% okay
Failed Test      Stat Wstat Total Fail  List of Failed
-------------------------------------------------------------------------------
t/auto_create.t   255 65280     1    1  1
t/multipart.t     255 65280     1    1  1
t/nested-parts.t    2   512    ??   ??  ??
t/pod-coverage.t    1   256     1    1  1
t/singlepart.t    255 65280     1    1  1
Failed 5/6 test scripts. 4/5 subtests failed.
Files=6, Tests=5,  0 wallclock secs ( 0.22 cusr +  0.03 csys =  0.25 CPU)
Failed 5/6 test programs. 4/5 subtests failed.
make: *** [test_dynamic] Fehler 255
  /usr/bin/make test -- NOT OK
Running make install
  make test had returned bad status, won't install without force