g++ -DHAVE_CONFIG_H -I. -I. -I../../.. -I/usr/include/taglib -I/usr/include/glibmm-2.4 -I/usr/lib/glibmm-2.4/include -I/usr/include/sigc++-2
In file included from /usr/include/boost/algorithm/string/std_containers_traits.hpp:22,
from /usr/include/boost/algorithm/string.hpp:17,
from reader.cc:29:
/usr/include/boost/algorithm/string/std/slist_traits.hpp:15:17: error: slist: No such file or directory
/usr/include/boost/algorithm/string/std/slist_traits.hpp:41: error: 'slist' is not a member of '__gnu_cxx'
/usr/include/boost/algorithm/string/std/slist_traits.hpp:41: error: 'slist' is not a member of '__gnu_cxx'
/usr/include/boost/algorithm/string/std/slist_traits.hpp:41: error: wrong number of template arguments (2, should be 1)
/usr/include/boost/algorithm/string/sequence_traits.hpp:114: error: provided for 'template<class T> class boost::algorithm::has_stable_iterat
/usr/include/boost/algorithm/string/std/slist_traits.hpp:41: error: expected unqualified-id before '>' token
/usr/include/boost/algorithm/string/std/slist_traits.hpp:54: error: 'slist' is not a member of '__gnu_cxx'
/usr/include/boost/algorithm/string/std/slist_traits.hpp:54: error: 'slist' is not a member of '__gnu_cxx'
/usr/include/boost/algorithm/string/std/slist_traits.hpp:54: error: wrong number of template arguments (2, should be 1)
/usr/include/boost/algorithm/string/sequence_traits.hpp:141: error: provided for 'template<class T> class boost::algorithm::has_const_time_in
/usr/include/boost/algorithm/string/std/slist_traits.hpp:54: error: expected unqualified-id before '>' token
/usr/include/boost/algorithm/string/std/slist_traits.hpp:67: error: 'slist' is not a member of '__gnu_cxx'
/usr/include/boost/algorithm/string/std/slist_traits.hpp:67: error: 'slist' is not a member of '__gnu_cxx'
/usr/include/boost/algorithm/string/std/slist_traits.hpp:67: error: wrong number of template arguments (2, should be 1)
/usr/include/boost/algorithm/string/sequence_traits.hpp:168: error: provided for 'template<class T> class boost::algorithm::has_const_time_er
/usr/include/boost/algorithm/string/std/slist_traits.hpp:67: error: expected unqualified-id before '>' token
make[4]: *** [reader.lo] Error 1
make[4]: Leaving directory `/usr/src/bmpx-0.40.13/plugins/taglib/id3v2'
make[3]: *** [all-recursive] Error 1
make[3]: Leaving directory `/usr/src/bmpx-0.40.13/plugins/taglib'
make[2]: *** [all-recursive] Error 1
make[2]: Leaving directory `/usr/src/bmpx-0.40.13/plugins'
make[1]: *** [all-recursive] Error 1
make[1]: Leaving directory `/usr/src/bmpx-0.40.13'
make: *** [all] Error 2