All pastes #745023 Raw Edit

Something

public text v1 · immutable
·published 2007-10-21 23:37 UTC
rendered paste body
-- Found Qt-Version 4.3.2
-- Found X11: /usr/lib/libX11.so
-- Found KDE 4.0 include dir: /home/kde-devel/kde/include
-- Found KDE 4 library dir: /home/kde-devel/kde/lib
-- Found KDE4 kconfig_compiler preprocessor: /home/kde-devel/kde/bin/kconfig_compiler
-- Found KDE4 automoc: /home/kde-devel/kde/bin/kde4automoc
-- Found Strigi: /home/kde-devel/kde/lib/libstreams.so
-- Found Strigi: /home/kde-devel/kde/lib/libstreams.so
-- Found KDE PIM libraries
-- PKGCONFIG macro signal that OpenEXR is not installed on your computer.
-- Install package which contains OpenEXR.pc if you want to support this feature.
-- Create macro to display info at the end of install
-- Found Nepomuk: /home/kde-devel/kde/lib/libnepomuk.so
-- Found Strigi: /home/kde-devel/kde/lib/libstreams.so
-- Found Nepomuk: /home/kde-devel/kde/lib/libnepomuk.so
-- Found Strigi: /home/kde-devel/kde/lib/libstreams.so
-- Adding support for OpenGL applets to libplasma
-- Found NetworkManager: -L/home/kde-devel/kde/lib -ldbus-1 -lnm-util -lglib-2.0
-- PKGCONFIG macro signal that bluez is not installed on your computer.
-- Install package which contains bluez.pc if you want to support this feature.
-- Could not find OPTIONAL package BlueZ
-- nm-util Libs are /usr/lib/libnm-util.so
-- Found PNG: /usr/lib/libpng.so
-- Found Sensors: /usr/include
The end of a CMakeLists file was reached with an IF statement that was not closed properly.
Within the directory: /home/kde-devel/kde/src/KDE/kdebase/workspace/plasma/applets/kickoff
The arguments are: CMAKE_BUILD_TYPE MATCHES debug
-- Found Freetype: -lfreetype -lz
-- option: USE_XKLAVIER  <ON>
-- Found LibXKlavier: -I/usr/include/glib-2.0 -I/usr/lib/glib-2.0/include -I/usr/include/libxml2
-- Found GLIB2: /usr/lib/libglib-2.0.so
-- Found GObject libraries: /usr/lib/libgobject-2.0.so;/usr/lib/libgmodule-2.0.so;/usr/lib/libgthread-2.0.so;/usr/lib/libglib-2.0.so
-- Found GObject includes : /usr/include/glib-2.0/gobject
-- Could not find OPTIONAL package Plasma
-- /home/kde-devel/kde/src/KDE/kdebase/workspace/kcontrol: skipped subdir $(KSMCARD_SUBDIR)
--
----------------------------------------------------------------------------------
-- The following list of OPTIONAL packages were located on your system.         --
-- You will have all the following features available from this software.       --
----------------------------------------------------------------------------------
+ Xine
+ XCB
+ NetworkManager
+ lm-sensors
+ Capseo framework
+ Compositing support
+ strigi indexing
----------------------------------------------------------------------------------
-- The following list of OPTIONAL packages could NOT be located on your system. --
-- Consider installing them to enable more features from this software.         --
----------------------------------------------------------------------------------
+ Xine: xine-lib v1.1.6 was found on your system. This version is known to have problems when a device is unplugged. Consider upgrading to version 1.1.7 or above. <http://sourceforge.net/project/showfiles.php?group_id=9655&package_id=9732>
+ BlueZ: BlueZ is the linux bluetooth subsystem <http://www.bluez.org>

-- Configuring done
-- Generating done
-- Build files have been written to: /home/kde-devel/kde/build/KDE/kdebase
/usr/local/bin/cmake -H/home/kde-devel/kde/src/KDE/kdebase -B/home/kde-devel/kde/build/KDE/kdebase --check-build-system CMakeFiles/Makefile.cmake 0
/usr/local/bin/cmake -E cmake_progress_start /home/kde-devel/kde/build/KDE/kdebase/CMakeFiles 97
make -f CMakeFiles/Makefile2 all
make[1]: se ingresa al directorio `/home/kde-devel/kde/build/KDE/kdebase'
make -f runtime/kuiserver/CMakeFiles/kdeinit_kuiserver.dir/build.make runtime/kuiserver/CMakeFiles/kdeinit_kuiserver.dir/depend
make -f runtime/drkonqi/CMakeFiles/drkonqi.dir/build.make runtime/drkonqi/CMakeFiles/drkonqi.dir/depend
make[2]: se ingresa al directorio `/home/kde-devel/kde/build/KDE/kdebase'
make[2]: No se hace nada para `runtime/drkonqi/CMakeFiles/drkonqi.dir/depend'.
make[2]: se sale del directorio `/home/kde-devel/kde/build/KDE/kdebase'
make -f runtime/drkonqi/CMakeFiles/drkonqi.dir/build.make runtime/drkonqi/CMakeFiles/drkonqi.dir/build
make[2]: se ingresa al directorio `/home/kde-devel/kde/build/KDE/kdebase'
make[2]: No se hace nada para `runtime/kuiserver/CMakeFiles/kdeinit_kuiserver.dir/depend'.
make[2]: se sale del directorio `/home/kde-devel/kde/build/KDE/kdebase'
make -f runtime/kuiserver/CMakeFiles/kdeinit_kuiserver.dir/build.make runtime/kuiserver/CMakeFiles/kdeinit_kuiserver.dir/build
make[2]: se ingresa al directorio `/home/kde-devel/kde/build/KDE/kdebase'
make[2]: No se hace nada para `runtime/drkonqi/CMakeFiles/drkonqi.dir/build'.
make[2]: se sale del directorio `/home/kde-devel/kde/build/KDE/kdebase'
/usr/local/bin/cmake -E cmake_progress_report /home/kde-devel/kde/build/KDE/kdebase/CMakeFiles  1
[  1%] Built target drkonqi
make -f runtime/khelpcenter/CMakeFiles/kdeinit_khelpcenter.dir/build.make runtime/khelpcenter/CMakeFiles/kdeinit_khelpcenter.dir/depend
make[2]: se ingresa al directorio `/home/kde-devel/kde/build/KDE/kdebase'
make[2]: No se hace nada para `runtime/kuiserver/CMakeFiles/kdeinit_kuiserver.dir/build'.
make[2]: se sale del directorio `/home/kde-devel/kde/build/KDE/kdebase'
/usr/local/bin/cmake -E cmake_progress_report /home/kde-devel/kde/build/KDE/kdebase/CMakeFiles
[  1%] Built target kdeinit_kuiserver
make -f runtime/khelpcenter/CMakeFiles/khc_indexbuilder.dir/build.make runtime/khelpcenter/CMakeFiles/khc_indexbuilder.dir/depend
make[2]: se ingresa al directorio `/home/kde-devel/kde/build/KDE/kdebase'
make[2]: No se hace nada para `runtime/khelpcenter/CMakeFiles/khc_indexbuilder.dir/depend'.
make[2]: se sale del directorio `/home/kde-devel/kde/build/KDE/kdebase'
make -f runtime/khelpcenter/CMakeFiles/khc_indexbuilder.dir/build.make runtime/khelpcenter/CMakeFiles/khc_indexbuilder.dir/build
make[2]: se ingresa al directorio `/home/kde-devel/kde/build/KDE/kdebase'
Linking CXX executable khc_indexbuilder
cd /home/kde-devel/kde/build/KDE/kdebase/runtime/khelpcenter && /usr/local/bin/cmake -P CMakeFiles/khc_indexbuilder.dir/cmake_clean_target.cmake
cd /home/kde-devel/kde/build/KDE/kdebase/runtime/khelpcenter && /usr/bin/c++     -Wnon-virtual-dtor -Wno-long-long -ansi -Wundef -Wcast-align -Wchar-subscripts -Wall -W -Wpointer-arith -Wformat-security -fno-exceptions -fno-check-new -fno-common -fvisibility=hidden -fvisibility-inlines-hidden -g3 -fno-inline  -fPIC "CMakeFiles/khc_indexbuilder.dir/khc_indexbuilder_automoc.o" "CMakeFiles/khc_indexbuilder.dir/khc_indexbuilder.o"   -o khc_indexbuilder -rdynamic -L/usr/local/lib -L/home/kde-devel/qt-copy/lib -L/home/kde-devel/kde/lib -lQtCore -lpthread -lkdecore -lkdeui -lkio -lkparts -lQtCore -lpthread -lkdecore -lkpty -lQtXml -lQt3Support -lkde3support -lQtCore -lpthread -lQtNetwork -lQtDBus -lQtXml -lz -lbz2 -lresolv -lkdecore -lkio -lkdeui -lQtSvg -lSM -lICE -lX11 -lXext -lXft -lXau -lXdmcp -lXpm -lXtst -lXcursor -lXfixes -lstreamanalyzer -lstreams -lsolid -lQtCore -lpthread -lQtDBus -lQtXml -lQtGui -lXrender -lkdecore -lutil -Wl,-rpath,/home/kde-devel/kde/lib:/usr/local/lib:/home/kde-devel/qt-copy/lib:/home/kde-devel/kde/lib
make[2]: se ingresa al directorio `/home/kde-devel/kde/build/KDE/kdebase'
make[2]: No se hace nada para `runtime/khelpcenter/CMakeFiles/kdeinit_khelpcenter.dir/depend'.
make[2]: se sale del directorio `/home/kde-devel/kde/build/KDE/kdebase'
make -f runtime/khelpcenter/CMakeFiles/kdeinit_khelpcenter.dir/build.make runtime/khelpcenter/CMakeFiles/kdeinit_khelpcenter.dir/build
make[2]: se ingresa al directorio `/home/kde-devel/kde/build/KDE/kdebase'
make[2]: No se hace nada para `runtime/khelpcenter/CMakeFiles/kdeinit_khelpcenter.dir/build'.
make[2]: se sale del directorio `/home/kde-devel/kde/build/KDE/kdebase'
/usr/local/bin/cmake -E cmake_progress_report /home/kde-devel/kde/build/KDE/kdebase/CMakeFiles  2
[  2%] Built target kdeinit_khelpcenter
make -f runtime/kioexec/CMakeFiles/kioexec.dir/build.make runtime/kioexec/CMakeFiles/kioexec.dir/depend
make[2]: se ingresa al directorio `/home/kde-devel/kde/build/KDE/kdebase'
make[2]: No se hace nada para `runtime/kioexec/CMakeFiles/kioexec.dir/depend'.
make[2]: se sale del directorio `/home/kde-devel/kde/build/KDE/kdebase'
make -f runtime/kioexec/CMakeFiles/kioexec.dir/build.make runtime/kioexec/CMakeFiles/kioexec.dir/build
make[2]: se ingresa al directorio `/home/kde-devel/kde/build/KDE/kdebase'
make[2]: No se hace nada para `runtime/kioexec/CMakeFiles/kioexec.dir/build'.
make[2]: se sale del directorio `/home/kde-devel/kde/build/KDE/kdebase'
/usr/local/bin/cmake -E cmake_progress_report /home/kde-devel/kde/build/KDE/kdebase/CMakeFiles  3
[  3%] Built target kioexec
make -f runtime/kioslave/about/CMakeFiles/kio_about.dir/build.make runtime/kioslave/about/CMakeFiles/kio_about.dir/depend
make[2]: se ingresa al directorio `/home/kde-devel/kde/build/KDE/kdebase'
make[2]: No se hace nada para `runtime/kioslave/about/CMakeFiles/kio_about.dir/depend'.
make[2]: se sale del directorio `/home/kde-devel/kde/build/KDE/kdebase'
make -f runtime/kioslave/about/CMakeFiles/kio_about.dir/build.make runtime/kioslave/about/CMakeFiles/kio_about.dir/build
make[2]: se ingresa al directorio `/home/kde-devel/kde/build/KDE/kdebase'
make[2]: No se hace nada para `runtime/kioslave/about/CMakeFiles/kio_about.dir/build'.
make[2]: se sale del directorio `/home/kde-devel/kde/build/KDE/kdebase'
/usr/local/bin/cmake -E cmake_progress_report /home/kde-devel/kde/build/KDE/kdebase/CMakeFiles
[  3%] Built target kio_about
make -f runtime/kioslave/cgi/CMakeFiles/kio_cgi.dir/build.make runtime/kioslave/cgi/CMakeFiles/kio_cgi.dir/depend
make[2]: se ingresa al directorio `/home/kde-devel/kde/build/KDE/kdebase'
make[2]: No se hace nada para `runtime/kioslave/cgi/CMakeFiles/kio_cgi.dir/depend'.
make[2]: se sale del directorio `/home/kde-devel/kde/build/KDE/kdebase'
make -f runtime/kioslave/cgi/CMakeFiles/kio_cgi.dir/build.make runtime/kioslave/cgi/CMakeFiles/kio_cgi.dir/build
make[2]: se ingresa al directorio `/home/kde-devel/kde/build/KDE/kdebase'
make[2]: No se hace nada para `runtime/kioslave/cgi/CMakeFiles/kio_cgi.dir/build'.
make[2]: se sale del directorio `/home/kde-devel/kde/build/KDE/kdebase'
/usr/local/bin/cmake -E cmake_progress_report /home/kde-devel/kde/build/KDE/kdebase/CMakeFiles
[  3%] Built target kio_cgi
make -f runtime/kioslave/cgi/kcmcgi/CMakeFiles/kcm_cgi.dir/build.make runtime/kioslave/cgi/kcmcgi/CMakeFiles/kcm_cgi.dir/depend
make[2]: se ingresa al directorio `/home/kde-devel/kde/build/KDE/kdebase'
/usr/local/bin/cmake -E cmake_progress_report /home/kde-devel/kde/build/KDE/kdebase/CMakeFiles
[  3%] Generating kcm_cgi_automoc.cpp
cd /home/kde-devel/kde/build/KDE/kdebase/runtime/kioslave/cgi/kcmcgi && /home/kde-devel/kde/bin/kde4automoc /home/kde-devel/kde/build/KDE/kdebase/runtime/kioslave/cgi/kcmcgi/kcm_cgi_automoc.cpp /home/kde-devel/kde/src/KDE/kdebase/runtime/kioslave/cgi/kcmcgi /home/kde-devel/kde/build/KDE/kdebase/runtime/kioslave/cgi/kcmcgi /home/kde-devel/qt-copy/bin/moc
Scanning dependencies of target kcm_cgi
cd /home/kde-devel/kde/build/KDE/kdebase && /usr/local/bin/cmake -E cmake_depends "KDevelop3" /home/kde-devel/kde/src/KDE/kdebase /home/kde-devel/kde/src/KDE/kdebase/runtime/kioslave/cgi/kcmcgi /home/kde-devel/kde/build/KDE/kdebase /home/kde-devel/kde/build/KDE/kdebase/runtime/kioslave/cgi/kcmcgi /home/kde-devel/kde/build/KDE/kdebase/runtime/kioslave/cgi/kcmcgi/CMakeFiles/kcm_cgi.dir/DependInfo.cmake
CMakeFiles/khc_indexbuilder.dir/khc_indexbuilder.o: In function `KHC::IndexBuilder::slotReceivedStderr(K3Process*, char*, int)':
/home/kde-devel/kde/src/KDE/kdebase/runtime/khelpcenter/khc_indexbuilder.cpp:134: undefined reference to `std::basic_ostream<char, std::char_traits<char> >::operator<<(std::basic_ostream<char, std::char_traits<char> >& (*)(std::basic_ostream<char, std::char_traits<char> >&))'
CMakeFiles/khc_indexbuilder.dir/khc_indexbuilder.o: In function `KHC::IndexBuilder::slotReceivedStdout(K3Process*, char*, int)':
/home/kde-devel/kde/src/KDE/kdebase/runtime/khelpcenter/khc_indexbuilder.cpp:128: undefined reference to `std::basic_ostream<char, std::char_traits<char> >::operator<<(std::basic_ostream<char, std::char_traits<char> >& (*)(std::basic_ostream<char, std::char_traits<char> >&))'
/usr/bin/ld: khc_indexbuilder: hidden symbol `std::basic_ostream<char, std::char_traits<char> >::operator<<(std::basic_ostream<char, std::char_traits<char> >& (*)(std::basic_ostream<char, std::char_traits<char> >&))' isn't defined
/usr/bin/ld: final link failed: Nonrepresentable section on output
collect2: ld returned 1 exit status
make[2]: *** [runtime/khelpcenter/khc_indexbuilder] Error 1
make[2]: se sale del directorio `/home/kde-devel/kde/build/KDE/kdebase'
make[1]: *** [runtime/khelpcenter/CMakeFiles/khc_indexbuilder.dir/all] Error 2
make[1]: *** Se espera a que terminen otras tareas....
make[2]: se sale del directorio `/home/kde-devel/kde/build/KDE/kdebase'
make -f runtime/kioslave/cgi/kcmcgi/CMakeFiles/kcm_cgi.dir/build.make runtime/kioslave/cgi/kcmcgi/CMakeFiles/kcm_cgi.dir/build
make[2]: se ingresa al directorio `/home/kde-devel/kde/build/KDE/kdebase'
/usr/local/bin/cmake -E cmake_progress_report /home/kde-devel/kde/build/KDE/kdebase/CMakeFiles
[  3%] /usr/local/bin/cmake -E cmake_progress_report /home/kde-devel/kde/build/KDE/kdebase/CMakeFiles
Building CXX object runtime/kioslave/cgi/kcmcgi/CMakeFiles/kcm_cgi.dir/kcm_cgi_automoc.o
[  3%] /usr/bin/c++   -Dkcm_cgi_EXPORTS   -Wnon-virtual-dtor -Wno-long-long -ansi -Wundef -Wcast-align -Wchar-subscripts -Wall -W -Wpointer-arith -Wformat-security -fno-exceptions -fno-check-new -fno-common -fvisibility=hidden -fvisibility-inlines-hidden -g3 -fno-inline -fPIC -I/home/kde-devel/kde/build/KDE/kdebase/runtime/kioslave/cgi/kcmcgi -I/home/kde-devel/kde/src/KDE/kdebase/runtime/kioslave/cgi/kcmcgi -I/home/kde-devel/kde/src/KDE/kdebase -I/home/kde-devel/kde/build/KDE/kdebase -I/home/kde-devel/kde/build/KDE/kdebase/runtime -I/home/kde-devel/qt-copy/include -I/home/kde-devel/qt-copy/include/Qt -I/home/kde-devel/qt-copy/mkspecs/default -I/home/kde-devel/qt-copy/include/QtCore -I/home/kde-devel/qt-copy/include/QtGui -I/home/kde-devel/qt-copy/include/Qt3Support -I/home/kde-devel/qt-copy/include/QtAssistant -I/home/kde-devel/qt-copy/include/QtDesigner -I/home/kde-devel/qt-copy/include/QtNetwork -I/home/kde-devel/qt-copy/include/QtOpenGL -I/home/kde-devel/qt-copy/include/QtSql -I/home/kde-devel/qt-copy/include/QtXml -I/home/kde-devel/qt-copy/include/QtSvg -I/home/kde-devel/qt-copy/include/QtScript -I/home/kde-devel/qt-copy/include/QtUiTools -I/home/kde-devel/qt-copy/include/QtTest -I/home/kde-devel/qt-copy/include/QtDBus -I/home/kde-devel/kde/include -I/home/kde-devel/kde/include/KDE -I/usr/local/include   -D_BSD_SOURCE -D_XOPEN_SOURCE=500 -D_BSD_SOURCE -D_GNU_SOURCE -DQT_NO_STL -DQT_NO_CAST_TO_ASCII -D_REENTRANT -DKDE_DEPRECATED_WARNINGS -o runtime/kioslave/cgi/kcmcgi/CMakeFiles/kcm_cgi.dir/kcm_cgi_automoc.o -c /home/kde-devel/kde/build/KDE/kdebase/runtime/kioslave/cgi/kcmcgi/kcm_cgi_automoc.cpp
Building CXX object runtime/kioslave/cgi/kcmcgi/CMakeFiles/kcm_cgi.dir/kcmcgi.o
/usr/bin/c++   -Dkcm_cgi_EXPORTS   -Wnon-virtual-dtor -Wno-long-long -ansi -Wundef -Wcast-align -Wchar-subscripts -Wall -W -Wpointer-arith -Wformat-security -fno-exceptions -fno-check-new -fno-common -fvisibility=hidden -fvisibility-inlines-hidden -g3 -fno-inline -fPIC -I/home/kde-devel/kde/build/KDE/kdebase/runtime/kioslave/cgi/kcmcgi -I/home/kde-devel/kde/src/KDE/kdebase/runtime/kioslave/cgi/kcmcgi -I/home/kde-devel/kde/src/KDE/kdebase -I/home/kde-devel/kde/build/KDE/kdebase -I/home/kde-devel/kde/build/KDE/kdebase/runtime -I/home/kde-devel/qt-copy/include -I/home/kde-devel/qt-copy/include/Qt -I/home/kde-devel/qt-copy/mkspecs/default -I/home/kde-devel/qt-copy/include/QtCore -I/home/kde-devel/qt-copy/include/QtGui -I/home/kde-devel/qt-copy/include/Qt3Support -I/home/kde-devel/qt-copy/include/QtAssistant -I/home/kde-devel/qt-copy/include/QtDesigner -I/home/kde-devel/qt-copy/include/QtNetwork -I/home/kde-devel/qt-copy/include/QtOpenGL -I/home/kde-devel/qt-copy/include/QtSql -I/home/kde-devel/qt-copy/include/QtXml -I/home/kde-devel/qt-copy/include/QtSvg -I/home/kde-devel/qt-copy/include/QtScript -I/home/kde-devel/qt-copy/include/QtUiTools -I/home/kde-devel/qt-copy/include/QtTest -I/home/kde-devel/qt-copy/include/QtDBus -I/home/kde-devel/kde/include -I/home/kde-devel/kde/include/KDE -I/usr/local/include   -D_BSD_SOURCE -D_XOPEN_SOURCE=500 -D_BSD_SOURCE -D_GNU_SOURCE -DQT_NO_STL -DQT_NO_CAST_TO_ASCII -D_REENTRANT -DKDE_DEPRECATED_WARNINGS -o runtime/kioslave/cgi/kcmcgi/CMakeFiles/kcm_cgi.dir/kcmcgi.o -c /home/kde-devel/kde/src/KDE/kdebase/runtime/kioslave/cgi/kcmcgi/kcmcgi.cpp
Linking CXX shared module ../../../../lib/kcm_cgi.so
cd /home/kde-devel/kde/build/KDE/kdebase/runtime/kioslave/cgi/kcmcgi && /usr/local/bin/cmake -P CMakeFiles/kcm_cgi.dir/cmake_clean_target.cmake
cd /home/kde-devel/kde/build/KDE/kdebase/runtime/kioslave/cgi/kcmcgi && /usr/local/bin/cmake -E cmake_link_script CMakeFiles/kcm_cgi.dir/link.txt --verbose=1
/usr/bin/c++  -fPIC   -Wnon-virtual-dtor -Wno-long-long -ansi -Wundef -Wcast-align -Wchar-subscripts -Wall -W -Wpointer-arith -Wformat-security -fno-exceptions -fno-check-new -fno-common -fvisibility=hidden -fvisibility-inlines-hidden -g3 -fno-inline -Wl,--fatal-warnings -Wl,--no-undefined -lc  -shared -Wl,-soname,kcm_cgi.so -o ../../../../lib/kcm_cgi.so "CMakeFiles/kcm_cgi.dir/kcm_cgi_automoc.o" "CMakeFiles/kcm_cgi.dir/kcmcgi.o" -L/usr/local/lib -L/home/kde-devel/qt-copy/lib -L/home/kde-devel/kde/lib -lQtCore -lpthread -lkdecore -lkdeui -lz -lstreamanalyzer -lstreams -lQtCore -lpthread -lkdecore -lsolid -lXrender -lkio -lQtGui -lQt3Support -lQtSvg -lSM -lICE -lX11 -lXext -lXft -lXau -lXdmcp -lXpm -lXtst -lXcursor -lXfixes -lQtNetwork -lbz2 -lresolv -lQtCore -lpthread -lQtDBus -lQtXml
make[2]: se sale del directorio `/home/kde-devel/kde/build/KDE/kdebase'
/usr/local/bin/cmake -E cmake_progress_report /home/kde-devel/kde/build/KDE/kdebase/CMakeFiles
[  3%] Built target kcm_cgi
make[1]: se sale del directorio `/home/kde-devel/kde/build/KDE/kdebase'
make: *** [all] Error 2