make[2]: Leaving directory `/tmp/buildd/python-pyglew-0.1.2'
c++ -fpic -g -Wall -I/usr/include/python2.5 -Iinclude -I. -Iinclude -Ibuild -c pyglew.cc -o pyglew.o
pyglew.cc:24:21: error: GL/glew.h: No such file or directory
In file included from pyglew.cc:27:
include/unpack.hh:32: error: expected initializer before 'unpack'
include/unpack.hh:38: error: expected initializer before 'unpack'
include/unpack.hh:45: error: expected initializer before 'unpack'
include/unpack.hh:51: error: expected initializer before 'unpack'
include/unpack.hh:59: error: expected initializer before 'unpack'
include/unpack.hh:67: error: expected initializer before '*' token
In file included from pyglew.cc:28:
include/pack.hh:39: error: expected ',' or '...' before '*' token
include/pack.hh:39: error: ISO C++ forbids declaration of 'GLubyte' with no type
include/pack.hh: In function 'PyObject* pack(int)':
include/pack.hh:39: error: redefinition of 'PyObject* pack(int)'
include/pack.hh:34: error: 'PyObject* pack(int)' previously defined here
include/pack.hh:41: error: 'v' was not declared in this scope
include/pack.hh: At global scope:
include/pack.hh:54: error: 'pack' declared as an 'inline' variable
include/pack.hh:54: error: 'PyObject* pack' redeclared as different kind of symbol
include/pack.hh:49: error: previous declaration of 'PyObject* pack(const char*)'
include/pack.hh:54: error: 'GLvoid' was not declared in this scope
include/pack.hh:54: error: 'ptr' was not declared in this scope
include/pack.hh:59: error: 'pack' declared as an 'inline' variable
include/pack.hh:59: error: 'PyObject* pack' redeclared as different kind of symbol
include/pack.hh:49: error: previous declaration of 'PyObject* pack(const char*)'
include/pack.hh:59: error: 'GLsizei' was not declared in this scope
include/pack.hh:59: error: 'GLushort' was not declared in this scope
include/pack.hh:59: error: 'is' was not declared in this scope
make[1]: *** [pyglew.o] Error 1
make[1]: Leaving directory `/tmp/buildd/python-pyglew-0.1.2'