rendered paste body gcc -DHAVE_CONFIG_H -I. -I../../src -I/opt/e17/include -I/opt/e17/include -I/opt/e17/include/etk -I/opt/e17/include -I/opt/e17/include -Wall -MT libevolve_la-evolve_parse.lo -MD -MP -MF .deps/libevolve_la-evolve_parse.Tpo -c evolve_parse.c -fPIC -DPIC -o .libs/libevolve_la-evolve_parse.o
gcc -DHAVE_CONFIG_H -I. -I../../src -I/opt/e17/include -I/opt/e17/include -I/opt/e17/include/etk -I/opt/e17/include -I/opt/e17/include -Wall -MT libevolve_la-evolve_lib.lo -MD -MP -MF .deps/libevolve_la-evolve_lib.Tpo -c evolve_lib.c -fPIC -DPIC -o .libs/libevolve_la-evolve_lib.o
evolve_lib.c: In function 'evolve_init':
evolve_lib.c:91: error: 'Etk_Property_Value_Value' undeclared (first use in this function)
evolve_lib.c:91: error: (Each undeclared identifier is reported only once
evolve_lib.c:91: error: for each function it appears in.)
evolve_lib.c:92: error: expected ';' before '___ett'
evolve_lib.c:92: error: '___ett' undeclared (first use in this function)
evolve_lib.c:93: error: expected ';' before '___ett'
evolve_lib.c:94: error: expected ';' before '___ett'
evolve_lib.c:95: error: expected ';' before '___ett'
evolve_lib.c:96: error: expected ';' before '___ett'
evolve_lib.c:97: error: expected ';' before '___ett'
evolve_lib.c:98: error: expected ';' before '___ett'
evolve_lib.c:99: error: expected ';' before '___ett'
make[3]: *** [libevolve_la-evolve_lib.lo] Error 1
make[3]: *** Waiting for unfinished jobs....
gcc -DHAVE_CONFIG_H -I. -I../../src -I/opt/e17/include -I/opt/e17/include -I/opt/e17/include/etk -I/opt/e17/include -I/opt/e17/include -Wall -MT libevolve_la-evolve_parse.lo -MD -MP -MF .deps/libevolve_la-evolve_parse.Tpo -c evolve_parse.c -o libevolve_la-evolve_parse.o >/dev/null 2>&1
mv -f .deps/libevolve_la-evolve_parse.Tpo .deps/libevolve_la-evolve_parse.Plo
make[3]: Leaving directory `/home/ruskie/e17_cvs/e17/libs/evolve/src/lib'
make[2]: *** [all-recursive] Error 1
make[2]: Leaving directory `/home/ruskie/e17_cvs/e17/libs/evolve/src'
make[1]: *** [all] Error 2
make[1]: Leaving directory `/home/ruskie/e17_cvs/e17/libs/evolve/src'
make: *** [all-recursive] Error 1