>>> Unpacking source...
>>> Unpacking udftools-1.0.0b3.tar.gz to /var/tmp/portage/sys-fs/udftools-1.0.0b-r7/work
>>> Unpacking udftools-1.0.0b3.patch.bz2 to /var/tmp/portage/sys-fs/udftools-1.0.0b-r7/work
* Applying udftools-1.0.0b3.patch ... [ ok ]
* Applying cdrwtool-linux2.6-fix-v2.patch ... [ ok ]
* Applying udftools-1.0.0b-gcc4.patch ... [ ok ]
* Applying udftools-1.0.0b-bigendian.patch ... [ ok ]
>>> Source unpacked.
>>> Compiling source in /var/tmp/portage/sys-fs/udftools-1.0.0b-r7/work/udftools-1.0.0b3 ...
* econf: updating udftools-1.0.0b3/config/config.guess with /usr/share/gnuconfig/config.guess
* econf: updating udftools-1.0.0b3/config/config.sub with /usr/share/gnuconfig/config.sub
./configure --prefix=/usr --host=x86_64-pc-linux-gnu --mandir=/usr/share/man --infodir=/usr/share/info --datadir=/usr/share --sysconfdir=/etc --localstatedir=/var/lib --libdir=/usr/lib64 --build=x86_64-pc-linux-gnu
checking for a BSD-compatible install... /usr/bin/install -c
checking whether build environment is sane... yes
checking for gawk... gawk
checking whether make sets $(MAKE)... yes
checking for x86_64-pc-linux-gnu-gcc... x86_64-pc-linux-gnu-gcc
checking for C compiler default output... a.out
checking whether the C compiler works... yes
checking whether we are cross compiling... no
checking for suffix of executables...
checking for suffix of object files... o
checking whether we are using the GNU C compiler... yes
checking whether x86_64-pc-linux-gnu-gcc accepts -g... yes
checking for x86_64-pc-linux-gnu-gcc option to accept ANSI C... none needed
checking for style of include used by make... GNU
checking dependency style of x86_64-pc-linux-gnu-gcc... gcc3
checking build system type... x86_64-pc-linux-gnu
checking host system type... x86_64-pc-linux-gnu
checking for ld used by GCC... /usr/x86_64-pc-linux-gnu/bin/ld
checking if the linker (/usr/x86_64-pc-linux-gnu/bin/ld) is GNU ld... yes
checking for /usr/x86_64-pc-linux-gnu/bin/ld option to reload object files... -r
checking for BSD-compatible nm... /usr/bin/x86_64-pc-linux-gnu-nm -B
checking for a sed that does not truncate output... /bin/sed
checking whether ln -s works... yes
checking how to recognise dependent libraries... pass_all
checking command to parse /usr/bin/x86_64-pc-linux-gnu-nm -B output... ok
checking how to run the C preprocessor... x86_64-pc-linux-gnu-gcc -E
checking for egrep... grep -E
checking for ANSI C header files... yes
checking for sys/types.h... yes
checking for sys/stat.h... yes
checking for stdlib.h... yes
checking for string.h... yes
checking for memory.h... yes
checking for strings.h... yes
checking for inttypes.h... yes
checking for stdint.h... yes
checking for unistd.h... yes
checking dlfcn.h usability... yes
checking dlfcn.h presence... yes
checking for dlfcn.h... yes
checking for x86_64-pc-linux-gnu-ranlib... x86_64-pc-linux-gnu-ranlib
checking for x86_64-pc-linux-gnu-strip... x86_64-pc-linux-gnu-strip
checking for objdir... .libs
checking for x86_64-pc-linux-gnu-gcc option to produce PIC... -fPIC
checking if x86_64-pc-linux-gnu-gcc PIC flag -fPIC works... yes
checking if x86_64-pc-linux-gnu-gcc static flag -static works... yes
checking if x86_64-pc-linux-gnu-gcc supports -c -o file.o... yes
checking if x86_64-pc-linux-gnu-gcc supports -c -o file.lo... yes
checking if x86_64-pc-linux-gnu-gcc supports -fno-rtti -fno-exceptions... yes
checking whether the linker (/usr/x86_64-pc-linux-gnu/bin/ld) supports shared libraries... yes
checking how to hardcode library paths into programs... immediate
checking whether stripping libraries is possible... yes
checking dynamic linker characteristics... GNU/Linux ld.so
checking if libtool supports shared libraries... yes
checking whether to build shared libraries... no
checking whether to build static libraries... yes
creating libtool
checking for ANSI C header files... (cached) yes
checking fcntl.h usability... yes
checking fcntl.h presence... yes
checking for fcntl.h... yes
checking malloc.h usability... yes
checking malloc.h presence... yes
checking for malloc.h... yes
checking sys/time.h usability... yes
checking sys/time.h presence... yes
checking for sys/time.h... yes
checking for unistd.h... (cached) yes
checking endian.h usability... yes
checking endian.h presence... yes
checking for endian.h... yes
checking getopt.h usability... yes
checking getopt.h presence... yes
checking for getopt.h... yes
checking sys/isa_defs.h usability... no
checking sys/isa_defs.h presence... no
checking for sys/isa_defs.h... no
checking for string.h... (cached) yes
checking for strings.h... (cached) yes
checking for inline... inline
checking whether time.h and sys/time.h may both be included... yes
checking whether struct tm is in sys/time.h or time.h... time.h
checking for gettimeofday... yes
checking for mktime... yes
checking for open64... yes
checking for lseek64... yes
checking for llseek... yes
checking for getopt_long... yes
configure: creating ./config.status
config.status: creating Makefile
config.status: creating libudffs/Makefile
config.status: creating mkudffs/Makefile
config.status: creating cdrwtool/Makefile
config.status: creating pktsetup/Makefile
config.status: creating udffsck/Makefile
config.status: creating wrudf/Makefile
config.status: creating doc/Makefile
config.status: creating udfct/Makefile
config.status: creating include/config.h
config.status: executing depfiles commands
Making all in libudffs
x86_64-pc-linux-gnu-gcc -DHAVE_CONFIG_H -I. -I. -I../include -D_LARGEFILE64_SOURCE -Os -march=x86-64 -pipe -c desc.c -MT desc.lo -MD -MP -MF .deps/desc.TPlo -o desc.o
x86_64-pc-linux-gnu-gcc -DHAVE_CONFIG_H -I. -I. -I../include -D_LARGEFILE64_SOURCE -Os -march=x86-64 -pipe -c extent.c -MT extent.lo -MD -MP -MF .deps/extent.TPlo -o extent.o
x86_64-pc-linux-gnu-gcc -DHAVE_CONFIG_H -I. -I. -I../include -D_LARGEFILE64_SOURCE -Os -march=x86-64 -pipe -c crc.c -MT crc.lo -MD -MP -MF .deps/crc.TPlo -o crc.o
echo timestamp > crc.lo
In file included from ../include/libudffs.h:28,
from desc.c:34:
../include/udf_endian.h: In function 'lets_to_cpu':
../include/udf_endian.h:47: warning: incompatible implicit declaration of built-in function 'memcpy'
../include/udf_endian.h: In function 'cpu_to_lets':
../include/udf_endian.h:96: warning: incompatible implicit declaration of built-in function 'memcpy'
In file included from ../include/libudffs.h:28,
from extent.c:34:
../include/udf_endian.h: In function 'lets_to_cpu':
../include/udf_endian.h:47: warning: incompatible implicit declaration of built-in function 'memcpy'
../include/udf_endian.h: In function 'cpu_to_lets':
../include/udf_endian.h:96: warning: incompatible implicit declaration of built-in function 'memcpy'
echo timestamp > desc.lo
x86_64-pc-linux-gnu-gcc -DHAVE_CONFIG_H -I. -I. -I../include -D_LARGEFILE64_SOURCE -Os -march=x86-64 -pipe -c file.c -MT file.lo -MD -MP -MF .deps/file.TPlo -o file.o
x86_64-pc-linux-gnu-gcc -DHAVE_CONFIG_H -I. -I. -I../include -D_LARGEFILE64_SOURCE -Os -march=x86-64 -pipe -c unicode.c -MT unicode.lo -MD -MP -MF .deps/unicode.TPlo -o unicode.o
In file included from ../include/libudffs.h:28,
from file.c:25:
../include/udf_endian.h: In function 'lets_to_cpu':
../include/udf_endian.h:47: warning: incompatible implicit declaration of built-in function 'memcpy'
../include/udf_endian.h: In function 'cpu_to_lets':
../include/udf_endian.h:96: warning: incompatible implicit declaration of built-in function 'memcpy'
echo timestamp > extent.lo
file.c: In function 'insert_fid':
file.c:328: warning: incompatible implicit declaration of built-in function 'memcpy'
file.c:355: warning: incompatible implicit declaration of built-in function 'memcpy'
file.c: In function 'udf_create':
file.c:379: warning: incompatible implicit declaration of built-in function 'memcpy'
file.c:427: warning: incompatible implicit declaration of built-in function 'memcpy'
file.c: In function 'udf_find_next_zero_bit':
file.c:579: warning: comparison is always false due to limited range of data type
file.c: In function 'udf_alloc_table_blocks':
file.c:628: warning: incompatible implicit declaration of built-in function 'memmove'
file.c:632: warning: incompatible implicit declaration of built-in function 'memset'
file.c:645: warning: incompatible implicit declaration of built-in function 'memmove'
In file included from ../include/libudffs.h:28,
from unicode.c:23:
../include/udf_endian.h: In function 'lets_to_cpu':
../include/udf_endian.h:47: warning: incompatible implicit declaration of built-in function 'memcpy'
../include/udf_endian.h: In function 'cpu_to_lets':
../include/udf_endian.h:96: warning: incompatible implicit declaration of built-in function 'memcpy'
unicode.c: In function 'encode_utf8':
unicode.c:63: warning: incompatible implicit declaration of built-in function 'strlen'
unicode.c:77: warning: incompatible implicit declaration of built-in function 'memcpy'
unicode.c: In function 'decode_string':
unicode.c:178: warning: incompatible implicit declaration of built-in function 'memcpy'
unicode.c: In function 'encode_string':
unicode.c:189: warning: incompatible implicit declaration of built-in function 'memset'
unicode.c:194: warning: incompatible implicit declaration of built-in function 'strlen'
unicode.c:198: warning: incompatible implicit declaration of built-in function 'memcpy'
unicode.c:206: warning: incompatible implicit declaration of built-in function 'strlen'
unicode.c:212: warning: incompatible implicit declaration of built-in function 'memcpy'
echo timestamp > unicode.lo
echo timestamp > file.lo
mkdir .libs
rm -fr .libs/libudffs.la .libs/libudffs.* .libs/libudffs.*
ar cru .libs/libudffs.a crc.o extent.o desc.o file.o unicode.o
x86_64-pc-linux-gnu-ranlib .libs/libudffs.a
creating libudffs.la
(cd .libs && rm -f libudffs.la && ln -s ../libudffs.la libudffs.la)
Making all in mkudffs
In file included from mkudffs.h:28,
from mkudffs.c:34:
../include/udf_endian.h: In function ‘lets_to_cpu’:
../include/udf_endian.h:47: warning: incompatible implicit declaration of built-in function ‘memcpy’
In file included from mkudffs.h:28,
from defaults.c:23:
../include/udf_endian.h: In function ‘lets_to_cpu’:
../include/udf_endian.h:47: warning: incompatible implicit declaration of built-in function ‘memcpy’
../include/udf_endian.h: In function ‘cpu_to_lets’:
../include/udf_endian.h:96: warning: incompatible implicit declaration of built-in function ‘memcpy’
../include/udf_endian.h: In function ‘cpu_to_lets’:
../include/udf_endian.h:96: warning: incompatible implicit declaration of built-in function ‘memcpy’
mkudffs.c: In function ‘udf_init_disc’:
mkudffs.c:45: warning: incompatible implicit declaration of built-in function ‘memset’
mkudffs.c:73: warning: incompatible implicit declaration of built-in function ‘memcpy’
mkudffs.c:77: warning: incompatible implicit declaration of built-in function ‘strlen’
mkudffs.c: In function ‘udf_set_version’:
mkudffs.c:149: warning: incompatible implicit declaration of built-in function ‘strcpy’
mkudffs.c:154: warning: incompatible implicit declaration of built-in function ‘strcpy’
mkudffs.c: In function ‘setup_vrs’:
mkudffs.c:315: warning: incompatible implicit declaration of built-in function ‘memcpy’
mkudffs.c: In function ‘setup_space’:
mkudffs.c:442: warning: incompatible implicit declaration of built-in function ‘memset’
mkudffs.c: In function ‘setup_pvd’:
mkudffs.c:715: warning: incompatible implicit declaration of built-in function ‘memcpy’
In file included from mkudffs.h:28,
from main.c:35:
../include/udf_endian.h: In function ‘lets_to_cpu’:
../include/udf_endian.h:47: warning: incompatible implicit declaration of built-in function ‘memcpy’
../include/udf_endian.h: In function ‘cpu_to_lets’:
../include/udf_endian.h:96: warning: incompatible implicit declaration of built-in function ‘memcpy’
main.c: In function ‘write_func’:
main.c:136: warning: incompatible implicit declaration of built-in function ‘memcpy’
main.c:142: warning: incompatible implicit declaration of built-in function ‘memset’
main.c: In function ‘main’:mkudffs.c: In function ‘setup_lvd’:
mkudffs.c:734: warning: incompatible implicit declaration of built-in function ‘memcpy’
mkudffs.c: In function ‘setup_pd’:
mkudffs.c:760: warning: incompatible implicit declaration of built-in function ‘memcpy’
mkudffs.c: In function ‘setup_usd’:
mkudffs.c:789: warning: incompatible implicit declaration of built-in function ‘memcpy’
mkudffs.c: In function ‘setup_iuvd’:
mkudffs.c:806: warning: incompatible implicit declaration of built-in function ‘memcpy’
mkudffs.c: In function ‘setup_td’:
mkudffs.c:821: warning: incompatible implicit declaration of built-in function ‘memcpy’
mkudffs.c: In function ‘setup_stable’:
mkudffs.c:877: warning: incompatible implicit declaration of built-in function ‘memcpy’
mkudffs.c: In function ‘setup_vat’:
main.c:157: warning: incompatible implicit declaration of built-in function ‘memset’
mkudffs.c:898: warning: incompatible implicit declaration of built-in function ‘strlen’
mkudffs.c:911: warning: incompatible implicit declaration of built-in function ‘strlen’
mkudffs.c: In function ‘add_type1_partition’:
mkudffs.c:947: warning: incompatible implicit declaration of built-in function ‘memmove’
mkudffs.c: In function ‘add_type2_sparable_partition’:
mkudffs.c:970: warning: incompatible implicit declaration of built-in function ‘memcpy’
mkudffs.c:983: warning: incompatible implicit declaration of built-in function ‘memmove’
mkudffs.c: In function ‘find_type2_sparable_partition’:
mkudffs.c:1006: warning: incompatible implicit declaration of built-in function ‘strlen’
mkudffs.c: In function ‘add_type2_virtual_partition’:
mkudffs.c:1033: warning: incompatible implicit declaration of built-in function ‘memcpy’
mkudffs.c:1042: warning: incompatible implicit declaration of built-in function ‘memmove’
In file included from mkudffs.h:28,
from options.c:28:
../include/udf_endian.h: In function ‘lets_to_cpu’:
../include/udf_endian.h:47: warning: incompatible implicit declaration of built-in function ‘memcpy’
../include/udf_endian.h: In function ‘cpu_to_lets’:
../include/udf_endian.h:96: warning: incompatible implicit declaration of built-in function ‘memcpy’
options.c: In function ‘parse_args’:
options.c:179: warning: incompatible implicit declaration of built-in function ‘strncpy’
options.c:323: warning: incompatible implicit declaration of built-in function ‘strcpy’
options.c:354: warning: incompatible implicit declaration of built-in function ‘memcpy’
mkdir .libs
x86_64-pc-linux-gnu-gcc -Os -march=x86-64 -pipe -Wl,-O1 -Wl,--enable-new-dtags -Wl,--sort-common -s -o mkudffs main.o mkudffs.o defaults.o options.o ../libudffs/.libs/libudffs.a
Making all in cdrwtool
In file included from ../include/libudffs.h:28,
from cdrwtool.h:15,
from main.c:34:
../include/udf_endian.h: In function ‘lets_to_cpu’:
../include/udf_endian.h:47: warning: incompatible implicit declaration of built-in function ‘memcpy’
../include/udf_endian.h: In function ‘cpu_to_lets’:
../include/udf_endian.h:96: warning: incompatible implicit declaration of built-in function ‘memcpy’
main.c: In function ‘write_func’:
main.c:73: warning: incompatible implicit declaration of built-in function ‘memset’
main.c:81: warning: incompatible implicit declaration of built-in function ‘memcpy’
main.c:84: warning: incompatible implicit declaration of built-in function ‘memset’
main.c:93: warning: incompatible implicit declaration of built-in function ‘memcpy’
main.c:101: warning: incompatible implicit declaration of built-in function ‘memset’
main.c: In function ‘quick_setup’:
main.c:181: warning: incompatible implicit declaration of built-in function ‘memcpy’
main.c: In function ‘mkudf_session’:
main.c:214: warning: incompatible implicit declaration of built-in function ‘memcpy’
main.c: In function ‘main’:
main.c:240: warning: incompatible implicit declaration of built-in function ‘memset’
main.c:243: warning: incompatible implicit declaration of built-in function ‘strcpy’
In file included from ../mkudffs/mkudffs.h:28,
from defaults.c:23:
../include/udf_endian.h: In function ‘lets_to_cpu’:
../include/udf_endian.h:47: warning: incompatible implicit declaration of built-in function ‘memcpy’
../include/udf_endian.h: In function ‘cpu_to_lets’:
../include/udf_endian.h:96: warning: incompatible implicit declaration of built-in function ‘memcpy’
In file included from ../include/libudffs.h:28,
from cdrwtool.h:15,
from options.c:27:
../include/udf_endian.h: In function ‘lets_to_cpu’:
../include/udf_endian.h:47: warning: incompatible implicit declaration of built-in function ‘memcpy’
../include/udf_endian.h: In function ‘cpu_to_lets’:
../include/udf_endian.h:96: warning: incompatible implicit declaration of built-in function ‘memcpy’
options.c: In function ‘parse_args’:
options.c:138: warning: incompatible implicit declaration of built-in function ‘strcpy’
options.c:212: warning: incompatible implicit declaration of built-in function ‘strcpy’
cdrwtool.c: In function ‘cdrom_open_check’:
cdrwtool.c:606: error: ‘INT_MAX’ undeclared (first use in this function)
cdrwtool.c:606: error: (Each undeclared identifier is reported only once
cdrwtool.c:606: error: for each function it appears in.)
make[1]: *** [cdrwtool.o] Error 1
make[1]: *** Waiting for unfinished jobs....
In file included from ../mkudffs/mkudffs.h:28,
from ../mkudffs/mkudffs.c:34:
../include/udf_endian.h: In function ‘lets_to_cpu’:
../include/udf_endian.h:47: warning: incompatible implicit declaration of built-in function ‘memcpy’
../include/udf_endian.h: In function ‘cpu_to_lets’:
../include/udf_endian.h:96: warning: incompatible implicit declaration of built-in function ‘memcpy’
../mkudffs/mkudffs.c: In function ‘udf_init_disc’:
../mkudffs/mkudffs.c:45: warning: incompatible implicit declaration of built-in function ‘memset’
../mkudffs/mkudffs.c:73: warning: incompatible implicit declaration of built-in function ‘memcpy’
../mkudffs/mkudffs.c:77: warning: incompatible implicit declaration of built-in function ‘strlen’
../mkudffs/mkudffs.c: In function ‘udf_set_version’:
../mkudffs/mkudffs.c:149: warning: incompatible implicit declaration of built-in function ‘strcpy’
../mkudffs/mkudffs.c:154: warning: incompatible implicit declaration of built-in function ‘strcpy’
../mkudffs/mkudffs.c: In function ‘setup_vrs’:
../mkudffs/mkudffs.c:315: warning: incompatible implicit declaration of built-in function ‘memcpy’
../mkudffs/mkudffs.c: In function ‘setup_space’:
../mkudffs/mkudffs.c:442: warning: incompatible implicit declaration of built-in function ‘memset’
../mkudffs/mkudffs.c: In function ‘setup_pvd’:
../mkudffs/mkudffs.c:715: warning: incompatible implicit declaration of built-in function ‘memcpy’
../mkudffs/mkudffs.c: In function ‘setup_lvd’:
../mkudffs/mkudffs.c:734: warning: incompatible implicit declaration of built-in function ‘memcpy’
../mkudffs/mkudffs.c: In function ‘setup_pd’:
../mkudffs/mkudffs.c:760: warning: incompatible implicit declaration of built-in function ‘memcpy’
../mkudffs/mkudffs.c: In function ‘setup_usd’:
../mkudffs/mkudffs.c:789: warning: incompatible implicit declaration of built-in function ‘memcpy’
../mkudffs/mkudffs.c: In function ‘setup_iuvd’:
../mkudffs/mkudffs.c:806: warning: incompatible implicit declaration of built-in function ‘memcpy’
../mkudffs/mkudffs.c: In function ‘setup_td’:
../mkudffs/mkudffs.c:821: warning: incompatible implicit declaration of built-in function ‘memcpy’
../mkudffs/mkudffs.c: In function ‘setup_stable’:
../mkudffs/mkudffs.c:877: warning: incompatible implicit declaration of built-in function ‘memcpy’
../mkudffs/mkudffs.c: In function ‘setup_vat’:
../mkudffs/mkudffs.c:898: warning: incompatible implicit declaration of built-in function ‘strlen’
../mkudffs/mkudffs.c:911: warning: incompatible implicit declaration of built-in function ‘strlen’
../mkudffs/mkudffs.c: In function ‘add_type1_partition’:
../mkudffs/mkudffs.c:947: warning: incompatible implicit declaration of built-in function ‘memmove’
../mkudffs/mkudffs.c: In function ‘add_type2_sparable_partition’:
../mkudffs/mkudffs.c:970: warning: incompatible implicit declaration of built-in function ‘memcpy’
../mkudffs/mkudffs.c:983: warning: incompatible implicit declaration of built-in function ‘memmove’
../mkudffs/mkudffs.c: In function ‘find_type2_sparable_partition’:
../mkudffs/mkudffs.c:1006: warning: incompatible implicit declaration of built-in function ‘strlen’
../mkudffs/mkudffs.c: In function ‘add_type2_virtual_partition’:
../mkudffs/mkudffs.c:1033: warning: incompatible implicit declaration of built-in function ‘memcpy’
../mkudffs/mkudffs.c:1042: warning: incompatible implicit declaration of built-in function ‘memmove’
make: *** [all-recursive] Error 1
*
* ERROR: sys-fs/udftools-1.0.0b-r7 failed.
* Call stack:
* ebuild.sh, line 1695: Called dyn_compile
* ebuild.sh, line 1033: Called qa_call 'src_compile'
* ebuild.sh, line 44: Called src_compile
* ebuild.sh, line 705: Called die
* The specific snippet of code:
* emake || die "emake failed"
* The die message:
* emake failed
*
* If you need support, post the topmost build error, and the call stack if relevant.
* A complete build log is located at '/var/tmp/portage/sys-fs/udftools-1.0.0b-r7/temp/build.log'.
*