/usr/lib/gcc/i686-pc-linux-gnu/4.1.2/../../../../i686-pc-linux-gnu/bin/ld: cannot find -ldns_sd
collect2: ld returned 1 exit status
make[4]: *** [ksysguard] Error 1
make[4]: *** Waiting for unfinished jobs....
make[4]: Leaving directory `/var/tmp/portage/kde-base/kdebase-3.5.7-r4/work/kdebase-3.5.7/ksysguard/gui'
make[3]: *** [all-recursive] Error 1
make[3]: Leaving directory `/var/tmp/portage/kde-base/kdebase-3.5.7-r4/work/kdebase-3.5.7/ksysguard/gui'
make[2]: *** [all-recursive] Error 1
make[2]: Leaving directory `/var/tmp/portage/kde-base/kdebase-3.5.7-r4/work/kdebase-3.5.7/ksysguard'
make[1]: *** [all-recursive] Error 1
make[1]: Leaving directory `/var/tmp/portage/kde-base/kdebase-3.5.7-r4/work/kdebase-3.5.7'
make: *** [all] Error 2
*
* ERROR: kde-base/kdebase-3.5.7-r4 failed.
* Call stack:
* ebuild.sh, line 1654: Called dyn_compile
* ebuild.sh, line 990: Called qa_call 'src_compile'
* ebuild.sh, line 44: Called src_compile
* kdebase-3.5.7-r4.ebuild, line 130: Called kde_src_compile
* kde.eclass, line 170: Called kde_src_compile 'all'
* kde.eclass, line 340: Called kde_src_compile 'myconf' 'configure' 'make'
* kde.eclass, line 336: Called die
*
* died running emake, kde_src_compile:make
* If you need support, post the topmost build error, and the call stack if relevant.
* A complete build log is located at '/var/tmp/portage/kde-base/kdebase-3.5.7-r4/temp/build.log'.
*
* Messages for package kde-base/kdebase-3.5.7-r4:
*
* ERROR: kde-base/kdebase-3.5.7-r4 failed.
* Call stack:
* ebuild.sh, line 1654: Called dyn_compile
* ebuild.sh, line 990: Called qa_call 'src_compile'
* ebuild.sh, line 44: Called src_compile
* kdebase-3.5.7-r4.ebuild, line 130: Called kde_src_compile
* kde.eclass, line 170: Called kde_src_compile 'all'
* kde.eclass, line 340: Called kde_src_compile 'myconf' 'configure' 'make'
* kde.eclass, line 336: Called die
*
* died running emake, kde_src_compile:make
* If you need support, post the topmost build error, and the call stack if relevant.
* A complete build log is located at '/var/tmp/portage/kde-base/kdebase-3.5.7-r4/temp/build.log'.
*
revdep-rebuild failed to emerge all packages
you have the following choices:
- if emerge failed during the build, fix the problems and re-run revdep-rebuild
or
- use -X or --package-names as first argument (trys to rebuild package, not exact
ebuild)
or
- set ACCEPT_KEYWORDS="~<your platform>" and/or /etc/portage/package.unmask
(and remove /root/.revdep-rebuild.5_order to be evaluated again)
or
- modify the above emerge command and run it manually
or
- compile or unmerge unsatisfied packages manually, remove temporary files and
try again (you can edit package/ebuild list first)