All pastes #744194 Raw Edit

Unnamed

public text v1 · immutable
·published 2007-10-21 05:27 UTC
rendered paste body
[ ~/Desktop/HelloWorld ] >> make
arm-apple-darwin-gcc -v -c   hello.m -o hello.o
Using built-in specs.
Target: arm-apple-darwin
Configured with: ../../llvm-gcc-4.0-iphone/configure --enable-llvm=/Users/roostishaw/Desktop/toolchain/llvm-svn --enable-languages=c,c++,objc,obj-c++ --target=arm-apple-darwin --enable-sjlj-exceptions --with-heavenly=/Users/roostishaw/Desktop/rootFS2/ --with-as=/usr/local/bin/arm-apple-darwin-as --with-ld=/usr/local/bin/arm-apple-darwin-ld : (reconfigured) ../../llvm-gcc-4.0-iphone/configure --enable-llvm=/Users/roostishaw/Desktop/toolchain/llvm-svn --enable-languages=c,c++,objc,obj-c++ --target=arm-apple-darwin --enable-sjlj-exceptions --with-heavenly=/Users/roostishaw/Desktop/rootFS/ --with-as=/usr/local/bin/arm-apple-darwin-as --with-ld=/usr/local/bin/arm-apple-darwin-ld
Thread model: posix
gcc version 4.0.1 (Apple Computer, Inc. build 5449)(LLVM build 2.0-svn-iphone-dev-0.3-svn)
 /usr/local/libexec/gcc/arm-apple-darwin/4.0.1/cc1obj -quiet -v -D__DYNAMIC__ hello.m -fPIC -mfpu=vfp -mcpu=arm1176jzf-s -quiet -dumpbase hello.m -mmacosx-version-min=10.4 -auxbase-strip hello.o -version -o /var/tmp//cc9t9Gmy.s
#include "..." search starts here:
#include <...> search starts here:
 /usr/local/include
 /usr/local/lib/gcc/arm-apple-darwin/4.0.1/include
 /usr/local/lib/gcc/arm-apple-darwin/4.0.1/../../../../arm-apple-darwin/include
 /usr/include
 /System/Library/Frameworks (framework directory)
 /Library/Frameworks (framework directory)
End of search list.
GNU Objective-C version 4.0.1 (Apple Computer, Inc. build 5449)(LLVM build 2.0-svn-iphone-dev-0.3-svn) (arm-apple-darwin)
        compiled by GNU C version 4.0.1 (Apple Computer, Inc. build 5250).
GGC heuristics: --param ggc-min-expand=100 --param ggc-min-heapsize=131072
Compiler executable checksum: 1d1a55265edbfeff78e23ba2a9a98705
In file included from /usr/local/lib/gcc/arm-apple-darwin/4.0.1/../../../../arm-apple-darwin/include/CarbonCore/ConditionalMacros.h:42,
                 from /usr/local/lib/gcc/arm-apple-darwin/4.0.1/../../../../arm-apple-darwin/include/CarbonCore/MacTypes.h:20,
                 from /usr/local/lib/gcc/arm-apple-darwin/4.0.1/../../../../arm-apple-darwin/include/CoreFoundation/CFBase.h:38,
                 from /usr/local/lib/gcc/arm-apple-darwin/4.0.1/../../../../arm-apple-darwin/include/CoreFoundation/CFByteOrder.h:16,
                 from /usr/local/lib/gcc/arm-apple-darwin/4.0.1/../../../../arm-apple-darwin/include/CoreGraphics/CGGeometry.h:10,
                 from /usr/local/lib/gcc/arm-apple-darwin/4.0.1/../../../../arm-apple-darwin/include/CoreGraphics/CGAffineTransform.h:12,
                 from /usr/local/lib/gcc/arm-apple-darwin/4.0.1/../../../../arm-apple-darwin/include/CoreGraphics/CoreGraphics.h:12,
                 from /usr/local/lib/gcc/arm-apple-darwin/4.0.1/../../../../arm-apple-darwin/include/UIKit/UIKit.h:3,
                 from hello.m:1:
/usr/local/lib/gcc/arm-apple-darwin/4.0.1/../../../../arm-apple-darwin/include/TargetConditionals.h:110:10: error: #error unrecognized GNU C compiler
In file included from /usr/local/lib/gcc/arm-apple-darwin/4.0.1/../../../../arm-apple-darwin/include/CarbonCore/DriverServices.h:32,
                 from /usr/local/lib/gcc/arm-apple-darwin/4.0.1/../../../../arm-apple-darwin/include/CarbonCore/CarbonCore.h:125,
                 from /usr/local/lib/gcc/arm-apple-darwin/4.0.1/../../../../arm-apple-darwin/include/CoreServices/CoreServices.h:21,
                 from /usr/local/lib/gcc/arm-apple-darwin/4.0.1/../../../../arm-apple-darwin/include/CoreGraphics/CGEvent.h:17,
                 from /usr/local/lib/gcc/arm-apple-darwin/4.0.1/../../../../arm-apple-darwin/include/CoreGraphics/CoreGraphics.h:24,
                 from /usr/local/lib/gcc/arm-apple-darwin/4.0.1/../../../../arm-apple-darwin/include/UIKit/UIKit.h:3,
                 from hello.m:1:
/usr/local/lib/gcc/arm-apple-darwin/4.0.1/../../../../arm-apple-darwin/include/CarbonCore/MachineExceptions.h:340: error: parse error before '*' token
/usr/local/lib/gcc/arm-apple-darwin/4.0.1/../../../../arm-apple-darwin/include/CarbonCore/MachineExceptions.h:374: error: parse error before '*' token
In file included from /usr/local/lib/gcc/arm-apple-darwin/4.0.1/../../../../arm-apple-darwin/include/CarbonCore/CarbonCore.h:161,
                 from /usr/local/lib/gcc/arm-apple-darwin/4.0.1/../../../../arm-apple-darwin/include/CoreServices/CoreServices.h:21,
                 from /usr/local/lib/gcc/arm-apple-darwin/4.0.1/../../../../arm-apple-darwin/include/CoreGraphics/CGEvent.h:17,
                 from /usr/local/lib/gcc/arm-apple-darwin/4.0.1/../../../../arm-apple-darwin/include/CoreGraphics/CoreGraphics.h:24,
                 from /usr/local/lib/gcc/arm-apple-darwin/4.0.1/../../../../arm-apple-darwin/include/UIKit/UIKit.h:3,
                 from hello.m:1:
/usr/local/lib/gcc/arm-apple-darwin/4.0.1/../../../../arm-apple-darwin/include/CarbonCore/fp.h:93:2: error: #error unsupported CPU
In file included from /usr/local/lib/gcc/arm-apple-darwin/4.0.1/../../../../arm-apple-darwin/include/CarbonCore/CarbonCore.h:161,
                 from /usr/local/lib/gcc/arm-apple-darwin/4.0.1/../../../../arm-apple-darwin/include/CoreServices/CoreServices.h:21,
                 from /usr/local/lib/gcc/arm-apple-darwin/4.0.1/../../../../arm-apple-darwin/include/CoreGraphics/CGEvent.h:17,
                 from /usr/local/lib/gcc/arm-apple-darwin/4.0.1/../../../../arm-apple-darwin/include/CoreGraphics/CoreGraphics.h:24,
                 from /usr/local/lib/gcc/arm-apple-darwin/4.0.1/../../../../arm-apple-darwin/include/UIKit/UIKit.h:3,
                 from hello.m:1:
/usr/local/lib/gcc/arm-apple-darwin/4.0.1/../../../../arm-apple-darwin/include/CarbonCore/fp.h:471: error: conflicting types for 'scalb'
/usr/local/lib/gcc/arm-apple-darwin/4.0.1/../../../../arm-apple-darwin/include/CarbonCore/fp.h:885: error: conflicting types for '__fpclassifyd'
/usr/local/lib/gcc/arm-apple-darwin/4.0.1/../../../../arm-apple-darwin/include/architecture/arm/math.h:138: error: previous declaration of '__fpclassifyd' was here
/usr/local/lib/gcc/arm-apple-darwin/4.0.1/../../../../arm-apple-darwin/include/CarbonCore/fp.h:896: error: conflicting types for '__fpclassifyf'
/usr/local/lib/gcc/arm-apple-darwin/4.0.1/../../../../arm-apple-darwin/include/architecture/arm/math.h:137: error: previous declaration of '__fpclassifyf' was here
/usr/local/lib/gcc/arm-apple-darwin/4.0.1/../../../../arm-apple-darwin/include/CarbonCore/fp.h:908: error: conflicting types for '__fpclassify'
/usr/local/lib/gcc/arm-apple-darwin/4.0.1/../../../../arm-apple-darwin/include/architecture/arm/math.h:139: error: previous declaration of '__fpclassify' was here
/usr/local/lib/gcc/arm-apple-darwin/4.0.1/../../../../arm-apple-darwin/include/CarbonCore/fp.h:1338: error: 'SIGDIGLEN' undeclared here (not in a function)
In file included from /usr/local/lib/gcc/arm-apple-darwin/4.0.1/../../../../arm-apple-darwin/include/OSServices/OSServices.h:45,
                 from /usr/local/lib/gcc/arm-apple-darwin/4.0.1/../../../../arm-apple-darwin/include/CoreServices/CoreServices.h:25,
                 from /usr/local/lib/gcc/arm-apple-darwin/4.0.1/../../../../arm-apple-darwin/include/CoreGraphics/CGEvent.h:17,
                 from /usr/local/lib/gcc/arm-apple-darwin/4.0.1/../../../../arm-apple-darwin/include/CoreGraphics/CoreGraphics.h:24,
                 from /usr/local/lib/gcc/arm-apple-darwin/4.0.1/../../../../arm-apple-darwin/include/UIKit/UIKit.h:3,
                 from hello.m:1:
/usr/local/lib/gcc/arm-apple-darwin/4.0.1/../../../../arm-apple-darwin/include/OSServices/OpenTransport.h:359: error: parse error before numeric constant
In file included from /usr/local/lib/gcc/arm-apple-darwin/4.0.1/../../../../arm-apple-darwin/include/OSServices/OSServices.h:47,
                 from /usr/local/lib/gcc/arm-apple-darwin/4.0.1/../../../../arm-apple-darwin/include/CoreServices/CoreServices.h:25,
                 from /usr/local/lib/gcc/arm-apple-darwin/4.0.1/../../../../arm-apple-darwin/include/CoreGraphics/CGEvent.h:17,
                 from /usr/local/lib/gcc/arm-apple-darwin/4.0.1/../../../../arm-apple-darwin/include/CoreGraphics/CoreGraphics.h:24,
                 from /usr/local/lib/gcc/arm-apple-darwin/4.0.1/../../../../arm-apple-darwin/include/UIKit/UIKit.h:3,
                 from hello.m:1:
/usr/local/lib/gcc/arm-apple-darwin/4.0.1/../../../../arm-apple-darwin/include/OSServices/OpenTransportProtocol.h:121: error: conflicting types for 'uid_t'
/usr/local/lib/gcc/arm-apple-darwin/4.0.1/../../../../arm-apple-darwin/include/sys/types.h:167: error: previous declaration of 'uid_t' was here
/usr/local/lib/gcc/arm-apple-darwin/4.0.1/../../../../arm-apple-darwin/include/OSServices/OpenTransportProtocol.h:122: error: conflicting types for 'gid_t'
/usr/local/lib/gcc/arm-apple-darwin/4.0.1/../../../../arm-apple-darwin/include/sys/types.h:114: error: previous declaration of 'gid_t' was here
/usr/local/lib/gcc/arm-apple-darwin/4.0.1/../../../../arm-apple-darwin/include/OSServices/OpenTransportProtocol.h:124: error: conflicting types for 'dev_t'
/usr/local/lib/gcc/arm-apple-darwin/4.0.1/../../../../arm-apple-darwin/include/sys/types.h:97: error: previous declaration of 'dev_t' was here
make: *** [hello.o] Error 1