rendered paste bodyThis file contains any messages produced by compilers while
running configure, to aid debugging if configure makes a mistake.
It was created by ossie configure 0.6.1, which was
generated by GNU Autoconf 2.59. Invocation command line was
$ ./configure
## --------- ##
## Platform. ##
## --------- ##
hostname = localhost.localdomain
uname -m = i686
uname -r = 2.6.18-1.2798.fc6
uname -s = Linux
uname -v = #1 SMP Mon Oct 16 14:54:20 EDT 2006
/usr/bin/uname -p = unknown
/bin/uname -X = unknown
/bin/arch = i686
/usr/bin/arch -k = unknown
/usr/convex/getsysinfo = unknown
hostinfo = unknown
/bin/machine = unknown
/usr/bin/oslevel = unknown
/bin/universe = unknown
PATH: /usr/kerberos/sbin
PATH: /usr/kerberos/bin
PATH: /usr/local/sbin
PATH: /usr/local/bin
PATH: /sbin
PATH: /bin
PATH: /usr/sbin
PATH: /usr/bin
PATH: /usr/X11R6/bin
PATH: /root/bin
## ----------- ##
## Core tests. ##
## ----------- ##
configure:1556: checking for a BSD-compatible install
configure:1611: result: /usr/bin/install -c
configure:1622: checking whether build environment is sane
configure:1665: result: yes
configure:1730: checking for gawk
configure:1746: found /bin/gawk
configure:1756: result: gawk
configure:1766: checking whether make sets $(MAKE)
configure:1786: result: yes
configure:2007: checking for g++
configure:2023: found /usr/bin/g++
configure:2033: result: g++
configure:2049: checking for C++ compiler version
configure:2052: g++ --version </dev/null >&5
g++ (GCC) 4.1.2 20070626 (Red Hat 4.1.2-13)
Copyright (C) 2006 Free Software Foundation, Inc.
This is free software; see the source for copying conditions. There is NO
warranty; not even for MERCHANTABILITY or FITNESS FOR A PARTICULAR PURPOSE.
configure:2055: $? = 0
configure:2057: g++ -v </dev/null >&5
Using built-in specs.
Target: i386-redhat-linux
Configured with: ../configure --prefix=/usr --mandir=/usr/share/man --infodir=/usr/share/info --enable-shared --enable-threads=posix --enable-checking=release --with-system-zlib --enable-__cxa_atexit --disable-libunwind-exceptions --enable-libgcj-multifile --enable-languages=c,c++,objc,obj-c++,java,fortran,ada --enable-java-awt=gtk --disable-dssi --enable-plugin --with-java-home=/usr/lib/jvm/java-1.4.2-gcj-1.4.2.0/jre --with-cpu=generic --host=i386-redhat-linux
Thread model: posix
gcc version 4.1.2 20070626 (Red Hat 4.1.2-13)
configure:2060: $? = 0
configure:2062: g++ -V </dev/null >&5
g++: '-V' option must have argument
configure:2065: $? = 1
configure:2088: checking for C++ compiler default output file name
configure:2091: g++ conftest.cc >&5
configure:2094: $? = 0
configure:2140: result: a.out
configure:2145: checking whether the C++ compiler works
configure:2151: ./a.out
configure:2154: $? = 0
configure:2171: result: yes
configure:2178: checking whether we are cross compiling
configure:2180: result: no
configure:2183: checking for suffix of executables
configure:2185: g++ -o conftest conftest.cc >&5
configure:2188: $? = 0
configure:2213: result:
configure:2219: checking for suffix of object files
configure:2240: g++ -c conftest.cc >&5
configure:2243: $? = 0
configure:2265: result: o
configure:2269: checking whether we are using the GNU C++ compiler
configure:2293: g++ -c conftest.cc >&5
configure:2299: $? = 0
configure:2303: test -z
|| test ! -s conftest.err
configure:2306: $? = 0
configure:2309: test -s conftest.o
configure:2312: $? = 0
configure:2325: result: yes
configure:2331: checking whether g++ accepts -g
configure:2352: g++ -c -g conftest.cc >&5
configure:2358: $? = 0
configure:2362: test -z
|| test ! -s conftest.err
configure:2365: $? = 0
configure:2368: test -s conftest.o
configure:2371: $? = 0
configure:2382: result: yes
configure:2424: g++ -c -g -O2 conftest.cc >&5
configure:2430: $? = 0
configure:2434: test -z
|| test ! -s conftest.err
configure:2437: $? = 0
configure:2440: test -s conftest.o
configure:2443: $? = 0
configure:2469: g++ -c -g -O2 conftest.cc >&5
conftest.cc: In function 'int main()':
conftest.cc:15: error: 'exit' was not declared in this scope
configure:2475: $? = 1
configure: failed program was:
| /* confdefs.h. */
|
| #define PACKAGE_NAME "ossie"
| #define PACKAGE_TARNAME "ossie"
| #define PACKAGE_VERSION "0.6.1"
| #define PACKAGE_STRING "ossie 0.6.1"
| #define PACKAGE_BUGREPORT ""
| #define PACKAGE "ossie"
| #define VERSION "0.6.1"
| /* end confdefs.h. */
|
| int
| main ()
| {
| exit (42);
| ;
| return 0;
| }
configure:2424: g++ -c -g -O2 conftest.cc >&5
configure:2430: $? = 0
configure:2434: test -z
|| test ! -s conftest.err
configure:2437: $? = 0
configure:2440: test -s conftest.o
configure:2443: $? = 0
configure:2469: g++ -c -g -O2 conftest.cc >&5
configure:2475: $? = 0
configure:2479: test -z
|| test ! -s conftest.err
configure:2482: $? = 0
configure:2485: test -s conftest.o
configure:2488: $? = 0
configure:2522: checking for style of include used by make
configure:2550: result: GNU
configure:2578: checking dependency style of g++
configure:2668: result: gcc3
configure:2698: checking for a BSD-compatible install
configure:2753: result: /usr/bin/install -c
configure:2764: checking whether make sets $(MAKE)
configure:2784: result: yes
configure:2871: checking build system type
configure:2889: result: i686-pc-linux-gnu
configure:2897: checking host system type
configure:2911: result: i686-pc-linux-gnu
configure:2965: checking for gcc
configure:2981: found /usr/bin/gcc
configure:2991: result: gcc
configure:3235: checking for C compiler version
configure:3238: gcc --version </dev/null >&5
gcc (GCC) 4.1.2 20070626 (Red Hat 4.1.2-13)
Copyright (C) 2006 Free Software Foundation, Inc.
This is free software; see the source for copying conditions. There is NO
warranty; not even for MERCHANTABILITY or FITNESS FOR A PARTICULAR PURPOSE.
configure:3241: $? = 0
configure:3243: gcc -v </dev/null >&5
Using built-in specs.
Target: i386-redhat-linux
Configured with: ../configure --prefix=/usr --mandir=/usr/share/man --infodir=/usr/share/info --enable-shared --enable-threads=posix --enable-checking=release --with-system-zlib --enable-__cxa_atexit --disable-libunwind-exceptions --enable-libgcj-multifile --enable-languages=c,c++,objc,obj-c++,java,fortran,ada --enable-java-awt=gtk --disable-dssi --enable-plugin --with-java-home=/usr/lib/jvm/java-1.4.2-gcj-1.4.2.0/jre --with-cpu=generic --host=i386-redhat-linux
Thread model: posix
gcc version 4.1.2 20070626 (Red Hat 4.1.2-13)
configure:3246: $? = 0
configure:3248: gcc -V </dev/null >&5
gcc: '-V' option must have argument
configure:3251: $? = 1
configure:3254: checking whether we are using the GNU C compiler
configure:3278: gcc -c conftest.c >&5
configure:3284: $? = 0
configure:3288: test -z
|| test ! -s conftest.err
configure:3291: $? = 0
configure:3294: test -s conftest.o
configure:3297: $? = 0
configure:3310: result: yes
configure:3316: checking whether gcc accepts -g
configure:3337: gcc -c -g conftest.c >&5
configure:3343: $? = 0
configure:3347: test -z
|| test ! -s conftest.err
configure:3350: $? = 0
configure:3353: test -s conftest.o
configure:3356: $? = 0
configure:3367: result: yes
configure:3384: checking for gcc option to accept ANSI C
configure:3454: gcc -c -g -O2 conftest.c >&5
configure:3460: $? = 0
configure:3464: test -z
|| test ! -s conftest.err
configure:3467: $? = 0
configure:3470: test -s conftest.o
configure:3473: $? = 0
configure:3491: result: none needed
configure:3509: gcc -c -g -O2 conftest.c >&5
conftest.c:2: error: expected '=', ',', ';', 'asm' or '__attribute__' before 'me'
configure:3515: $? = 1
configure: failed program was:
| #ifndef __cplusplus
| choke me
| #endif
configure:3650: checking dependency style of gcc
configure:3740: result: gcc3
configure:3757: checking for a sed that does not truncate output
configure:3813: result: /bin/sed
configure:3816: checking for egrep
configure:3826: result: grep -E
configure:3842: checking for ld used by gcc
configure:3909: result: /usr/bin/ld
configure:3918: checking if the linker (/usr/bin/ld) is GNU ld
configure:3933: result: yes
configure:3938: checking for /usr/bin/ld option to reload object files
configure:3945: result: -r
configure:3963: checking for BSD-compatible nm
configure:4012: result: /usr/bin/nm -B
configure:4016: checking whether ln -s works
configure:4020: result: yes
configure:4027: checking how to recognise dependent libraries
configure:4203: result: pass_all
configure:4440: checking how to run the C preprocessor
configure:4475: gcc -E conftest.c
configure:4481: $? = 0
configure:4513: gcc -E conftest.c
conftest.c:14:28: error: ac_nonexistent.h: No such file or directory
configure:4519: $? = 1
configure: failed program was:
| /* confdefs.h. */
|
| #define PACKAGE_NAME "ossie"
| #define PACKAGE_TARNAME "ossie"
| #define PACKAGE_VERSION "0.6.1"
| #define PACKAGE_STRING "ossie 0.6.1"
| #define PACKAGE_BUGREPORT ""
| #define PACKAGE "ossie"
| #define VERSION "0.6.1"
| #ifdef __cplusplus
| extern "C" void std::exit (int) throw (); using std::exit;
| #endif
| /* end confdefs.h. */
| #include <ac_nonexistent.h>
configure:4558: result: gcc -E
configure:4582: gcc -E conftest.c
configure:4588: $? = 0
configure:4620: gcc -E conftest.c
conftest.c:14:28: error: ac_nonexistent.h: No such file or directory
configure:4626: $? = 1
configure: failed program was:
| /* confdefs.h. */
|
| #define PACKAGE_NAME "ossie"
| #define PACKAGE_TARNAME "ossie"
| #define PACKAGE_VERSION "0.6.1"
| #define PACKAGE_STRING "ossie 0.6.1"
| #define PACKAGE_BUGREPORT ""
| #define PACKAGE "ossie"
| #define VERSION "0.6.1"
| #ifdef __cplusplus
| extern "C" void std::exit (int) throw (); using std::exit;
| #endif
| /* end confdefs.h. */
| #include <ac_nonexistent.h>
configure:4670: checking for ANSI C header files
configure:4695: gcc -c -g -O2 conftest.c >&5
configure:4701: $? = 0
configure:4705: test -z
|| test ! -s conftest.err
configure:4708: $? = 0
configure:4711: test -s conftest.o
configure:4714: $? = 0
configure:4803: gcc -o conftest -g -O2 conftest.c >&5
conftest.c: In function 'main':
conftest.c:31: warning: incompatible implicit declaration of built-in function 'exit'
configure:4806: $? = 0
configure:4808: ./conftest
configure:4811: $? = 0
configure:4826: result: yes
configure:4850: checking for sys/types.h
configure:4866: gcc -c -g -O2 conftest.c >&5
configure:4872: $? = 0
configure:4876: test -z
|| test ! -s conftest.err
configure:4879: $? = 0
configure:4882: test -s conftest.o
configure:4885: $? = 0
configure:4896: result: yes
configure:4850: checking for sys/stat.h
configure:4866: gcc -c -g -O2 conftest.c >&5
configure:4872: $? = 0
configure:4876: test -z
|| test ! -s conftest.err
configure:4879: $? = 0
configure:4882: test -s conftest.o
configure:4885: $? = 0
configure:4896: result: yes
configure:4850: checking for stdlib.h
configure:4866: gcc -c -g -O2 conftest.c >&5
configure:4872: $? = 0
configure:4876: test -z
|| test ! -s conftest.err
configure:4879: $? = 0
configure:4882: test -s conftest.o
configure:4885: $? = 0
configure:4896: result: yes
configure:4850: checking for string.h
configure:4866: gcc -c -g -O2 conftest.c >&5
configure:4872: $? = 0
configure:4876: test -z
|| test ! -s conftest.err
configure:4879: $? = 0
configure:4882: test -s conftest.o
configure:4885: $? = 0
configure:4896: result: yes
configure:4850: checking for memory.h
configure:4866: gcc -c -g -O2 conftest.c >&5
configure:4872: $? = 0
configure:4876: test -z
|| test ! -s conftest.err
configure:4879: $? = 0
configure:4882: test -s conftest.o
configure:4885: $? = 0
configure:4896: result: yes
configure:4850: checking for strings.h
configure:4866: gcc -c -g -O2 conftest.c >&5
configure:4872: $? = 0
configure:4876: test -z
|| test ! -s conftest.err
configure:4879: $? = 0
configure:4882: test -s conftest.o
configure:4885: $? = 0
configure:4896: result: yes
configure:4850: checking for inttypes.h
configure:4866: gcc -c -g -O2 conftest.c >&5
configure:4872: $? = 0
configure:4876: test -z
|| test ! -s conftest.err
configure:4879: $? = 0
configure:4882: test -s conftest.o
configure:4885: $? = 0
configure:4896: result: yes
configure:4850: checking for stdint.h
configure:4866: gcc -c -g -O2 conftest.c >&5
configure:4872: $? = 0
configure:4876: test -z
|| test ! -s conftest.err
configure:4879: $? = 0
configure:4882: test -s conftest.o
configure:4885: $? = 0
configure:4896: result: yes
configure:4850: checking for unistd.h
configure:4866: gcc -c -g -O2 conftest.c >&5
configure:4872: $? = 0
configure:4876: test -z
|| test ! -s conftest.err
configure:4879: $? = 0
configure:4882: test -s conftest.o
configure:4885: $? = 0
configure:4896: result: yes
configure:4922: checking dlfcn.h usability
configure:4934: gcc -c -g -O2 conftest.c >&5
configure:4940: $? = 0
configure:4944: test -z
|| test ! -s conftest.err
configure:4947: $? = 0
configure:4950: test -s conftest.o
configure:4953: $? = 0
configure:4963: result: yes
configure:4967: checking dlfcn.h presence
configure:4977: gcc -E conftest.c
configure:4983: $? = 0
configure:5003: result: yes
configure:5038: checking for dlfcn.h
configure:5045: result: yes
configure:5068: checking how to run the C++ preprocessor
configure:5099: g++ -E conftest.cc
configure:5105: $? = 0
configure:5137: g++ -E conftest.cc
conftest.cc:25:28: error: ac_nonexistent.h: No such file or directory
configure:5143: $? = 1
configure: failed program was:
| /* confdefs.h. */
|
| #define PACKAGE_NAME "ossie"
| #define PACKAGE_TARNAME "ossie"
| #define PACKAGE_VERSION "0.6.1"
| #define PACKAGE_STRING "ossie 0.6.1"
| #define PACKAGE_BUGREPORT ""
| #define PACKAGE "ossie"
| #define VERSION "0.6.1"
| #ifdef __cplusplus
| extern "C" void std::exit (int) throw (); using std::exit;
| #endif
| #define STDC_HEADERS 1
| #define HAVE_SYS_TYPES_H 1
| #define HAVE_SYS_STAT_H 1
| #define HAVE_STDLIB_H 1
| #define HAVE_STRING_H 1
| #define HAVE_MEMORY_H 1
| #define HAVE_STRINGS_H 1
| #define HAVE_INTTYPES_H 1
| #define HAVE_STDINT_H 1
| #define HAVE_UNISTD_H 1
| #define HAVE_DLFCN_H 1
| /* end confdefs.h. */
| #include <ac_nonexistent.h>
configure:5182: result: g++ -E
configure:5206: g++ -E conftest.cc
configure:5212: $? = 0
configure:5244: g++ -E conftest.cc
conftest.cc:25:28: error: ac_nonexistent.h: No such file or directory
configure:5250: $? = 1
configure: failed program was:
| /* confdefs.h. */
|
| #define PACKAGE_NAME "ossie"
| #define PACKAGE_TARNAME "ossie"
| #define PACKAGE_VERSION "0.6.1"
| #define PACKAGE_STRING "ossie 0.6.1"
| #define PACKAGE_BUGREPORT ""
| #define PACKAGE "ossie"
| #define VERSION "0.6.1"
| #ifdef __cplusplus
| extern "C" void std::exit (int) throw (); using std::exit;
| #endif
| #define STDC_HEADERS 1
| #define HAVE_SYS_TYPES_H 1
| #define HAVE_SYS_STAT_H 1
| #define HAVE_STDLIB_H 1
| #define HAVE_STRING_H 1
| #define HAVE_MEMORY_H 1
| #define HAVE_STRINGS_H 1
| #define HAVE_INTTYPES_H 1
| #define HAVE_STDINT_H 1
| #define HAVE_UNISTD_H 1
| #define HAVE_DLFCN_H 1
| /* end confdefs.h. */
| #include <ac_nonexistent.h>
configure:5347: checking for g77
configure:5376: result: no
configure:5347: checking for f77
configure:5376: result: no
configure:5347: checking for xlf
configure:5376: result: no
configure:5347: checking for frt
configure:5376: result: no
configure:5347: checking for pgf77
configure:5376: result: no
configure:5347: checking for fort77
configure:5376: result: no
configure:5347: checking for fl32
configure:5376: result: no
configure:5347: checking for af77
configure:5376: result: no
configure:5347: checking for f90
configure:5376: result: no
configure:5347: checking for xlf90
configure:5376: result: no
configure:5347: checking for pgf90
configure:5376: result: no
configure:5347: checking for epcf90
configure:5376: result: no
configure:5347: checking for f95
configure:5376: result: no
configure:5347: checking for fort
configure:5376: result: no
configure:5347: checking for xlf95
configure:5376: result: no
configure:5347: checking for ifc
configure:5376: result: no
configure:5347: checking for efc
configure:5376: result: no
configure:5347: checking for pgf95
configure:5376: result: no
configure:5347: checking for lf95
configure:5376: result: no
configure:5347: checking for gfortran
configure:5376: result: no
configure:5388: checking for Fortran 77 compiler version
configure:5391: --version </dev/null >&5
./configure: line 5392: --version: command not found
configure:5394: $? = 127
configure:5396: -v </dev/null >&5
./configure: line 5397: -v: command not found
configure:5399: $? = 127
configure:5401: -V </dev/null >&5
./configure: line 5402: -V: command not found
configure:5404: $? = 127
configure:5412: checking whether we are using the GNU Fortran 77 compiler
configure:5426: -c conftest.F >&5
./configure: line 5427: -c: command not found
configure:5432: $? = 127
configure: failed program was:
| program main
| #ifndef __GNUC__
| choke me
| #endif
|
| end
configure:5458: result: no
configure:5464: checking whether accepts -g
configure:5476: -c -g conftest.f >&5
./configure: line 5477: -c: command not found
configure:5482: $? = 127
configure: failed program was:
| program main
|
| end
configure:5507: result: no
configure:5537: checking the maximum length of command line arguments
configure:5646: result: 32768
configure:5657: checking command to parse /usr/bin/nm -B output from gcc object
configure:5762: gcc -c -g -O2 conftest.c >&5
configure:5765: $? = 0
configure:5769: /usr/bin/nm -B conftest.o \| sed -n -e 's/^.*[ ]\([ABCDGIRSTW][ABCDGIRSTW]*\)[ ][ ]*\([_A-Za-z][_A-Za-z0-9]*\)$/\1 \2 \2/p' \> conftest.nm
configure:5772: $? = 0
configure:5824: gcc -o conftest -g -O2 conftest.c conftstm.o >&5
configure:5827: $? = 0
configure:5865: result: ok
configure:5869: checking for objdir
configure:5884: result: .libs
configure:5974: checking for ar
configure:5990: found /usr/bin/ar
configure:6001: result: ar
configure:6054: checking for ranlib
configure:6070: found /usr/bin/ranlib
configure:6081: result: ranlib
configure:6134: checking for strip
configure:6150: found /usr/bin/strip
configure:6161: result: strip
configure:6433: checking if gcc supports -fno-rtti -fno-exceptions
configure:6451: gcc -c -g -O2 -fno-rtti -fno-exceptions conftest.c >&5
cc1: warning: command line option "-fno-rtti" is valid for C++/ObjC++ but not for C
configure:6455: $? = 0
configure:6468: result: no
configure:6483: checking for gcc option to produce PIC
configure:6693: result: -fPIC
configure:6701: checking if gcc PIC flag -fPIC works
configure:6719: gcc -c -g -O2 -fPIC -DPIC conftest.c >&5
configure:6723: $? = 0
configure:6736: result: yes
configure:6764: checking if gcc static flag -static works
configure:6792: result: yes
configure:6802: checking if gcc supports -c -o file.o
configure:6823: gcc -c -g -O2 -o out/conftest2.o conftest.c >&5
configure:6827: $? = 0
configure:6849: result: yes
configure:6875: checking whether the gcc linker (/usr/bin/ld) supports shared libraries
configure:7833: result: yes
configure:7854: checking whether -lc should be explicitly linked in
configure:7859: gcc -c -g -O2 conftest.c >&5
configure:7862: $? = 0
configure:7877: gcc -shared conftest.o -v -Wl,-soname -Wl,conftest -o conftest 2\>\&1 \| grep -lc \>/dev/null 2\>\&1
configure:7880: $? = 0
configure:7892: result: no
configure:7900: checking dynamic linker characteristics
configure:8509: result: GNU/Linux ld.so
configure:8518: checking how to hardcode library paths into programs
configure:8543: result: immediate
configure:8557: checking whether stripping libraries is possible
configure:8562: result: yes
configure:9396: checking if libtool supports shared libraries
configure:9398: result: yes
configure:9401: checking whether to build shared libraries
configure:9422: result: yes
configure:9425: checking whether to build static libraries
configure:9429: result: yes
configure:9521: creating libtool
configure:10112: checking for ld used by g++
configure:10179: result: /usr/bin/ld
configure:10188: checking if the linker (/usr/bin/ld) is GNU ld
configure:10203: result: yes
configure:10254: checking whether the g++ linker (/usr/bin/ld) supports shared libraries
configure:11192: result: yes
configure:11210: g++ -c -g -O2 conftest.cpp >&5
configure:11213: $? = 0
configure:11332: checking for g++ option to produce PIC
configure:11606: result: -fPIC
configure:11614: checking if g++ PIC flag -fPIC works
configure:11632: g++ -c -g -O2 -fPIC -DPIC conftest.cpp >&5
configure:11636: $? = 0
configure:11649: result: yes
configure:11677: checking if g++ static flag -static works
configure:11705: result: yes
configure:11715: checking if g++ supports -c -o file.o
configure:11736: g++ -c -g -O2 -o out/conftest2.o conftest.cpp >&5
configure:11740: $? = 0
configure:11762: result: yes
configure:11788: checking whether the g++ linker (/usr/bin/ld) supports shared libraries
configure:11813: result: yes
configure:11880: checking dynamic linker characteristics
configure:12489: result: GNU/Linux ld.so
configure:12498: checking how to hardcode library paths into programs
configure:12523: result: immediate
configure:18745: checking for Xerces-C
configure:18778: g++ -o conftest -g -O2 conftest.cc -lxerces-c >&5
configure:18784: $? = 0
configure:18788: test -z
|| test ! -s conftest.err
configure:18791: $? = 0
configure:18794: test -s conftest
configure:18797: $? = 0
configure:18799: result: yes
configure:18824: checking for libraries containing socket functions
configure:18857: gcc -o conftest -g -O2 conftest.c -lxerces-c >&5
configure:18863: $? = 0
configure:18867: test -z
|| test ! -s conftest.err
configure:18870: $? = 0
configure:18873: test -s conftest
configure:18876: $? = 0
configure:19011: result: -lc
configure:19183: checking for the pthreads library -lpthreads
configure:19221: gcc -o conftest -g -O2 conftest.c -lpthreads -lxerces-c >&5
/usr/bin/ld: cannot find -lpthreads
collect2: ld returned 1 exit status
configure:19227: $? = 1
configure: failed program was:
| /* confdefs.h. */
|
| #define PACKAGE_NAME "ossie"
| #define PACKAGE_TARNAME "ossie"
| #define PACKAGE_VERSION "0.6.1"
| #define PACKAGE_STRING "ossie 0.6.1"
| #define PACKAGE_BUGREPORT ""
| #define PACKAGE "ossie"
| #define VERSION "0.6.1"
| #ifdef __cplusplus
| extern "C" void std::exit (int) throw (); using std::exit;
| #endif
| #define STDC_HEADERS 1
| #define HAVE_SYS_TYPES_H 1
| #define HAVE_SYS_STAT_H 1
| #define HAVE_STDLIB_H 1
| #define HAVE_STRING_H 1
| #define HAVE_MEMORY_H 1
| #define HAVE_STRINGS_H 1
| #define HAVE_INTTYPES_H 1
| #define HAVE_STDINT_H 1
| #define HAVE_UNISTD_H 1
| #define HAVE_DLFCN_H 1
| /* end confdefs.h. */
| #include <pthread.h>
| int
| main ()
| {
| pthread_t th; pthread_join(th, 0);
| pthread_attr_init(0); pthread_cleanup_push(0, 0);
| pthread_create(0,0,0,0); pthread_cleanup_pop(0);
| ;
| return 0;
| }
configure:19254: result: no
configure:19172: checking whether pthreads work without any flags
configure:19221: gcc -o conftest -g -O2 conftest.c -lxerces-c >&5
configure:19227: $? = 0
configure:19231: test -z
|| test ! -s conftest.err
configure:19234: $? = 0
configure:19237: test -s conftest
configure:19240: $? = 0
configure:19254: result: yes
configure:19274: checking for joinable pthread attribute
configure:19292: gcc -o conftest -g -O2 conftest.c -lxerces-c >&5
configure:19298: $? = 0
configure:19302: test -z
|| test ! -s conftest.err
configure:19305: $? = 0
configure:19308: test -s conftest
configure:19311: $? = 0
configure:19377: result: PTHREAD_CREATE_JOINABLE
configure:19384: checking if more special flags are required for pthreads
configure:19391: result: no
configure:19403: checking for cc_r
configure:19430: result: gcc
configure:19589: checking for omniORB4
configure:19678: g++ -E -I/usr/local/include conftest.cc
configure:19684: $? = 0
configure:19823: g++ -o conftest -g -O2 -I/usr/local/include -L/usr/local/lib conftest.cc -lxerces-c -lomniORB4 -lomniDynamic4 -lomnithread >&5
configure:19829: $? = 0
configure:19833: test -z
|| test ! -s conftest.err
configure:19836: $? = 0
configure:19839: test -s conftest
configure:19842: $? = 0
configure:19928: result: /usr/local/include
configure:19952: checking for omniidl
configure:20012: result: /usr/local/bin/omniidl
configure:20018: /usr/local/bin/omniidl -bcxx -Wbh=.hh conftest.idl
configure:20021: $? = 0
configure:20475: checking for sys/wait.h that is POSIX.1 compatible
configure:20506: gcc -c -g -O2 -I/usr/local/include conftest.c >&5
configure:20512: $? = 0
configure:20516: test -z
|| test ! -s conftest.err
configure:20519: $? = 0
configure:20522: test -s conftest.o
configure:20525: $? = 0
configure:20536: result: yes
configure:20560: checking time.h usability
configure:20572: gcc -c -g -O2 -I/usr/local/include conftest.c >&5
configure:20578: $? = 0
configure:20582: test -z
|| test ! -s conftest.err
configure:20585: $? = 0
configure:20588: test -s conftest.o
configure:20591: $? = 0
configure:20601: result: yes
configure:20605: checking time.h presence
configure:20615: gcc -E -I/usr/local/include conftest.c
configure:20621: $? = 0
configure:20641: result: yes
configure:20676: checking for time.h
configure:20683: result: yes
configure:20704: checking for dirent.h that defines DIR
configure:20728: gcc -c -g -O2 -I/usr/local/include conftest.c >&5
configure:20734: $? = 0
configure:20738: test -z
|| test ! -s conftest.err
configure:20741: $? = 0
configure:20744: test -s conftest.o
configure:20747: $? = 0
configure:20758: result: yes
configure:20771: checking for library containing opendir
configure:20801: gcc -o conftest -g -O2 -I/usr/local/include -L/usr/local/lib conftest.c -lxerces-c -lomniORB4 -lomniDynamic4 -lomnithread >&5
configure:20807: $? = 0
configure:20811: test -z
|| test ! -s conftest.err
configure:20814: $? = 0
configure:20817: test -s conftest
configure:20820: $? = 0
configure:20890: result: none required
configure:21027: checking for pid_t
configure:21051: gcc -c -g -O2 -I/usr/local/include conftest.c >&5
configure:21057: $? = 0
configure:21061: test -z
|| test ! -s conftest.err
configure:21064: $? = 0
configure:21067: test -s conftest.o
configure:21070: $? = 0
configure:21081: result: yes
configure:21099: checking for unistd.h
configure:21104: result: yes
configure:21108: checking vfork.h usability
configure:21120: gcc -c -g -O2 -I/usr/local/include conftest.c >&5
conftest.c:68:19: error: vfork.h: No such file or directory
configure:21126: $? = 1
configure: failed program was:
| /* confdefs.h. */
|
| #define PACKAGE_NAME "ossie"
| #define PACKAGE_TARNAME "ossie"
| #define PACKAGE_VERSION "0.6.1"
| #define PACKAGE_STRING "ossie 0.6.1"
| #define PACKAGE_BUGREPORT ""
| #define PACKAGE "ossie"
| #define VERSION "0.6.1"
| #ifdef __cplusplus
| extern "C" void std::exit (int) throw (); using std::exit;
| #endif
| #define STDC_HEADERS 1
| #define HAVE_SYS_TYPES_H 1
| #define HAVE_SYS_STAT_H 1
| #define HAVE_STDLIB_H 1
| #define HAVE_STRING_H 1
| #define HAVE_MEMORY_H 1
| #define HAVE_STRINGS_H 1
| #define HAVE_INTTYPES_H 1
| #define HAVE_STDINT_H 1
| #define HAVE_UNISTD_H 1
| #define HAVE_DLFCN_H 1
| #define HAVE_PTHREAD 1
| #define __linux__ 1
| #define __OSVERSION__ 2
| #define __x86__ 1
| #define HAVE_OMNIORB4 1
| #define HAVE_SYS_WAIT_H 1
| #define HAVE_TIME_H 1
| #define HAVE_DIRENT_H 1
| #define HAVE_UNISTD_H 1
| /* end confdefs.h. */
| #include <stdio.h>
| #if HAVE_SYS_TYPES_H
| # include <sys/types.h>
| #endif
| #if HAVE_SYS_STAT_H
| # include <sys/stat.h>
| #endif
| #if STDC_HEADERS
| # include <stdlib.h>
| # include <stddef.h>
| #else
| # if HAVE_STDLIB_H
| # include <stdlib.h>
| # endif
| #endif
| #if HAVE_STRING_H
| # if !STDC_HEADERS && HAVE_MEMORY_H
| # include <memory.h>
| # endif
| # include <string.h>
| #endif
| #if HAVE_STRINGS_H
| # include <strings.h>
| #endif
| #if HAVE_INTTYPES_H
| # include <inttypes.h>
| #else
| # if HAVE_STDINT_H
| # include <stdint.h>
| # endif
| #endif
| #if HAVE_UNISTD_H
| # include <unistd.h>
| #endif
| #include <vfork.h>
configure:21149: result: no
configure:21153: checking vfork.h presence
configure:21163: gcc -E -I/usr/local/include conftest.c
conftest.c:34:19: error: vfork.h: No such file or directory
configure:21169: $? = 1
configure: failed program was:
| /* confdefs.h. */
|
| #define PACKAGE_NAME "ossie"
| #define PACKAGE_TARNAME "ossie"
| #define PACKAGE_VERSION "0.6.1"
| #define PACKAGE_STRING "ossie 0.6.1"
| #define PACKAGE_BUGREPORT ""
| #define PACKAGE "ossie"
| #define VERSION "0.6.1"
| #ifdef __cplusplus
| extern "C" void std::exit (int) throw (); using std::exit;
| #endif
| #define STDC_HEADERS 1
| #define HAVE_SYS_TYPES_H 1
| #define HAVE_SYS_STAT_H 1
| #define HAVE_STDLIB_H 1
| #define HAVE_STRING_H 1
| #define HAVE_MEMORY_H 1
| #define HAVE_STRINGS_H 1
| #define HAVE_INTTYPES_H 1
| #define HAVE_STDINT_H 1
| #define HAVE_UNISTD_H 1
| #define HAVE_DLFCN_H 1
| #define HAVE_PTHREAD 1
| #define __linux__ 1
| #define __OSVERSION__ 2
| #define __x86__ 1
| #define HAVE_OMNIORB4 1
| #define HAVE_SYS_WAIT_H 1
| #define HAVE_TIME_H 1
| #define HAVE_DIRENT_H 1
| #define HAVE_UNISTD_H 1
| /* end confdefs.h. */
| #include <vfork.h>
configure:21189: result: no
configure:21224: checking for vfork.h
configure:21231: result: no
configure:21249: checking for fork
configure:21306: gcc -o conftest -g -O2 -I/usr/local/include -L/usr/local/lib conftest.c -lxerces-c -lomniORB4 -lomniDynamic4 -lomnithread >&5
conftest.c:58: warning: conflicting types for built-in function 'fork'
configure:21312: $? = 0
configure:21316: test -z
|| test ! -s conftest.err
configure:21319: $? = 0
configure:21322: test -s conftest
configure:21325: $? = 0
configure:21337: result: yes
configure:21249: checking for vfork
configure:21306: gcc -o conftest -g -O2 -I/usr/local/include -L/usr/local/lib conftest.c -lxerces-c -lomniORB4 -lomniDynamic4 -lomnithread >&5
configure:21312: $? = 0
configure:21316: test -z
|| test ! -s conftest.err
configure:21319: $? = 0
configure:21322: test -s conftest
configure:21325: $? = 0
configure:21337: result: yes
configure:21348: checking for working fork
configure:21371: gcc -o conftest -g -O2 -I/usr/local/include -L/usr/local/lib conftest.c -lxerces-c -lomniORB4 -lomniDynamic4 -lomnithread >&5
conftest.c: In function 'main':
conftest.c:10: warning: incompatible implicit declaration of built-in function 'exit'
configure:21374: $? = 0
configure:21376: ./conftest
configure:21379: $? = 0
configure:21393: result: yes
configure:21414: checking for working vfork
configure:21547: result: yes
configure:21728: creating ./config.status
## ---------------------- ##
## Running config.status. ##
## ---------------------- ##
This file was extended by ossie config.status 0.6.1, which was
generated by GNU Autoconf 2.59. Invocation command line was
CONFIG_FILES =
CONFIG_HEADERS =
CONFIG_LINKS =
CONFIG_COMMANDS =
$ ./config.status
on localhost.localdomain
config.status:725: creating Makefile
config.status:725: creating ossie.pc
config.status:725: creating idl/Makefile
config.status:725: creating parser/Makefile
config.status:725: creating framework/Makefile
config.status:725: creating include/Makefile
config.status:725: creating include/ossie/Makefile
config.status:908: executing depfiles commands
## ---------------- ##
## Cache variables. ##
## ---------------- ##
ac_cv_build=i686-pc-linux-gnu
ac_cv_build_alias=i686-pc-linux-gnu
ac_cv_c_compiler_gnu=yes
ac_cv_corba_omniorb4=/usr/local/include
ac_cv_cxx_compiler_gnu=yes
ac_cv_env_CC_set=
ac_cv_env_CC_value=
ac_cv_env_CFLAGS_set=
ac_cv_env_CFLAGS_value=
ac_cv_env_CPPFLAGS_set=
ac_cv_env_CPPFLAGS_value=
ac_cv_env_CPP_set=
ac_cv_env_CPP_value=
ac_cv_env_CXXCPP_set=
ac_cv_env_CXXCPP_value=
ac_cv_env_CXXFLAGS_set=
ac_cv_env_CXXFLAGS_value=
ac_cv_env_CXX_set=
ac_cv_env_CXX_value=
ac_cv_env_F77_set=
ac_cv_env_F77_value=
ac_cv_env_FFLAGS_set=
ac_cv_env_FFLAGS_value=
ac_cv_env_LDFLAGS_set=
ac_cv_env_LDFLAGS_value=
ac_cv_env_build_alias_set=
ac_cv_env_build_alias_value=
ac_cv_env_host_alias_set=
ac_cv_env_host_alias_value=
ac_cv_env_target_alias_set=
ac_cv_env_target_alias_value=
ac_cv_exeext=
ac_cv_f77_compiler_gnu=no
ac_cv_func_fork=yes
ac_cv_func_fork_works=yes
ac_cv_func_vfork=yes
ac_cv_func_vfork_works=yes
ac_cv_header_dirent_dirent_h=yes
ac_cv_header_dlfcn_h=yes
ac_cv_header_inttypes_h=yes
ac_cv_header_memory_h=yes
ac_cv_header_stdc=yes
ac_cv_header_stdint_h=yes
ac_cv_header_stdlib_h=yes
ac_cv_header_string_h=yes
ac_cv_header_strings_h=yes
ac_cv_header_sys_stat_h=yes
ac_cv_header_sys_types_h=yes
ac_cv_header_sys_wait_h=yes
ac_cv_header_time_h=yes
ac_cv_header_unistd_h=yes
ac_cv_header_vfork_h=no
ac_cv_host=i686-pc-linux-gnu
ac_cv_host_alias=i686-pc-linux-gnu
ac_cv_objext=o
ac_cv_path_IDL=/usr/local/bin/omniidl
ac_cv_path_install='/usr/bin/install -c'
ac_cv_prog_AWK=gawk
ac_cv_prog_CPP='gcc -E'
ac_cv_prog_CXXCPP='g++ -E'
ac_cv_prog_PTHREAD_CC=gcc
ac_cv_prog_ac_ct_AR=ar
ac_cv_prog_ac_ct_CC=gcc
ac_cv_prog_ac_ct_CXX=g++
ac_cv_prog_ac_ct_RANLIB=ranlib
ac_cv_prog_ac_ct_STRIP=strip
ac_cv_prog_cc_g=yes
ac_cv_prog_cc_stdc=
ac_cv_prog_cxx_g=yes
ac_cv_prog_egrep='grep -E'
ac_cv_prog_f77_g=no
ac_cv_prog_make_make_set=yes
ac_cv_search_opendir='none required'
ac_cv_socket_libs=-lc
ac_cv_type_pid_t=yes
am_cv_CC_dependencies_compiler_type=gcc3
am_cv_CXX_dependencies_compiler_type=gcc3
lt_cv_deplibs_check_method=pass_all
lt_cv_file_magic_cmd='$MAGIC_CMD'
lt_cv_file_magic_test_file=
lt_cv_ld_reload_flag=-r
lt_cv_objdir=.libs
lt_cv_path_LD=/usr/bin/ld
lt_cv_path_LDCXX=/usr/bin/ld
lt_cv_path_NM='/usr/bin/nm -B'
lt_cv_path_SED=/bin/sed
lt_cv_prog_compiler_c_o=yes
lt_cv_prog_compiler_c_o_CXX=yes
lt_cv_prog_compiler_rtti_exceptions=no
lt_cv_prog_gnu_ld=yes
lt_cv_prog_gnu_ldcxx=yes
lt_cv_sys_global_symbol_pipe='sed -n -e '\''s/^.*[ ]\([ABCDGIRSTW][ABCDGIRSTW]*\)[ ][ ]*\([_A-Za-z][_A-Za-z0-9]*\)$/\1 \2 \2/p'\'''
lt_cv_sys_global_symbol_to_c_name_address='sed -n -e '\''s/^: \([^ ]*\) $/ {\"\1\", (lt_ptr) 0},/p'\'' -e '\''s/^[BCDEGRST] \([^ ]*\) \([^ ]*\)$/ {"\2", (lt_ptr) \&\2},/p'\'''
lt_cv_sys_global_symbol_to_cdecl='sed -n -e '\''s/^. .* \(.*\)$/extern int \1;/p'\'''
lt_cv_sys_max_cmd_len=32768
lt_lt_cv_prog_compiler_c_o='"yes"'
lt_lt_cv_prog_compiler_c_o_CXX='"yes"'
lt_lt_cv_sys_global_symbol_pipe='"sed -n -e '\''s/^.*[ ]\\([ABCDGIRSTW][ABCDGIRSTW]*\\)[ ][ ]*\\([_A-Za-z][_A-Za-z0-9]*\\)\$/\\1 \\2 \\2/p'\''"'
lt_lt_cv_sys_global_symbol_to_c_name_address='"sed -n -e '\''s/^: \\([^ ]*\\) \$/ {\\\"\\1\\\", (lt_ptr) 0},/p'\'' -e '\''s/^[BCDEGRST] \\([^ ]*\\) \\([^ ]*\\)\$/ {\"\\2\", (lt_ptr) \\&\\2},/p'\''"'
lt_lt_cv_sys_global_symbol_to_cdecl='"sed -n -e '\''s/^. .* \\(.*\\)\$/extern int \\1;/p'\''"'
## ----------------- ##
## Output variables. ##
## ----------------- ##
ACLOCAL='${SHELL} /home/ossie/src/cf/ossie-0.6.1/missing --run aclocal-1.9'
AMDEPBACKSLASH='\'
AMDEP_FALSE='#'
AMDEP_TRUE=''
AMTAR='${SHELL} /home/ossie/src/cf/ossie-0.6.1/missing --run tar'
AR='ar'
AUTOCONF='${SHELL} /home/ossie/src/cf/ossie-0.6.1/missing --run autoconf'
AUTOHEADER='${SHELL} /home/ossie/src/cf/ossie-0.6.1/missing --run autoheader'
AUTOMAKE='${SHELL} /home/ossie/src/cf/ossie-0.6.1/missing --run automake-1.9'
AWK='gawk'
CC='gcc'
CCDEPMODE='depmode=gcc3'
CFLAGS='-g -O2'
CORBA_ORB='omniORB4'
CPP='gcc -E'
CPPFLAGS=' -I/usr/local/include'
CXX='g++'
CXXCPP='g++ -E'
CXXDEPMODE='depmode=gcc3'
CXXFLAGS='-g -O2'
CYGPATH_W='echo'
DEFS='-DPACKAGE_NAME=\"ossie\" -DPACKAGE_TARNAME=\"ossie\" -DPACKAGE_VERSION=\"0.6.1\" -DPACKAGE_STRING=\"ossie\ 0.6.1\" -DPACKAGE_BUGREPORT=\"\" -DPACKAGE=\"ossie\" -DVERSION=\"0.6.1\" -DSTDC_HEADERS=1 -DHAVE_SYS_TYPES_H=1 -DHAVE_SYS_STAT_H=1 -DHAVE_STDLIB_H=1 -DHAVE_STRING_H=1 -DHAVE_MEMORY_H=1 -DHAVE_STRINGS_H=1 -DHAVE_INTTYPES_H=1 -DHAVE_STDINT_H=1 -DHAVE_UNISTD_H=1 -DHAVE_DLFCN_H=1 -DHAVE_PTHREAD=1 -D__linux__=1 -D__OSVERSION__=2 -D__x86__=1 -DHAVE_OMNIORB4=1 -DHAVE_SYS_WAIT_H=1 -DHAVE_TIME_H=1 -DHAVE_DIRENT_H=1 -DHAVE_UNISTD_H=1 -DHAVE_FORK=1 -DHAVE_VFORK=1 -DHAVE_WORKING_VFORK=1 -DHAVE_WORKING_FORK=1 '
DEPDIR='.deps'
ECHO='echo'
ECHO_C=''
ECHO_N='-n'
ECHO_T=''
EGREP='grep -E'
ETR_SOCKET_LIBS=''
EXEEXT=''
F77=''
FFLAGS=''
IDL='/usr/local/bin/omniidl'
IDL_CPPFLAGS=''
INSTALL_DATA='${INSTALL} -m 644'
INSTALL_PROGRAM='${INSTALL}'
INSTALL_SCRIPT='${INSTALL}'
INSTALL_STRIP_PROGRAM='${SHELL} $(install_sh) -c -s'
LDFLAGS=' -L/usr/local/lib'
LIBOBJS=''
LIBS='-lxerces-c -lomniORB4 -lomniDynamic4 -lomnithread'
LIBTOOL='$(SHELL) $(top_builddir)/libtool'
LN_S='ln -s'
LTLIBOBJS=''
MAKEINFO='${SHELL} /home/ossie/src/cf/ossie-0.6.1/missing --run makeinfo'
OBJEXT='o'
OSVERSION='2'
PACKAGE='ossie'
PACKAGE_BUGREPORT=''
PACKAGE_NAME='ossie'
PACKAGE_STRING='ossie 0.6.1'
PACKAGE_TARNAME='ossie'
PACKAGE_VERSION='0.6.1'
PATH_SEPARATOR=':'
PLATFORM_DEFINITION='__linux__'
PLATFORM_NAME='Linux'
PROCESSOR_DEFINITION='__x86__'
PROCESSOR_NAME='x86Processor'
PTHREAD_CC='gcc'
PTHREAD_CFLAGS=''
PTHREAD_LIBS=''
RANLIB='ranlib'
SED='/bin/sed'
SET_MAKE=''
SHELL='/bin/sh'
STRIP='strip'
VERSION='0.6.1'
ac_ct_AR='ar'
ac_ct_CC='gcc'
ac_ct_CXX='g++'
ac_ct_F77=''
ac_ct_RANLIB='ranlib'
ac_ct_STRIP='strip'
am__fastdepCC_FALSE='#'
am__fastdepCC_TRUE=''
am__fastdepCXX_FALSE='#'
am__fastdepCXX_TRUE=''
am__include='include'
am__leading_dot='.'
am__quote=''
am__tar='${AMTAR} chof - "$$tardir"'
am__untar='${AMTAR} xf -'
bindir='${exec_prefix}/bin'
build='i686-pc-linux-gnu'
build_alias=''
build_cpu='i686'
build_os='linux-gnu'
build_vendor='pc'
datadir='${prefix}/share'
exec_prefix='${prefix}'
host='i686-pc-linux-gnu'
host_alias=''
host_cpu='i686'
host_os='linux-gnu'
host_vendor='pc'
includedir='${prefix}/include'
infodir='${prefix}/info'
install_sh='/home/ossie/src/cf/ossie-0.6.1/install-sh'
libdir='${exec_prefix}/lib'
libexecdir='${exec_prefix}/libexec'
localstatedir='${prefix}/var'
mandir='${prefix}/man'
mkdir_p='mkdir -p --'
oldincludedir='/usr/include'
prefix='/usr/local'
program_transform_name='s,x,x,'
sbindir='${exec_prefix}/sbin'
sharedstatedir='${prefix}/com'
sysconfdir='${prefix}/etc'
target_alias=''
## ----------- ##
## confdefs.h. ##
## ----------- ##
#define HAVE_DIRENT_H 1
#define HAVE_DLFCN_H 1
#define HAVE_FORK 1
#define HAVE_INTTYPES_H 1
#define HAVE_MEMORY_H 1
#define HAVE_OMNIORB4 1
#define HAVE_PTHREAD 1
#define HAVE_STDINT_H 1
#define HAVE_STDLIB_H 1
#define HAVE_STRINGS_H 1
#define HAVE_STRING_H 1
#define HAVE_SYS_STAT_H 1
#define HAVE_SYS_TYPES_H 1
#define HAVE_SYS_WAIT_H 1
#define HAVE_TIME_H 1
#define HAVE_UNISTD_H 1
#define HAVE_UNISTD_H 1
#define HAVE_VFORK 1
#define HAVE_WORKING_FORK 1
#define HAVE_WORKING_VFORK 1
#define PACKAGE "ossie"
#define PACKAGE_BUGREPORT ""
#define PACKAGE_NAME "ossie"
#define PACKAGE_STRING "ossie 0.6.1"
#define PACKAGE_TARNAME "ossie"
#define PACKAGE_VERSION "0.6.1"
#define STDC_HEADERS 1
#define VERSION "0.6.1"
#define __OSVERSION__ 2
#define __linux__ 1
#define __x86__ 1
#endif
#ifdef __cplusplus
extern "C" void std::exit (int) throw (); using std::exit;
configure: exit 0