All pastes #743198 Raw Edit

Mine

public text v1 · immutable
·published 2007-10-20 06:10 UTC
rendered paste body
kde-devel@darkstar:~/plasma$ cmakekde
-- Found Qt-Version 4.3.2
-- Found X11: /usr/lib/libX11.so
-- Found KDE 4.0 include dir: /home/kde-devel/kde/include
-- Found KDE 4 library dir: /home/kde-devel/kde/lib
-- Found KDE4 kconfig_compiler preprocessor: /home/kde-devel/kde/bin/kconfig_compiler
-- Found KDE4 automoc: /home/kde-devel/kde/bin/kde4automoc
-- libplasma supports OpenGL applets
-- Found KDE PIM libraries
-- Configuring done
-- Generating done
-- Build files have been written to: /home/kde-devel/plasma
/usr/local/bin/cmake -H/home/kde-devel/plasma -B/home/kde-devel/plasma --check-build-system CMakeFiles/Makefile.cmake 0
/usr/local/bin/cmake -E cmake_progress_start /home/kde-devel/plasma/CMakeFiles 59
make -f CMakeFiles/Makefile2 all
make[1]: Entering directory `/home/kde-devel/plasma'
make -f applets/bluemarble/CMakeFiles/plasma_applet_bluemarble.dir/build.make applets/bluemarble/CMakeFiles/plasma_applet_bluemarble.dir/depend
make -f applets/ebn/CMakeFiles/plasma_applet_ebn.dir/build.make applets/ebn/CMakeFiles/plasma_applet_ebn.dir/depend
make[2]: Entering directory `/home/kde-devel/plasma'
make[2]: Nothing to be done for `applets/bluemarble/CMakeFiles/plasma_applet_bluemarble.dir/depend'.
make[2]: Leaving directory `/home/kde-devel/plasma'
make -f applets/bluemarble/CMakeFiles/plasma_applet_bluemarble.dir/build.make applets/bluemarble/CMakeFiles/plasma_applet_bluemarble.dir/build
make[2]: Entering directory `/home/kde-devel/plasma'
make[2]: Nothing to be done for `applets/ebn/CMakeFiles/plasma_applet_ebn.dir/depend'.
make[2]: Leaving directory `/home/kde-devel/plasma'
make -f applets/ebn/CMakeFiles/plasma_applet_ebn.dir/build.make applets/ebn/CMakeFiles/plasma_applet_ebn.dir/build
make[2]: Entering directory `/home/kde-devel/plasma'
make[2]: Nothing to be done for `applets/bluemarble/CMakeFiles/plasma_applet_bluemarble.dir/build'.
make[2]: Leaving directory `/home/kde-devel/plasma'
/usr/local/bin/cmake -E cmake_progress_report /home/kde-devel/plasma/CMakeFiles  1 2 3 4 5
[  8%] make[2]: Entering directory `/home/kde-devel/plasma'
make[2]: Nothing to be done for `applets/ebn/CMakeFiles/plasma_applet_ebn.dir/build'.
make[2]: Leaving directory `/home/kde-devel/plasma'
/usr/local/bin/cmake -E cmake_progress_report /home/kde-devel/plasma/CMakeFiles  6 7 8
[ 13%] Built target plasma_applet_bluemarble
make -f applets/dict/CMakeFiles/plasma_applet_dict.dir/build.make applets/dict/CMakeFiles/plasma_applet_dict.dir/depend
Built target plasma_applet_ebn
make -f applets/fileWatcher/CMakeFiles/plasma_applet_fileWatcher.dir/build.make applets/fileWatcher/CMakeFiles/plasma_applet_fileWatcher.dir/depend
make[2]: Entering directory `/home/kde-devel/plasma'
make[2]: Nothing to be done for `applets/fileWatcher/CMakeFiles/plasma_applet_fileWatcher.dir/depend'.
make[2]: Leaving directory `/home/kde-devel/plasma'
make -f applets/fileWatcher/CMakeFiles/plasma_applet_fileWatcher.dir/build.make applets/fileWatcher/CMakeFiles/plasma_applet_fileWatcher.dir/build
make[2]: Entering directory `/home/kde-devel/plasma'
make[2]: Nothing to be done for `applets/dict/CMakeFiles/plasma_applet_dict.dir/depend'.
make[2]: Leaving directory `/home/kde-devel/plasma'
make -f applets/dict/CMakeFiles/plasma_applet_dict.dir/build.make applets/dict/CMakeFiles/plasma_applet_dict.dir/build
make[2]: Entering directory `/home/kde-devel/plasma'
make[2]: Nothing to be done for `applets/fileWatcher/CMakeFiles/plasma_applet_fileWatcher.dir/build'.
make[2]: Leaving directory `/home/kde-devel/plasma'
/usr/local/bin/cmake -E cmake_progress_report /home/kde-devel/plasma/CMakeFiles  14 15 16 17 18
[ 22%] Built target plasma_applet_fileWatcher
make -f applets/frame/CMakeFiles/plasma_applet_frame.dir/build.make applets/frame/CMakeFiles/plasma_applet_frame.dir/depend
make[2]: Entering directory `/home/kde-devel/plasma'
make[2]: Nothing to be done for `applets/frame/CMakeFiles/plasma_applet_frame.dir/depend'.
make[2]: Leaving directory `/home/kde-devel/plasma'
make -f applets/frame/CMakeFiles/plasma_applet_frame.dir/build.make applets/frame/CMakeFiles/plasma_applet_frame.dir/build
make[2]: Entering directory `/home/kde-devel/plasma'
make[2]: Nothing to be done for `applets/dict/CMakeFiles/plasma_applet_dict.dir/build'.
make[2]: Leaving directory `/home/kde-devel/plasma'
/usr/local/bin/cmake -E cmake_progress_report /home/kde-devel/plasma/CMakeFiles  9 10 11 12 13
[ 30%] make[2]: Entering directory `/home/kde-devel/plasma'
make[2]: Nothing to be done for `applets/frame/CMakeFiles/plasma_applet_frame.dir/build'.
make[2]: Leaving directory `/home/kde-devel/plasma'
/usr/local/bin/cmake -E cmake_progress_report /home/kde-devel/plasma/CMakeFiles  19 20 21 22
Built target plasma_applet_dict
make -f applets/kolourpicker/CMakeFiles/plasma_applet_kolourpicker.dir/build.make applets/kolourpicker/CMakeFiles/plasma_applet_kolourpicker.dir/depend
make[2]: Entering directory `/home/kde-devel/plasma'
make[2]: Nothing to be done for `applets/kolourpicker/CMakeFiles/plasma_applet_kolourpicker.dir/depend'.
make[2]: Leaving directory `/home/kde-devel/plasma'
make -f applets/kolourpicker/CMakeFiles/plasma_applet_kolourpicker.dir/build.make applets/kolourpicker/CMakeFiles/plasma_applet_kolourpicker.dir/build
[ 37%] Built target plasma_applet_frame
make -f applets/lancelot/CMakeFiles/plasma_applet_lancelot.dir/build.make applets/lancelot/CMakeFiles/plasma_applet_lancelot.dir/depend
make[2]: Entering directory `/home/kde-devel/plasma'
make[2]: Nothing to be done for `applets/kolourpicker/CMakeFiles/plasma_applet_kolourpicker.dir/build'.
make[2]: Leaving directory `/home/kde-devel/plasma'
/usr/local/bin/cmake -E cmake_progress_report /home/kde-devel/plasma/CMakeFiles  23 24 25
make[2]: Entering directory `/home/kde-devel/plasma'
make[2]: Nothing to be done for `applets/lancelot/CMakeFiles/plasma_applet_lancelot.dir/depend'.
make[2]: Leaving directory `/home/kde-devel/plasma'
make -f applets/lancelot/CMakeFiles/plasma_applet_lancelot.dir/build.make applets/lancelot/CMakeFiles/plasma_applet_lancelot.dir/build
[ 42%] Built target plasma_applet_kolourpicker
make -f applets/lancelot/app/CMakeFiles/lancelot.dir/build.make applets/lancelot/app/CMakeFiles/lancelot.dir/depend
make[2]: Entering directory `/home/kde-devel/plasma'
make[2]: Nothing to be done for `applets/lancelot/CMakeFiles/plasma_applet_lancelot.dir/build'.
make[2]: Leaving directory `/home/kde-devel/plasma'
/usr/local/bin/cmake -E cmake_progress_report /home/kde-devel/plasma/CMakeFiles  26 27 28
make[2]: Entering directory `/home/kde-devel/plasma'
make[2]: Nothing to be done for `applets/lancelot/app/CMakeFiles/lancelot.dir/depend'.
make[2]: Leaving directory `/home/kde-devel/plasma'
make -f applets/lancelot/app/CMakeFiles/lancelot.dir/build.make applets/lancelot/app/CMakeFiles/lancelot.dir/build
[ 47%] Built target plasma_applet_lancelot
make -f applets/notes/CMakeFiles/plasma_applet_notes.dir/build.make applets/notes/CMakeFiles/plasma_applet_notes.dir/depend
make[2]: Entering directory `/home/kde-devel/plasma'
make[2]: Nothing to be done for `applets/notes/CMakeFiles/plasma_applet_notes.dir/depend'.
make[2]: Leaving directory `/home/kde-devel/plasma'
make -f applets/notes/CMakeFiles/plasma_applet_notes.dir/build.make applets/notes/CMakeFiles/plasma_applet_notes.dir/build
make[2]: Entering directory `/home/kde-devel/plasma'
make[2]: Nothing to be done for `applets/notes/CMakeFiles/plasma_applet_notes.dir/build'.
make[2]: Leaving directory `/home/kde-devel/plasma'
/usr/local/bin/cmake -E cmake_progress_report /home/kde-devel/plasma/CMakeFiles  47 48 49 50
[ 54%] make[2]: Entering directory `/home/kde-devel/plasma'
make[2]: Nothing to be done for `applets/lancelot/app/CMakeFiles/lancelot.dir/build'.
make[2]: Leaving directory `/home/kde-devel/plasma'
/usr/local/bin/cmake -E cmake_progress_report /home/kde-devel/plasma/CMakeFiles  29 30 31 32 33 34 35 36 37 38 39 40 41 42 43 44 45 46
Built target plasma_applet_notes
make -f applets/twitter/CMakeFiles/plasma_applet_twitter.dir/build.make applets/twitter/CMakeFiles/plasma_applet_twitter.dir/depend
make[2]: Entering directory `/home/kde-devel/plasma'
make[2]: Nothing to be done for `applets/twitter/CMakeFiles/plasma_applet_twitter.dir/depend'.
make[2]: Leaving directory `/home/kde-devel/plasma'
make -f applets/twitter/CMakeFiles/plasma_applet_twitter.dir/build.make applets/twitter/CMakeFiles/plasma_applet_twitter.dir/build
[ 84%] Built target lancelot
make -f dataengines/ebn/CMakeFiles/plasma_engine_ebn.dir/build.make dataengines/ebn/CMakeFiles/plasma_engine_ebn.dir/depend
make[2]: Entering directory `/home/kde-devel/plasma'
make[2]: Nothing to be done for `dataengines/ebn/CMakeFiles/plasma_engine_ebn.dir/depend'.
make[2]: Leaving directory `/home/kde-devel/plasma'
make[2]: Entering directory `/home/kde-devel/plasma'
make[2]: Nothing to be done for `applets/twitter/CMakeFiles/plasma_applet_twitter.dir/build'.
make[2]: Leaving directory `/home/kde-devel/plasma'
/usr/local/bin/cmake -E cmake_progress_report /home/kde-devel/plasma/CMakeFiles  51 52 53
make -f dataengines/ebn/CMakeFiles/plasma_engine_ebn.dir/build.make dataengines/ebn/CMakeFiles/plasma_engine_ebn.dir/build
make[2]: Entering directory `/home/kde-devel/plasma'
/usr/local/bin/cmake -E cmake_progress_report /home/kde-devel/plasma/CMakeFiles 55
[ 89%] Built target plasma_applet_twitter
make -f dataengines/twitter/CMakeFiles/plasma_engine_twitter.dir/build.make dataengines/twitter/CMakeFiles/plasma_engine_twitter.dir/depend
make[2]: Entering directory `/home/kde-devel/plasma'
make[2]: Nothing to be done for `dataengines/twitter/CMakeFiles/plasma_engine_twitter.dir/depend'.
make[2]: Leaving directory `/home/kde-devel/plasma'
make -f dataengines/twitter/CMakeFiles/plasma_engine_twitter.dir/build.make dataengines/twitter/CMakeFiles/plasma_engine_twitter.dir/build
[ 91%] Building CXX object dataengines/ebn/CMakeFiles/plasma_engine_ebn.dir/ebnengine.o
/usr/bin/c++   -Dplasma_engine_ebn_EXPORTS   -Wnon-virtual-dtor -Wno-long-long -ansi -Wundef -Wcast-align -Wchar-subscripts -Wall -W -Wpointer-arith -Wformat-security -fno-exceptions -fno-check-new -fno-common -fvisibility=hidden -g3 -fno-inline -fPIC -I/home/kde-devel/plasma/dataengines/ebn -I/home/kde-devel/plasma -I/home/kde-devel/qt-copy/include -I/home/kde-devel/qt-copy/include/Qt -I/home/kde-devel/qt-copy/mkspecs/default -I/home/kde-devel/qt-copy/include/QtCore -I/home/kde-devel/qt-copy/include/QtGui -I/home/kde-devel/qt-copy/include/Qt3Support -I/home/kde-devel/qt-copy/include/QtAssistant -I/home/kde-devel/qt-copy/include/QtDesigner -I/home/kde-devel/qt-copy/include/QtNetwork -I/home/kde-devel/qt-copy/include/QtOpenGL -I/home/kde-devel/qt-copy/include/QtSql -I/home/kde-devel/qt-copy/include/QtXml -I/home/kde-devel/qt-copy/include/QtSvg -I/home/kde-devel/qt-copy/include/QtScript -I/home/kde-devel/qt-copy/include/QtUiTools -I/home/kde-devel/qt-copy/include/QtTest -I/home/kde-devel/qt-copy/include/QtDBus -I/home/kde-devel/kde/include -I/home/kde-devel/kde/include/KDE -I/usr/local/include   -D_BSD_SOURCE -D_XOPEN_SOURCE=500 -D_BSD_SOURCE -D_GNU_SOURCE -DQT_NO_STL -DQT_NO_CAST_TO_ASCII -D_REENTRANT -DKDE_DEPRECATED_WARNINGS -o dataengines/ebn/CMakeFiles/plasma_engine_ebn.dir/ebnengine.o -c /home/kde-devel/plasma/dataengines/ebn/ebnengine.cpp
make[2]: Entering directory `/home/kde-devel/plasma'
make[2]: Nothing to be done for `dataengines/twitter/CMakeFiles/plasma_engine_twitter.dir/build'.
make[2]: Leaving directory `/home/kde-devel/plasma'
/usr/local/bin/cmake -E cmake_progress_report /home/kde-devel/plasma/CMakeFiles  57 58 59
[ 96%] Built target plasma_engine_twitter
In file included from /home/kde-devel/kde/include/syndication/global.h:25,
                 from /home/kde-devel/kde/include/syndication/loader.h:14,
                 from /home/kde-devel/plasma/dataengines/ebn/ebnengine.h:23,
                 from /home/kde-devel/plasma/dataengines/ebn/ebnengine.cpp:19:
/home/kde-devel/kde/include/syndication/feed.h:26:32: error: boost/shared_ptr.hpp: No such file or directory
/home/kde-devel/kde/include/syndication/feed.h:40: error: 'boost' has not been declared
/home/kde-devel/kde/include/syndication/feed.h:40: error: expected initializer before '<' token
/home/kde-devel/kde/include/syndication/feed.h:42: error: 'boost' has not been declared
/home/kde-devel/kde/include/syndication/feed.h:42: error: expected initializer before '<' token
/home/kde-devel/kde/include/syndication/feed.h:44: error: 'boost' has not been declared
/home/kde-devel/kde/include/syndication/feed.h:44: error: expected initializer before '<' token
/home/kde-devel/kde/include/syndication/feed.h:46: error: 'boost' has not been declared
/home/kde-devel/kde/include/syndication/feed.h:46: error: expected initializer before '<' token
/home/kde-devel/kde/include/syndication/feed.h:48: error: 'boost' has not been declared
/home/kde-devel/kde/include/syndication/feed.h:48: error: expected initializer before '<' token
/home/kde-devel/kde/include/syndication/feed.h:50: error: 'boost' has not been declared
/home/kde-devel/kde/include/syndication/feed.h:50: error: expected initializer before '<' token
/home/kde-devel/kde/include/syndication/feed.h:81: error: 'SpecificDocumentPtr' does not name a type
/home/kde-devel/kde/include/syndication/feed.h:90: error: 'ItemPtr' was not declared in this scope
/home/kde-devel/kde/include/syndication/feed.h:90: error: template argument 1 is invalid
/home/kde-devel/kde/include/syndication/feed.h:97: error: 'CategoryPtr' was not declared in this scope
/home/kde-devel/kde/include/syndication/feed.h:97: error: template argument 1 is invalid
/home/kde-devel/kde/include/syndication/feed.h:136: error: 'ImagePtr' does not name a type
/home/kde-devel/kde/include/syndication/feed.h:145: error: 'PersonPtr' was not declared in this scope
/home/kde-devel/kde/include/syndication/feed.h:145: error: template argument 1 is invalid
/home/kde-devel/kde/include/syndication/global.h:80: error: 'FeedPtr' does not name a type
/home/kde-devel/kde/include/syndication/loader.h:28: error: 'boost' has not been declared
/home/kde-devel/kde/include/syndication/loader.h:28: error: expected initializer before '<' token
/home/kde-devel/kde/include/syndication/loader.h:164: error: 'Syndication::FeedPtr' has not been declared
/home/kde-devel/plasma/dataengines/ebn/ebnengine.h:62: error: 'Syndication::FeedPtr' has not been declared
/home/kde-devel/kde/include/syndication/item.h:40: error: 'boost' has not been declared
/home/kde-devel/kde/include/syndication/item.h:40: error: expected initializer before '<' token
/home/kde-devel/kde/include/syndication/item.h:42: error: 'boost' has not been declared
/home/kde-devel/kde/include/syndication/item.h:42: error: expected initializer before '<' token
/home/kde-devel/kde/include/syndication/item.h:44: error: 'boost' has not been declared
/home/kde-devel/kde/include/syndication/item.h:44: error: expected initializer before '<' token
/home/kde-devel/kde/include/syndication/item.h:46: error: 'boost' has not been declared
/home/kde-devel/kde/include/syndication/item.h:46: error: expected initializer before '<' token
/home/kde-devel/kde/include/syndication/item.h:48: error: 'boost' has not been declared
/home/kde-devel/kde/include/syndication/item.h:48: error: expected initializer before '<' token
/home/kde-devel/kde/include/syndication/item.h:72: error: 'SpecificItemPtr' does not name a type
/home/kde-devel/kde/include/syndication/item.h:152: error: 'PersonPtr' was not declared in this scope
/home/kde-devel/kde/include/syndication/item.h:152: error: template argument 1 is invalid
/home/kde-devel/kde/include/syndication/item.h:167: error: 'EnclosurePtr' was not declared in this scope
/home/kde-devel/kde/include/syndication/item.h:167: error: template argument 1 is invalid
/home/kde-devel/kde/include/syndication/item.h:175: error: 'CategoryPtr' was not declared in this scope
/home/kde-devel/kde/include/syndication/item.h:175: error: template argument 1 is invalid
/home/kde-devel/plasma/dataengines/ebn/ebnengine.cpp:90: error: 'Syndication::FeedPtr' has not been declared
/home/kde-devel/plasma/dataengines/ebn/ebnengine.cpp: In member function 'void EbnEngine::processFeed(Syndication::Loader*, int, Syndication::ErrorCode)':
/home/kde-devel/plasma/dataengines/ebn/ebnengine.cpp:102: error: base operand of '->' is not a pointer
/home/kde-devel/plasma/dataengines/ebn/ebnengine.cpp:103: error: base operand of '->' is not a pointer
/home/kde-devel/plasma/dataengines/ebn/ebnengine.cpp:104: error: base operand of '->' is not a pointer
/home/kde-devel/plasma/dataengines/ebn/ebnengine.cpp:106: error: base operand of '->' is not a pointer
/home/kde-devel/plasma/dataengines/ebn/ebnengine.cpp:106: error: base operand of '->' is not a pointer
/home/kde-devel/plasma/dataengines/ebn/ebnengine.cpp:108: error: base operand of '->' is not a pointer
/home/kde-devel/plasma/dataengines/ebn/ebnengine.cpp:108: error: template argument 1 is invalid
/home/kde-devel/plasma/dataengines/ebn/ebnengine.cpp:108: error: invalid type in declaration before '(' token
/home/kde-devel/plasma/dataengines/ebn/ebnengine.cpp:108: error: base operand of '->' is not a pointer
/home/kde-devel/plasma/dataengines/ebn/ebnengine.cpp:108: error: request for member 'brk' in '_container_', which is of non-class type 'int'
/home/kde-devel/plasma/dataengines/ebn/ebnengine.cpp:108: error: request for member 'i' in '_container_', which is of non-class type 'int'
/home/kde-devel/plasma/dataengines/ebn/ebnengine.cpp:108: error: request for member 'e' in '_container_', which is of non-class type 'int'
/home/kde-devel/plasma/dataengines/ebn/ebnengine.cpp:108: error: request for member 'brk' in '_container_', which is of non-class type 'int'
/home/kde-devel/plasma/dataengines/ebn/ebnengine.cpp:108: error: request for member 'i' in '_container_', which is of non-class type 'int'
/home/kde-devel/plasma/dataengines/ebn/ebnengine.cpp:108: error: expected initializer before '&' token
/home/kde-devel/plasma/dataengines/ebn/ebnengine.cpp:108: error: request for member 'brk' in '_container_', which is of non-class type 'int'
/home/kde-devel/plasma/dataengines/ebn/ebnengine.cpp:118: error: 'item' was not declared in this scope
/home/kde-devel/plasma/dataengines/ebn/ebnengine.moc: In member function 'virtual int EbnEngine::qt_metacall(QMetaObject::Call, int, void**)':
/home/kde-devel/plasma/dataengines/ebn/ebnengine.moc:72: error: expected type-specifier
/home/kde-devel/plasma/dataengines/ebn/ebnengine.moc:72: error: expected `>'
/home/kde-devel/plasma/dataengines/ebn/ebnengine.moc:72: error: expected `('
/home/kde-devel/plasma/dataengines/ebn/ebnengine.moc:72: error: 'FeedPtr' is not a member of 'Syndication'
/home/kde-devel/plasma/dataengines/ebn/ebnengine.moc:72: error: expected primary-expression before ')' token
make[2]: *** [dataengines/ebn/CMakeFiles/plasma_engine_ebn.dir/ebnengine.o] Error 1
make[2]: Leaving directory `/home/kde-devel/plasma'
make[1]: *** [dataengines/ebn/CMakeFiles/plasma_engine_ebn.dir/all] Error 2
make[1]: Leaving directory `/home/kde-devel/plasma'
make: *** [all] Error 2