All pastes #741441 Raw Edit

gcc-cross-4.1.2-r9 build error

public text v1 · immutable
·published 2007-10-18 18:26 UTC
rendered paste body
NOTE: make -j 4 ARCH_FLAGS_FOR_TARGET=-isystem/home/openmoko/om/build/tmp/staging/i686-linux/include
make[1]: Entering directory `/home/openmoko/om/build/tmp/work/armv4t-angstrom-linux-gnueabi/gcc-cross-4.1.2-r9/gcc-4.1.2/build.i686-linux.arm-angstrom-linux-gnueabi'
make[2]: Entering directory `/home/openmoko/om/build/tmp/work/armv4t-angstrom-linux-gnueabi/gcc-cross-4.1.2-r9/gcc-4.1.2/build.i686-linux.arm-angstrom-linux-gnueabi'
make[3]: Entering directory `/home/openmoko/om/build/tmp/work/armv4t-angstrom-linux-gnueabi/gcc-cross-4.1.2-r9/gcc-4.1.2/build.i686-linux.arm-angstrom-linux-gnueabi/libiberty'
make[4]: Entering directory `/home/openmoko/om/build/tmp/work/armv4t-angstrom-linux-gnueabi/gcc-cross-4.1.2-r9/gcc-4.1.2/build.i686-linux.arm-angstrom-linux-gnueabi/libiberty/testsuite'
make[4]: Nothing to be done for `all'.
make[4]: Leaving directory `/home/openmoko/om/build/tmp/work/armv4t-angstrom-linux-gnueabi/gcc-cross-4.1.2-r9/gcc-4.1.2/build.i686-linux.arm-angstrom-linux-gnueabi/libiberty/testsuite'
make[3]: Leaving directory `/home/openmoko/om/build/tmp/work/armv4t-angstrom-linux-gnueabi/gcc-cross-4.1.2-r9/gcc-4.1.2/build.i686-linux.arm-angstrom-linux-gnueabi/libiberty'
make[3]: Entering directory `/home/openmoko/om/build/tmp/work/armv4t-angstrom-linux-gnueabi/gcc-cross-4.1.2-r9/gcc-4.1.2/build.i686-linux.arm-angstrom-linux-gnueabi/build-i686-linux/libiberty'
make[4]: Entering directory `/home/openmoko/om/build/tmp/work/armv4t-angstrom-linux-gnueabi/gcc-cross-4.1.2-r9/gcc-4.1.2/build.i686-linux.arm-angstrom-linux-gnueabi/build-i686-linux/libiberty/testsuite'
make[4]: Nothing to be done for `all'.
make[4]: Leaving directory `/home/openmoko/om/build/tmp/work/armv4t-angstrom-linux-gnueabi/gcc-cross-4.1.2-r9/gcc-4.1.2/build.i686-linux.arm-angstrom-linux-gnueabi/build-i686-linux/libiberty/testsuite'
make[3]: Entering directory `/home/openmoko/om/build/tmp/work/armv4t-angstrom-linux-gnueabi/gcc-cross-4.1.2-r9/gcc-4.1.2/build.i686-linux.arm-angstrom-linux-gnueabi/intl'
make[3]: Nothing to be done for `all'.
make[3]: Leaving directory `/home/openmoko/om/build/tmp/work/armv4t-angstrom-linux-gnueabi/gcc-cross-4.1.2-r9/gcc-4.1.2/build.i686-linux.arm-angstrom-linux-gnueabi/intl'
make[3]: Entering directory `/home/openmoko/om/build/tmp/work/armv4t-angstrom-linux-gnueabi/gcc-cross-4.1.2-r9/gcc-4.1.2/build.i686-linux.arm-angstrom-linux-gnueabi/fixincludes'
make[3]: Nothing to be done for `all'.
make[3]: Leaving directory `/home/openmoko/om/build/tmp/work/armv4t-angstrom-linux-gnueabi/gcc-cross-4.1.2-r9/gcc-4.1.2/build.i686-linux.arm-angstrom-linux-gnueabi/fixincludes'
make[3]: Leaving directory `/home/openmoko/om/build/tmp/work/armv4t-angstrom-linux-gnueabi/gcc-cross-4.1.2-r9/gcc-4.1.2/build.i686-linux.arm-angstrom-linux-gnueabi/build-i686-linux/libiberty'
make[3]: Entering directory `/home/openmoko/om/build/tmp/work/armv4t-angstrom-linux-gnueabi/gcc-cross-4.1.2-r9/gcc-4.1.2/build.i686-linux.arm-angstrom-linux-gnueabi/build-i686-linux/fixincludes'
make[3]: Nothing to be done for `all'.
make[3]: Leaving directory `/home/openmoko/om/build/tmp/work/armv4t-angstrom-linux-gnueabi/gcc-cross-4.1.2-r9/gcc-4.1.2/build.i686-linux.arm-angstrom-linux-gnueabi/build-i686-linux/fixincludes'
make[3]: Entering directory `/home/openmoko/om/build/tmp/work/armv4t-angstrom-linux-gnueabi/gcc-cross-4.1.2-r9/gcc-4.1.2/build.i686-linux.arm-angstrom-linux-gnueabi/libcpp'
make[3]: Nothing to be done for `all'.
make[3]: Leaving directory `/home/openmoko/om/build/tmp/work/armv4t-angstrom-linux-gnueabi/gcc-cross-4.1.2-r9/gcc-4.1.2/build.i686-linux.arm-angstrom-linux-gnueabi/libcpp'
make[3]: Entering directory `/home/openmoko/om/build/tmp/work/armv4t-angstrom-linux-gnueabi/gcc-cross-4.1.2-r9/gcc-4.1.2/build.i686-linux.arm-angstrom-linux-gnueabi/gcc'
make \
	  CFLAGS="-isystem/home/openmoko/om/build/tmp/staging/i686-linux/include -Os -W -Wall -Wwrite-strings -Wstrict-prototypes -Wmissing-prototypes -pedantic -Wno-long-long -Wno-variadic-macros -Wold-style-definition -Wmissing-format-attribute  " \
	  CONFIG_H="config.h  auto-host.h /home/openmoko/om/build/tmp/work/armv4t-angstrom-linux-gnueabi/gcc-cross-4.1.2-r9/gcc-4.1.2/gcc/../include/ansidecl.h" \
	  MAKEOVERRIDES= \
	  -f libgcc.mk all
make[4]: Entering directory `/home/openmoko/om/build/tmp/work/armv4t-angstrom-linux-gnueabi/gcc-cross-4.1.2-r9/gcc-4.1.2/build.i686-linux.arm-angstrom-linux-gnueabi/gcc'
make GCC_FOR_TARGET="/home/openmoko/om/build/tmp/work/armv4t-angstrom-linux-gnueabi/gcc-cross-4.1.2-r9/gcc-4.1.2/build.i686-linux.arm-angstrom-linux-gnueabi/./gcc/xgcc -B/home/openmoko/om/build/tmp/work/armv4t-angstrom-linux-gnueabi/gcc-cross-4.1.2-r9/gcc-4.1.2/build.i686-linux.arm-angstrom-linux-gnueabi/./gcc/ -isystem/home/openmoko/om/build/tmp/staging/i686-linux/include -B/home/openmoko/om/build/tmp/cross/arm-angstrom-linux-gnueabi/bin/ -B/home/openmoko/om/build/tmp/cross/arm-angstrom-linux-gnueabi/lib/ -isystem /home/openmoko/om/build/tmp/cross/arm-angstrom-linux-gnueabi/include -isystem /home/openmoko/om/build/tmp/cross/arm-angstrom-linux-gnueabi/sys-include" \
	  AR_FOR_TARGET="arm-angstrom-linux-gnueabi-ar" \
	  AR_CREATE_FOR_TARGET="arm-angstrom-linux-gnueabi-ar  rc" \
	  AR_EXTRACT_FOR_TARGET="arm-angstrom-linux-gnueabi-ar  x" \
	  AR_FLAGS_FOR_TARGET="" \
	  CC="gcc" CFLAGS="-isystem/home/openmoko/om/build/tmp/staging/i686-linux/include -Os -W -Wall -Wwrite-strings -Wstrict-prototypes -Wmissing-prototypes -pedantic -Wno-long-long -Wno-variadic-macros -Wold-style-definition -Wmissing-format-attribute  " \
	  BUILD_PREFIX="" \
	  BUILD_PREFIX_1="loser-" \
	  LANGUAGES="" \
	  LIBGCC2_CFLAGS="-O2  -g -Os -DIN_GCC -DCROSS_COMPILE   -W -Wall -Wwrite-strings -Wstrict-prototypes -Wmissing-prototypes -Wold-style-definition  -isystem ./include  -fPIC -g -DHAVE_GTHR_DEFAULT -DIN_LIBGCC2 -D__GCC_FLOAT_NOT_NEEDED -Dinhibit_libc "  \
	  MULTILIB_CFLAGS="" T= crtbegin.o crtend.o crtbeginS.o crtendS.o crtbeginT.o
make[5]: Entering directory `/home/openmoko/om/build/tmp/work/armv4t-angstrom-linux-gnueabi/gcc-cross-4.1.2-r9/gcc-4.1.2/build.i686-linux.arm-angstrom-linux-gnueabi/gcc'
make[5]: `crtbegin.o' is up to date.
make[5]: `crtend.o' is up to date.
make[5]: `crtbeginS.o' is up to date.
make[5]: `crtendS.o' is up to date.
make[5]: `crtbeginT.o' is up to date.
make[5]: Leaving directory `/home/openmoko/om/build/tmp/work/armv4t-angstrom-linux-gnueabi/gcc-cross-4.1.2-r9/gcc-4.1.2/build.i686-linux.arm-angstrom-linux-gnueabi/gcc'
/home/openmoko/om/build/tmp/work/armv4t-angstrom-linux-gnueabi/gcc-cross-4.1.2-r9/gcc-4.1.2/build.i686-linux.arm-angstrom-linux-gnueabi/./gcc/xgcc -B/home/openmoko/om/build/tmp/work/armv4t-angstrom-linux-gnueabi/gcc-cross-4.1.2-r9/gcc-4.1.2/build.i686-linux.arm-angstrom-linux-gnueabi/./gcc/ -isystem/home/openmoko/om/build/tmp/staging/i686-linux/include -B/home/openmoko/om/build/tmp/cross/arm-angstrom-linux-gnueabi/bin/ -B/home/openmoko/om/build/tmp/cross/arm-angstrom-linux-gnueabi/lib/ -isystem /home/openmoko/om/build/tmp/cross/arm-angstrom-linux-gnueabi/include -isystem /home/openmoko/om/build/tmp/cross/arm-angstrom-linux-gnueabi/sys-include -O2  -g -Os -DIN_GCC -DCROSS_COMPILE   -W -Wall -Wwrite-strings -Wstrict-prototypes -Wmissing-prototypes -Wold-style-definition  -isystem ./include  -fPIC -g -DHAVE_GTHR_DEFAULT -DIN_LIBGCC2 -D__GCC_FLOAT_NOT_NEEDED -Dinhibit_libc -shared -nodefaultlibs -Wl,--soname=libgcc_s.so.1 -Wl,--version-script=libgcc/./libgcc.map -o ./libgcc_s.so.1.tmp  libgcc/./_udivsi3_s.o libgcc/./_divsi3_s.o libgcc/./_umodsi3_s.o libgcc/./_modsi3_s.o libgcc/./_bb_init_func_s.o libgcc/./_call_via_rX_s.o libgcc/./_interwork_call_via_rX_s.o libgcc/./_lshrdi3_s.o libgcc/./_ashrdi3_s.o libgcc/./_ashldi3_s.o libgcc/./_negdf2_s.o libgcc/./_addsubdf3_s.o libgcc/./_muldivdf3_s.o libgcc/./_cmpdf2_s.o libgcc/./_unorddf2_s.o libgcc/./_fixdfsi_s.o libgcc/./_fixunsdfsi_s.o libgcc/./_truncdfsf2_s.o libgcc/./_negsf2_s.o libgcc/./_addsubsf3_s.o libgcc/./_muldivsf3_s.o libgcc/./_cmpsf2_s.o libgcc/./_unordsf2_s.o libgcc/./_fixsfsi_s.o libgcc/./_fixunssfsi_s.o libgcc/./_floatdidf_s.o libgcc/./_floatdisf_s.o libgcc/./_aeabi_lcmp_s.o libgcc/./_aeabi_ulcmp_s.o libgcc/./_aeabi_ldivmod_s.o libgcc/./_aeabi_uldivmod_s.o libgcc/./_dvmd_lnx_s.o libgcc/./_muldi3_s.o libgcc/./_negdi2_s.o libgcc/./_cmpdi2_s.o libgcc/./_ucmpdi2_s.o libgcc/./_clear_cache_s.o libgcc/./_enable_execute_stack_s.o libgcc/./_trampoline_s.o libgcc/./__main_s.o libgcc/./_absvsi2_s.o libgcc/./_absvdi2_s.o libgcc/./_addvsi3_s.o libgcc/./_addvdi3_s.o libgcc/./_subvsi3_s.o libgcc/./_subvdi3_s.o libgcc/./_mulvsi3_s.o libgcc/./_mulvdi3_s.o libgcc/./_negvsi2_s.o libgcc/./_negvdi2_s.o libgcc/./_ctors_s.o libgcc/./_ffssi2_s.o libgcc/./_ffsdi2_s.o libgcc/./_clz_s.o libgcc/./_clzsi2_s.o libgcc/./_clzdi2_s.o libgcc/./_ctzsi2_s.o libgcc/./_ctzdi2_s.o libgcc/./_popcount_tab_s.o libgcc/./_popcountsi2_s.o libgcc/./_popcountdi2_s.o libgcc/./_paritysi2_s.o libgcc/./_paritydi2_s.o libgcc/./_powisf2_s.o libgcc/./_powidf2_s.o libgcc/./_powixf2_s.o libgcc/./_powitf2_s.o libgcc/./_mulsc3_s.o libgcc/./_muldc3_s.o libgcc/./_mulxc3_s.o libgcc/./_multc3_s.o libgcc/./_divsc3_s.o libgcc/./_divdc3_s.o libgcc/./_divxc3_s.o libgcc/./_divtc3_s.o libgcc/./_fixunsxfsi_s.o libgcc/./_fixsfdi_s.o libgcc/./_fixunssfdi_s.o libgcc/./_fixdfdi_s.o libgcc/./_fixunsdfdi_s.o libgcc/./_fixxfdi_s.o libgcc/./_fixunsxfdi_s.o libgcc/./_floatdixf_s.o libgcc/./_fixtfdi_s.o libgcc/./_fixunstfdi_s.o libgcc/./_floatditf_s.o libgcc/./_divdi3_s.o libgcc/./_moddi3_s.o libgcc/./_udivdi3_s.o libgcc/./_umoddi3_s.o libgcc/./_udiv_w_sdiv_s.o libgcc/./_udivmoddi4_s.o libgcc/./bpabi_s.o libgcc/./unaligned-funcs_s.o libgcc/./unwind-arm_s.o libgcc/./libunwind_s.o libgcc/./pr-support_s.o libgcc/./unwind-c_s.o -lc && rm -f ./libgcc_s.so && if [ -f ./libgcc_s.so.1 ]; then mv -f ./libgcc_s.so.1 ./libgcc_s.so.1.backup; else true; fi && mv ./libgcc_s.so.1.tmp ./libgcc_s.so.1 && ln -s libgcc_s.so.1 ./libgcc_s.so
make[4]: Leaving directory `/home/openmoko/om/build/tmp/work/armv4t-angstrom-linux-gnueabi/gcc-cross-4.1.2-r9/gcc-4.1.2/build.i686-linux.arm-angstrom-linux-gnueabi/gcc'
echo timestamp > stmp-multilib
make[3]: Leaving directory `/home/openmoko/om/build/tmp/work/armv4t-angstrom-linux-gnueabi/gcc-cross-4.1.2-r9/gcc-4.1.2/build.i686-linux.arm-angstrom-linux-gnueabi/gcc'
Checking multilib configuration...
multilib.out is unchanged
make[3]: Entering directory `/home/openmoko/om/build/tmp/work/armv4t-angstrom-linux-gnueabi/gcc-cross-4.1.2-r9/gcc-4.1.2/build.i686-linux.arm-angstrom-linux-gnueabi/arm-angstrom-linux-gnueabi/libiberty'
if [ x"-fPIC" != x ]; then \
	  /home/openmoko/om/build/tmp/work/armv4t-angstrom-linux-gnueabi/gcc-cross-4.1.2-r9/gcc-4.1.2/build.i686-linux.arm-angstrom-linux-gnueabi/./gcc/xgcc -B/home/openmoko/om/build/tmp/work/armv4t-angstrom-linux-gnueabi/gcc-cross-4.1.2-r9/gcc-4.1.2/build.i686-linux.arm-angstrom-linux-gnueabi/./gcc/ -isystem/home/openmoko/om/build/tmp/staging/i686-linux/include -B/home/openmoko/om/build/tmp/cross/arm-angstrom-linux-gnueabi/bin/ -B/home/openmoko/om/build/tmp/cross/arm-angstrom-linux-gnueabi/lib/ -isystem /home/openmoko/om/build/tmp/cross/arm-angstrom-linux-gnueabi/include -isystem /home/openmoko/om/build/tmp/cross/arm-angstrom-linux-gnueabi/sys-include -c -DHAVE_CONFIG_H -g -Os -I. -I/home/openmoko/om/build/tmp/work/armv4t-angstrom-linux-gnueabi/gcc-cross-4.1.2-r9/gcc-4.1.2/libiberty/../include  -W -Wall -pedantic -Wwrite-strings -Wstrict-prototypes -fPIC /home/openmoko/om/build/tmp/work/armv4t-angstrom-linux-gnueabi/gcc-cross-4.1.2-r9/gcc-4.1.2/libiberty/regex.c -o pic/regex.o; \
	else true; fi
make[3]: Entering directory `/home/openmoko/om/build/tmp/work/armv4t-angstrom-linux-gnueabi/gcc-cross-4.1.2-r9/gcc-4.1.2/build.i686-linux.arm-angstrom-linux-gnueabi/arm-angstrom-linux-gnueabi/libmudflap'
make "AR_FLAGS=rc" "CC_FOR_BUILD=gcc" "CFLAGS=-g -Os" "CXXFLAGS=-g -Os" "CFLAGS_FOR_BUILD=-isystem/home/openmoko/om/build/tmp/staging/i686-linux/include -Os" "CFLAGS_FOR_TARGET=-g -Os" "INSTALL=/home/openmoko/om/build/tmp/staging/i686-linux/bin/install -c" "INSTALL_DATA=/home/openmoko/om/build/tmp/staging/i686-linux/bin/install -c -m 644" "INSTALL_PROGRAM=/home/openmoko/om/build/tmp/staging/i686-linux/bin/install -c" "INSTALL_SCRIPT=/home/openmoko/om/build/tmp/staging/i686-linux/bin/install -c" "JC1FLAGS=" "LDFLAGS=-L/home/openmoko/om/build/tmp/staging/i686-linux/lib -Wl,-rpath-link,/home/openmoko/om/build/tmp/staging/i686-linux/lib -Wl,-rpath,/home/openmoko/om/build/tmp/staging/i686-linux/lib -Wl,-O1 " "LIBCFLAGS=-g -Os" "LIBCFLAGS_FOR_TARGET=-g -Os" "MAKE=make" "MAKEINFO=makeinfo --split-size=5000000 --split-size=5000000 " "PICFLAG=" "PICFLAG_FOR_TARGET=" "SHELL=/bin/sh" "RUNTESTFLAGS=" "exec_prefix=/home/openmoko/om/build/tmp/cross" "infodir=/home/openmoko/om/build/tmp/cross/share/info" "libdir=/home/openmoko/om/build/tmp/cross/lib" "prefix=/home/openmoko/om/build/tmp/cross" "includedir=/home/openmoko/om/build/tmp/cross/include" "AR=arm-angstrom-linux-gnueabi-ar" "AS=/home/openmoko/om/build/tmp/work/armv4t-angstrom-linux-gnueabi/gcc-cross-4.1.2-r9/gcc-4.1.2/build.i686-linux.arm-angstrom-linux-gnueabi/./gcc/as" "CC=/home/openmoko/om/build/tmp/work/armv4t-angstrom-linux-gnueabi/gcc-cross-4.1.2-r9/gcc-4.1.2/build.i686-linux.arm-angstrom-linux-gnueabi/./gcc/xgcc -B/home/openmoko/om/build/tmp/work/armv4t-angstrom-linux-gnueabi/gcc-cross-4.1.2-r9/gcc-4.1.2/build.i686-linux.arm-angstrom-linux-gnueabi/./gcc/ -isystem/home/openmoko/om/build/tmp/staging/i686-linux/include -B/home/openmoko/om/build/tmp/cross/arm-angstrom-linux-gnueabi/bin/ -B/home/openmoko/om/build/tmp/cross/arm-angstrom-linux-gnueabi/lib/ -isystem /home/openmoko/om/build/tmp/cross/arm-angstrom-linux-gnueabi/include -isystem /home/openmoko/om/build/tmp/cross/arm-angstrom-linux-gnueabi/sys-include" "CXX=/home/openmoko/om/build/tmp/work/armv4t-angstrom-linux-gnueabi/gcc-cross-4.1.2-r9/gcc-4.1.2/build.i686-linux.arm-angstrom-linux-gnueabi/./gcc/g++ -B/home/openmoko/om/build/tmp/work/armv4t-angstrom-linux-gnueabi/gcc-cross-4.1.2-r9/gcc-4.1.2/build.i686-linux.arm-angstrom-linux-gnueabi/./gcc/ -nostdinc++ -nostdinc++ -I/home/openmoko/om/build/tmp/work/armv4t-angstrom-linux-gnueabi/gcc-cross-4.1.2-r9/gcc-4.1.2/build.i686-linux.arm-angstrom-linux-gnueabi/arm-angstrom-linux-gnueabi/libstdc++-v3/include/arm-angstrom-linux-gnueabi -I/home/openmoko/om/build/tmp/work/armv4t-angstrom-linux-gnueabi/gcc-cross-4.1.2-r9/gcc-4.1.2/build.i686-linux.arm-angstrom-linux-gnueabi/arm-angstrom-linux-gnueabi/libstdc++-v3/include -I/home/openmoko/om/build/tmp/work/armv4t-angstrom-linux-gnueabi/gcc-cross-4.1.2-r9/gcc-4.1.2/libstdc++-v3/libsupc++ -I/home/openmoko/om/build/tmp/work/armv4t-angstrom-linux-gnueabi/gcc-cross-4.1.2-r9/gcc-4.1.2/libstdc++-v3/include/backward -I/home/openmoko/om/build/tmp/work/armv4t-angstrom-linux-gnueabi/gcc-cross-4.1.2-r9/gcc-4.1.2/libstdc++-v3/testsuite -L/home/openmoko/om/build/tmp/work/armv4t-angstrom-linux-gnueabi/gcc-cross-4.1.2-r9/gcc-4.1.2/build.i686-linux.arm-angstrom-linux-gnueabi/arm-angstrom-linux-gnueabi/libstdc++-v3/src -L/home/openmoko/om/build/tmp/work/armv4t-angstrom-linux-gnueabi/gcc-cross-4.1.2-r9/gcc-4.1.2/build.i686-linux.arm-angstrom-linux-gnueabi/arm-angstrom-linux-gnueabi/libstdc++-v3/src/.libs -isystem/home/openmoko/om/build/tmp/staging/i686-linux/include -B/home/openmoko/om/build/tmp/cross/arm-angstrom-linux-gnueabi/bin/ -B/home/openmoko/om/build/tmp/cross/arm-angstrom-linux-gnueabi/lib/ -isystem /home/openmoko/om/build/tmp/cross/arm-angstrom-linux-gnueabi/include -isystem /home/openmoko/om/build/tmp/cross/arm-angstrom-linux-gnueabi/sys-include" "LD=/home/openmoko/om/build/tmp/work/armv4t-angstrom-linux-gnueabi/gcc-cross-4.1.2-r9/gcc-4.1.2/build.i686-linux.arm-angstrom-linux-gnueabi/./gcc/collect-ld" "LIBCFLAGS=-g -Os" "NM=/home/openmoko/om/build/tmp/work/armv4t-angstrom-linux-gnueabi/gcc-cross-4.1.2-r9/gcc-4.1.2/build.i686-linux.arm-angstrom-linux-gnueabi/./gcc/nm" "PICFLAG=" "RANLIB=arm-angstrom-linux-gnueabi-ranlib" "DESTDIR=" all-recursive
if [ x"-fPIC" != x ]; then \
	  /home/openmoko/om/build/tmp/work/armv4t-angstrom-linux-gnueabi/gcc-cross-4.1.2-r9/gcc-4.1.2/build.i686-linux.arm-angstrom-linux-gnueabi/./gcc/xgcc -B/home/openmoko/om/build/tmp/work/armv4t-angstrom-linux-gnueabi/gcc-cross-4.1.2-r9/gcc-4.1.2/build.i686-linux.arm-angstrom-linux-gnueabi/./gcc/ -isystem/home/openmoko/om/build/tmp/staging/i686-linux/include -B/home/openmoko/om/build/tmp/cross/arm-angstrom-linux-gnueabi/bin/ -B/home/openmoko/om/build/tmp/cross/arm-angstrom-linux-gnueabi/lib/ -isystem /home/openmoko/om/build/tmp/cross/arm-angstrom-linux-gnueabi/include -isystem /home/openmoko/om/build/tmp/cross/arm-angstrom-linux-gnueabi/sys-include -c -DHAVE_CONFIG_H -g -Os -I. -I/home/openmoko/om/build/tmp/work/armv4t-angstrom-linux-gnueabi/gcc-cross-4.1.2-r9/gcc-4.1.2/libiberty/../include  -W -Wall -pedantic -Wwrite-strings -Wstrict-prototypes -fPIC /home/openmoko/om/build/tmp/work/armv4t-angstrom-linux-gnueabi/gcc-cross-4.1.2-r9/gcc-4.1.2/libiberty/cplus-dem.c -o pic/cplus-dem.o; \
	else true; fi
make[4]: Entering directory `/home/openmoko/om/build/tmp/work/armv4t-angstrom-linux-gnueabi/gcc-cross-4.1.2-r9/gcc-4.1.2/build.i686-linux.arm-angstrom-linux-gnueabi/arm-angstrom-linux-gnueabi/libmudflap'
if [ x"-fPIC" != x ]; then \
	  /home/openmoko/om/build/tmp/work/armv4t-angstrom-linux-gnueabi/gcc-cross-4.1.2-r9/gcc-4.1.2/build.i686-linux.arm-angstrom-linux-gnueabi/./gcc/xgcc -B/home/openmoko/om/build/tmp/work/armv4t-angstrom-linux-gnueabi/gcc-cross-4.1.2-r9/gcc-4.1.2/build.i686-linux.arm-angstrom-linux-gnueabi/./gcc/ -isystem/home/openmoko/om/build/tmp/staging/i686-linux/include -B/home/openmoko/om/build/tmp/cross/arm-angstrom-linux-gnueabi/bin/ -B/home/openmoko/om/build/tmp/cross/arm-angstrom-linux-gnueabi/lib/ -isystem /home/openmoko/om/build/tmp/cross/arm-angstrom-linux-gnueabi/include -isystem /home/openmoko/om/build/tmp/cross/arm-angstrom-linux-gnueabi/sys-include -c -DHAVE_CONFIG_H -g -Os -I. -I/home/openmoko/om/build/tmp/work/armv4t-angstrom-linux-gnueabi/gcc-cross-4.1.2-r9/gcc-4.1.2/libiberty/../include  -W -Wall -pedantic -Wwrite-strings -Wstrict-prototypes -fPIC /home/openmoko/om/build/tmp/work/armv4t-angstrom-linux-gnueabi/gcc-cross-4.1.2-r9/gcc-4.1.2/libiberty/cp-demangle.c -o pic/cp-demangle.o; \
	else true; fi
Making all in testsuite
make[5]: Entering directory `/home/openmoko/om/build/tmp/work/armv4t-angstrom-linux-gnueabi/gcc-cross-4.1.2-r9/gcc-4.1.2/build.i686-linux.arm-angstrom-linux-gnueabi/arm-angstrom-linux-gnueabi/libmudflap/testsuite'
make[5]: Nothing to be done for `all'.
make[5]: Leaving directory `/home/openmoko/om/build/tmp/work/armv4t-angstrom-linux-gnueabi/gcc-cross-4.1.2-r9/gcc-4.1.2/build.i686-linux.arm-angstrom-linux-gnueabi/arm-angstrom-linux-gnueabi/libmudflap/testsuite'
In file included from /home/openmoko/om/build/tmp/work/armv4t-angstrom-linux-gnueabi/gcc-cross-4.1.2-r9/gcc-4.1.2/libiberty/regex.c:51:
/home/openmoko/om/build/tmp/cross/arm-angstrom-linux-gnueabi/include/sys/types.h:100: error: two or more data types in declaration specifiers
In file included from /home/openmoko/om/build/tmp/cross/arm-angstrom-linux-gnueabi/include/sys/types.h:223,
                 from /home/openmoko/om/build/tmp/work/armv4t-angstrom-linux-gnueabi/gcc-cross-4.1.2-r9/gcc-4.1.2/libiberty/regex.c:51:
/home/openmoko/om/build/tmp/cross/arm-angstrom-linux-gnueabi/include/sys/sysmacros.h:31: error: expected '=', ',', ';', 'asm' or '__attribute__' before 'unsigned'
/home/openmoko/om/build/tmp/cross/arm-angstrom-linux-gnueabi/include/sys/sysmacros.h:34: error: expected '=', ',', ';', 'asm' or '__attribute__' before 'unsigned'
/home/openmoko/om/build/tmp/cross/arm-angstrom-linux-gnueabi/include/sys/sysmacros.h:37: error: expected '=', ',', ';', 'asm' or '__attribute__' before 'unsigned'
/home/openmoko/om/build/tmp/cross/arm-angstrom-linux-gnueabi/include/sys/sysmacros.h:42: error: expected '=', ',', ';', 'asm' or '__attribute__' before 'unsigned'
/home/openmoko/om/build/tmp/cross/arm-angstrom-linux-gnueabi/include/sys/sysmacros.h:48: error: expected '=', ',', ';', 'asm' or '__attribute__' before 'unsigned'
/home/openmoko/om/build/tmp/cross/arm-angstrom-linux-gnueabi/include/sys/sysmacros.h:54: error: expected '=', ',', ';', 'asm' or '__attribute__' before 'unsigned'
/home/openmoko/om/build/tmp/work/armv4t-angstrom-linux-gnueabi/gcc-cross-4.1.2-r9/gcc-4.1.2/libiberty/regex.c:130: warning: function declaration isn't a prototype
/home/openmoko/om/build/tmp/work/armv4t-angstrom-linux-gnueabi/gcc-cross-4.1.2-r9/gcc-4.1.2/libiberty/regex.c:130: warning: conflicting types for built-in function 'malloc'
/home/openmoko/om/build/tmp/work/armv4t-angstrom-linux-gnueabi/gcc-cross-4.1.2-r9/gcc-4.1.2/libiberty/regex.c:131: warning: function declaration isn't a prototype
make[5]: Entering directory `/home/openmoko/om/build/tmp/work/armv4t-angstrom-linux-gnueabi/gcc-cross-4.1.2-r9/gcc-4.1.2/build.i686-linux.arm-angstrom-linux-gnueabi/arm-angstrom-linux-gnueabi/libmudflap'
if /bin/sh ./libtool --mode=compile /home/openmoko/om/build/tmp/work/armv4t-angstrom-linux-gnueabi/gcc-cross-4.1.2-r9/gcc-4.1.2/build.i686-linux.arm-angstrom-linux-gnueabi/./gcc/xgcc -B/home/openmoko/om/build/tmp/work/armv4t-angstrom-linux-gnueabi/gcc-cross-4.1.2-r9/gcc-4.1.2/build.i686-linux.arm-angstrom-linux-gnueabi/./gcc/ -isystem/home/openmoko/om/build/tmp/staging/i686-linux/include -B/home/openmoko/om/build/tmp/cross/arm-angstrom-linux-gnueabi/bin/ -B/home/openmoko/om/build/tmp/cross/arm-angstrom-linux-gnueabi/lib/ -isystem /home/openmoko/om/build/tmp/cross/arm-angstrom-linux-gnueabi/include -isystem /home/openmoko/om/build/tmp/cross/arm-angstrom-linux-gnueabi/sys-include -DHAVE_CONFIG_H -I. -I/home/openmoko/om/build/tmp/work/armv4t-angstrom-linux-gnueabi/gcc-cross-4.1.2-r9/gcc-4.1.2/libmudflap -I.    -Wall -ffunction-sections -fdata-sections -g -Os -MT mf-runtime.lo -MD -MP -MF ".deps/mf-runtime.Tpo" -c -o mf-runtime.lo /home/openmoko/om/build/tmp/work/armv4t-angstrom-linux-gnueabi/gcc-cross-4.1.2-r9/gcc-4.1.2/libmudflap/mf-runtime.c; \
	then mv -f ".deps/mf-runtime.Tpo" ".deps/mf-runtime.Plo"; else rm -f ".deps/mf-runtime.Tpo"; exit 1; fi
In file included from /home/openmoko/om/build/tmp/work/armv4t-angstrom-linux-gnueabi/gcc-cross-4.1.2-r9/gcc-4.1.2/libiberty/regex.c:638:
/home/openmoko/om/build/tmp/work/armv4t-angstrom-linux-gnueabi/gcc-cross-4.1.2-r9/gcc-4.1.2/libiberty/regex.c: In function 'byte_regex_compile':
/home/openmoko/om/build/tmp/work/armv4t-angstrom-linux-gnueabi/gcc-cross-4.1.2-r9/gcc-4.1.2/libiberty/regex.c:2439: warning: implicit declaration of function 'free'
In file included from /home/openmoko/om/build/tmp/cross/arm-angstrom-linux-gnueabi/include/stdlib.h:438,
                 from /home/openmoko/om/build/tmp/work/armv4t-angstrom-linux-gnueabi/gcc-cross-4.1.2-r9/gcc-4.1.2/libiberty/cp-demangle.c:92:
/home/openmoko/om/build/tmp/cross/arm-angstrom-linux-gnueabi/include/sys/types.h:100: error: two or more data types in declaration specifiers
/home/openmoko/om/build/tmp/work/armv4t-angstrom-linux-gnueabi/gcc-cross-4.1.2-r9/gcc-4.1.2/libiberty/regex.c: In function 'byte_re_compile_fastmap':
/home/openmoko/om/build/tmp/work/armv4t-angstrom-linux-gnueabi/gcc-cross-4.1.2-r9/gcc-4.1.2/libiberty/regex.c:4835: warning: implicit declaration of function 'abort'
/home/openmoko/om/build/tmp/work/armv4t-angstrom-linux-gnueabi/gcc-cross-4.1.2-r9/gcc-4.1.2/libiberty/regex.c:4835: warning: incompatible implicit declaration of built-in function 'abort'
In file included from /home/openmoko/om/build/tmp/cross/arm-angstrom-linux-gnueabi/include/sys/types.h:223,
                 from /home/openmoko/om/build/tmp/cross/arm-angstrom-linux-gnueabi/include/stdlib.h:438,
                 from /home/openmoko/om/build/tmp/work/armv4t-angstrom-linux-gnueabi/gcc-cross-4.1.2-r9/gcc-4.1.2/libiberty/cp-demangle.c:92:
/home/openmoko/om/build/tmp/cross/arm-angstrom-linux-gnueabi/include/sys/sysmacros.h:31: error: expected '=', ',', ';', 'asm' or '__attribute__' before 'unsigned'
/home/openmoko/om/build/tmp/cross/arm-angstrom-linux-gnueabi/include/sys/sysmacros.h:34: error: expected '=', ',', ';', 'asm' or '__attribute__' before 'unsigned'
/home/openmoko/om/build/tmp/cross/arm-angstrom-linux-gnueabi/include/sys/sysmacros.h:37: error: expected '=', ',', ';', 'asm' or '__attribute__' before 'unsigned'
/home/openmoko/om/build/tmp/cross/arm-angstrom-linux-gnueabi/include/sys/sysmacros.h:42: error: expected '=', ',', ';', 'asm' or '__attribute__' before 'unsigned'
/home/openmoko/om/build/tmp/cross/arm-angstrom-linux-gnueabi/include/sys/sysmacros.h:48: error: expected '=', ',', ';', 'asm' or '__attribute__' before 'unsigned'
/home/openmoko/om/build/tmp/cross/arm-angstrom-linux-gnueabi/include/sys/sysmacros.h:54: error: expected '=', ',', ';', 'asm' or '__attribute__' before 'unsigned'
/home/openmoko/om/build/tmp/work/armv4t-angstrom-linux-gnueabi/gcc-cross-4.1.2-r9/gcc-4.1.2/libiberty/regex.c: In function 'byte_re_match_2_internal':
/home/openmoko/om/build/tmp/work/armv4t-angstrom-linux-gnueabi/gcc-cross-4.1.2-r9/gcc-4.1.2/libiberty/regex.c:7421: warning: incompatible implicit declaration of built-in function 'abort'
/home/openmoko/om/build/tmp/work/armv4t-angstrom-linux-gnueabi/gcc-cross-4.1.2-r9/gcc-4.1.2/libiberty/regex.c: In function 'xregerror':
/home/openmoko/om/build/tmp/work/armv4t-angstrom-linux-gnueabi/gcc-cross-4.1.2-r9/gcc-4.1.2/libiberty/regex.c:8078: warning: incompatible implicit declaration of built-in function 'abort'
In file included from /home/openmoko/om/build/tmp/work/armv4t-angstrom-linux-gnueabi/gcc-cross-4.1.2-r9/gcc-4.1.2/libiberty/cplus-dem.c:48:
/home/openmoko/om/build/tmp/cross/arm-angstrom-linux-gnueabi/include/sys/types.h:100: error: two or more data types in declaration specifiers
In file included from /home/openmoko/om/build/tmp/cross/arm-angstrom-linux-gnueabi/include/sys/types.h:223,
                 from /home/openmoko/om/build/tmp/work/armv4t-angstrom-linux-gnueabi/gcc-cross-4.1.2-r9/gcc-4.1.2/libiberty/cplus-dem.c:48:
/home/openmoko/om/build/tmp/cross/arm-angstrom-linux-gnueabi/include/sys/sysmacros.h:31: error: expected '=', ',', ';', 'asm' or '__attribute__' before 'unsigned'
/home/openmoko/om/build/tmp/cross/arm-angstrom-linux-gnueabi/include/sys/sysmacros.h:34: error: expected '=', ',', ';', 'asm' or '__attribute__' before 'unsigned'
/home/openmoko/om/build/tmp/cross/arm-angstrom-linux-gnueabi/include/sys/sysmacros.h:37: error: expected '=', ',', ';', 'asm' or '__attribute__' before 'unsigned'
/home/openmoko/om/build/tmp/cross/arm-angstrom-linux-gnueabi/include/sys/sysmacros.h:42: error: expected '=', ',', ';', 'asm' or '__attribute__' before 'unsigned'
/home/openmoko/om/build/tmp/cross/arm-angstrom-linux-gnueabi/include/sys/sysmacros.h:48: error: expected '=', ',', ';', 'asm' or '__attribute__' before 'unsigned'
/home/openmoko/om/build/tmp/cross/arm-angstrom-linux-gnueabi/include/sys/sysmacros.h:54: error: expected '=', ',', ';', 'asm' or '__attribute__' before 'unsigned'
make[3]: *** [cplus-dem.o] Error 1
make[3]: *** Waiting for unfinished jobs....
make[3]: *** [cp-demangle.o] Error 1
make[3]: *** [regex.o] Error 1
make[3]: Leaving directory `/home/openmoko/om/build/tmp/work/armv4t-angstrom-linux-gnueabi/gcc-cross-4.1.2-r9/gcc-4.1.2/build.i686-linux.arm-angstrom-linux-gnueabi/arm-angstrom-linux-gnueabi/libiberty'
make[2]: *** [all-target-libiberty] Error 2
make[2]: *** Waiting for unfinished jobs....
if /bin/sh ./libtool --mode=compile /home/openmoko/om/build/tmp/work/armv4t-angstrom-linux-gnueabi/gcc-cross-4.1.2-r9/gcc-4.1.2/build.i686-linux.arm-angstrom-linux-gnueabi/./gcc/xgcc -B/home/openmoko/om/build/tmp/work/armv4t-angstrom-linux-gnueabi/gcc-cross-4.1.2-r9/gcc-4.1.2/build.i686-linux.arm-angstrom-linux-gnueabi/./gcc/ -isystem/home/openmoko/om/build/tmp/staging/i686-linux/include -B/home/openmoko/om/build/tmp/cross/arm-angstrom-linux-gnueabi/bin/ -B/home/openmoko/om/build/tmp/cross/arm-angstrom-linux-gnueabi/lib/ -isystem /home/openmoko/om/build/tmp/cross/arm-angstrom-linux-gnueabi/include -isystem /home/openmoko/om/build/tmp/cross/arm-angstrom-linux-gnueabi/sys-include -DHAVE_CONFIG_H -I. -I/home/openmoko/om/build/tmp/work/armv4t-angstrom-linux-gnueabi/gcc-cross-4.1.2-r9/gcc-4.1.2/libmudflap -I.    -Wall -ffunction-sections -fdata-sections -g -Os -MT mf-hooks1.lo -MD -MP -MF ".deps/mf-hooks1.Tpo" -c -o mf-hooks1.lo /home/openmoko/om/build/tmp/work/armv4t-angstrom-linux-gnueabi/gcc-cross-4.1.2-r9/gcc-4.1.2/libmudflap/mf-hooks1.c; \
	then mv -f ".deps/mf-hooks1.Tpo" ".deps/mf-hooks1.Plo"; else rm -f ".deps/mf-hooks1.Tpo"; exit 1; fi
if /bin/sh ./libtool --mode=compile /home/openmoko/om/build/tmp/work/armv4t-angstrom-linux-gnueabi/gcc-cross-4.1.2-r9/gcc-4.1.2/build.i686-linux.arm-angstrom-linux-gnueabi/./gcc/xgcc -B/home/openmoko/om/build/tmp/work/armv4t-angstrom-linux-gnueabi/gcc-cross-4.1.2-r9/gcc-4.1.2/build.i686-linux.arm-angstrom-linux-gnueabi/./gcc/ -isystem/home/openmoko/om/build/tmp/staging/i686-linux/include -B/home/openmoko/om/build/tmp/cross/arm-angstrom-linux-gnueabi/bin/ -B/home/openmoko/om/build/tmp/cross/arm-angstrom-linux-gnueabi/lib/ -isystem /home/openmoko/om/build/tmp/cross/arm-angstrom-linux-gnueabi/include -isystem /home/openmoko/om/build/tmp/cross/arm-angstrom-linux-gnueabi/sys-include -DHAVE_CONFIG_H -I. -I/home/openmoko/om/build/tmp/work/armv4t-angstrom-linux-gnueabi/gcc-cross-4.1.2-r9/gcc-4.1.2/libmudflap -I.    -Wall -ffunction-sections -fdata-sections -g -Os -MT mf-hooks2.lo -MD -MP -MF ".deps/mf-hooks2.Tpo" -c -o mf-hooks2.lo /home/openmoko/om/build/tmp/work/armv4t-angstrom-linux-gnueabi/gcc-cross-4.1.2-r9/gcc-4.1.2/libmudflap/mf-hooks2.c; \
	then mv -f ".deps/mf-hooks2.Tpo" ".deps/mf-hooks2.Plo"; else rm -f ".deps/mf-hooks2.Tpo"; exit 1; fi
/bin/sh ./libtool --mode=compile /home/openmoko/om/build/tmp/work/armv4t-angstrom-linux-gnueabi/gcc-cross-4.1.2-r9/gcc-4.1.2/build.i686-linux.arm-angstrom-linux-gnueabi/./gcc/xgcc -B/home/openmoko/om/build/tmp/work/armv4t-angstrom-linux-gnueabi/gcc-cross-4.1.2-r9/gcc-4.1.2/build.i686-linux.arm-angstrom-linux-gnueabi/./gcc/ -isystem/home/openmoko/om/build/tmp/staging/i686-linux/include -B/home/openmoko/om/build/tmp/cross/arm-angstrom-linux-gnueabi/bin/ -B/home/openmoko/om/build/tmp/cross/arm-angstrom-linux-gnueabi/lib/ -isystem /home/openmoko/om/build/tmp/cross/arm-angstrom-linux-gnueabi/include -isystem /home/openmoko/om/build/tmp/cross/arm-angstrom-linux-gnueabi/sys-include -DHAVE_CONFIG_H -I. -I/home/openmoko/om/build/tmp/work/armv4t-angstrom-linux-gnueabi/gcc-cross-4.1.2-r9/gcc-4.1.2/libmudflap -I.    -Wall -ffunction-sections -fdata-sections -g -Os -DLIBMUDFLAPTH -c /home/openmoko/om/build/tmp/work/armv4t-angstrom-linux-gnueabi/gcc-cross-4.1.2-r9/gcc-4.1.2/libmudflap/mf-runtime.c -o pth/mf-runtime.lo
/home/openmoko/om/build/tmp/work/armv4t-angstrom-linux-gnueabi/gcc-cross-4.1.2-r9/gcc-4.1.2/build.i686-linux.arm-angstrom-linux-gnueabi/./gcc/xgcc -B/home/openmoko/om/build/tmp/work/armv4t-angstrom-linux-gnueabi/gcc-cross-4.1.2-r9/gcc-4.1.2/build.i686-linux.arm-angstrom-linux-gnueabi/./gcc/ -isystem/home/openmoko/om/build/tmp/staging/i686-linux/include -B/home/openmoko/om/build/tmp/cross/arm-angstrom-linux-gnueabi/bin/ -B/home/openmoko/om/build/tmp/cross/arm-angstrom-linux-gnueabi/lib/ -isystem /home/openmoko/om/build/tmp/cross/arm-angstrom-linux-gnueabi/include -isystem /home/openmoko/om/build/tmp/cross/arm-angstrom-linux-gnueabi/sys-include -DHAVE_CONFIG_H -I. -I/home/openmoko/om/build/tmp/work/armv4t-angstrom-linux-gnueabi/gcc-cross-4.1.2-r9/gcc-4.1.2/libmudflap -I. -Wall -ffunction-sections -fdata-sections -g -Os -MT mf-hooks1.lo -MD -MP -MF .deps/mf-hooks1.Tpo -c /home/openmoko/om/build/tmp/work/armv4t-angstrom-linux-gnueabi/gcc-cross-4.1.2-r9/gcc-4.1.2/libmudflap/mf-hooks1.c  -fPIC -DPIC -o .libs/mf-hooks1.o
In file included from /home/openmoko/om/build/tmp/cross/arm-angstrom-linux-gnueabi/include/sys/types.h:223,
                 from /home/openmoko/om/build/tmp/cross/arm-angstrom-linux-gnueabi/include/stdlib.h:438,
                 from /home/openmoko/om/build/tmp/work/armv4t-angstrom-linux-gnueabi/gcc-cross-4.1.2-r9/gcc-4.1.2/libmudflap/mf-hooks1.c:55:
/home/openmoko/om/build/tmp/cross/arm-angstrom-linux-gnueabi/include/sys/sysmacros.h:31: error: expected '=', ',', ';', 'asm' or '__attribute__' before 'unsigned'
/home/openmoko/om/build/tmp/cross/arm-angstrom-linux-gnueabi/include/sys/sysmacros.h:34: error: expected '=', ',', ';', 'asm' or '__attribute__' before 'unsigned'
/home/openmoko/om/build/tmp/cross/arm-angstrom-linux-gnueabi/include/sys/sysmacros.h:37: error: expected '=', ',', ';', 'asm' or '__attribute__' before 'unsigned'
/home/openmoko/om/build/tmp/cross/arm-angstrom-linux-gnueabi/include/sys/sysmacros.h:42: error: expected '=', ',', ';', 'asm' or '__attribute__' before 'unsigned'
/home/openmoko/om/build/tmp/cross/arm-angstrom-linux-gnueabi/include/sys/sysmacros.h:48: error: expected '=', ',', ';', 'asm' or '__attribute__' before 'unsigned'
/home/openmoko/om/build/tmp/cross/arm-angstrom-linux-gnueabi/include/sys/sysmacros.h:54: error: expected '=', ',', ';', 'asm' or '__attribute__' before 'unsigned'
In file included from /home/openmoko/om/build/tmp/work/armv4t-angstrom-linux-gnueabi/gcc-cross-4.1.2-r9/gcc-4.1.2/libmudflap/mf-hooks1.c:58:
/home/openmoko/om/build/tmp/cross/arm-angstrom-linux-gnueabi/include/unistd.h:245: error: two or more data types in declaration specifiers
/home/openmoko/om/build/tmp/work/armv4t-angstrom-linux-gnueabi/gcc-cross-4.1.2-r9/gcc-4.1.2/build.i686-linux.arm-angstrom-linux-gnueabi/./gcc/xgcc -B/home/openmoko/om/build/tmp/work/armv4t-angstrom-linux-gnueabi/gcc-cross-4.1.2-r9/gcc-4.1.2/build.i686-linux.arm-angstrom-linux-gnueabi/./gcc/ -isystem/home/openmoko/om/build/tmp/staging/i686-linux/include -B/home/openmoko/om/build/tmp/cross/arm-angstrom-linux-gnueabi/bin/ -B/home/openmoko/om/build/tmp/cross/arm-angstrom-linux-gnueabi/lib/ -isystem /home/openmoko/om/build/tmp/cross/arm-angstrom-linux-gnueabi/include -isystem /home/openmoko/om/build/tmp/cross/arm-angstrom-linux-gnueabi/sys-include -DHAVE_CONFIG_H -I. -I/home/openmoko/om/build/tmp/work/armv4t-angstrom-linux-gnueabi/gcc-cross-4.1.2-r9/gcc-4.1.2/libmudflap -I. -Wall -ffunction-sections -fdata-sections -g -Os -MT mf-runtime.lo -MD -MP -MF .deps/mf-runtime.Tpo -c /home/openmoko/om/build/tmp/work/armv4t-angstrom-linux-gnueabi/gcc-cross-4.1.2-r9/gcc-4.1.2/libmudflap/mf-runtime.c  -fPIC -DPIC -o .libs/mf-runtime.o
make[5]: *** [mf-hooks1.lo] Error 1
make[5]: *** Waiting for unfinished jobs....
In file included from /home/openmoko/om/build/tmp/cross/arm-angstrom-linux-gnueabi/include/sys/types.h:223,
                 from /home/openmoko/om/build/tmp/cross/arm-angstrom-linux-gnueabi/include/stdlib.h:438,
                 from /home/openmoko/om/build/tmp/work/armv4t-angstrom-linux-gnueabi/gcc-cross-4.1.2-r9/gcc-4.1.2/libmudflap/mf-runtime.c:50:
/home/openmoko/om/build/tmp/cross/arm-angstrom-linux-gnueabi/include/sys/sysmacros.h:31: error: expected '=', ',', ';', 'asm' or '__attribute__' before 'unsigned'
/home/openmoko/om/build/tmp/cross/arm-angstrom-linux-gnueabi/include/sys/sysmacros.h:34: error: expected '=', ',', ';', 'asm' or '__attribute__' before 'unsigned'
/home/openmoko/om/build/tmp/cross/arm-angstrom-linux-gnueabi/include/sys/sysmacros.h:37: error: expected '=', ',', ';', 'asm' or '__attribute__' before 'unsigned'
/home/openmoko/om/build/tmp/cross/arm-angstrom-linux-gnueabi/include/sys/sysmacros.h:42: error: expected '=', ',', ';', 'asm' or '__attribute__' before 'unsigned'
/home/openmoko/om/build/tmp/cross/arm-angstrom-linux-gnueabi/include/sys/sysmacros.h:48: error: expected '=', ',', ';', 'asm' or '__attribute__' before 'unsigned'
/home/openmoko/om/build/tmp/cross/arm-angstrom-linux-gnueabi/include/sys/sysmacros.h:54: error: expected '=', ',', ';', 'asm' or '__attribute__' before 'unsigned'
/home/openmoko/om/build/tmp/work/armv4t-angstrom-linux-gnueabi/gcc-cross-4.1.2-r9/gcc-4.1.2/build.i686-linux.arm-angstrom-linux-gnueabi/./gcc/xgcc -B/home/openmoko/om/build/tmp/work/armv4t-angstrom-linux-gnueabi/gcc-cross-4.1.2-r9/gcc-4.1.2/build.i686-linux.arm-angstrom-linux-gnueabi/./gcc/ -isystem/home/openmoko/om/build/tmp/staging/i686-linux/include -B/home/openmoko/om/build/tmp/cross/arm-angstrom-linux-gnueabi/bin/ -B/home/openmoko/om/build/tmp/cross/arm-angstrom-linux-gnueabi/lib/ -isystem /home/openmoko/om/build/tmp/cross/arm-angstrom-linux-gnueabi/include -isystem /home/openmoko/om/build/tmp/cross/arm-angstrom-linux-gnueabi/sys-include -DHAVE_CONFIG_H -I. -I/home/openmoko/om/build/tmp/work/armv4t-angstrom-linux-gnueabi/gcc-cross-4.1.2-r9/gcc-4.1.2/libmudflap -I. -Wall -ffunction-sections -fdata-sections -g -Os -MT mf-hooks2.lo -MD -MP -MF .deps/mf-hooks2.Tpo -c /home/openmoko/om/build/tmp/work/armv4t-angstrom-linux-gnueabi/gcc-cross-4.1.2-r9/gcc-4.1.2/libmudflap/mf-hooks2.c  -fPIC -DPIC -o .libs/mf-hooks2.o
In file included from /home/openmoko/om/build/tmp/cross/arm-angstrom-linux-gnueabi/include/sys/types.h:223,
                 from /home/openmoko/om/build/tmp/cross/arm-angstrom-linux-gnueabi/include/stdlib.h:438,
                 from /home/openmoko/om/build/tmp/work/armv4t-angstrom-linux-gnueabi/gcc-cross-4.1.2-r9/gcc-4.1.2/libmudflap/mf-hooks2.c:56:
/home/openmoko/om/build/tmp/cross/arm-angstrom-linux-gnueabi/include/sys/sysmacros.h:31: error: expected '=', ',', ';', 'asm' or '__attribute__' before 'unsigned'
/home/openmoko/om/build/tmp/cross/arm-angstrom-linux-gnueabi/include/sys/sysmacros.h:34: error: expected '=', ',', ';', 'asm' or '__attribute__' before 'unsigned'
/home/openmoko/om/build/tmp/cross/arm-angstrom-linux-gnueabi/include/sys/sysmacros.h:37: error: expected '=', ',', ';', 'asm' or '__attribute__' before 'unsigned'
/home/openmoko/om/build/tmp/cross/arm-angstrom-linux-gnueabi/include/sys/sysmacros.h:42: error: expected '=', ',', ';', 'asm' or '__attribute__' before 'unsigned'
/home/openmoko/om/build/tmp/cross/arm-angstrom-linux-gnueabi/include/sys/sysmacros.h:48: error: expected '=', ',', ';', 'asm' or '__attribute__' before 'unsigned'
/home/openmoko/om/build/tmp/cross/arm-angstrom-linux-gnueabi/include/sys/sysmacros.h:54: error: expected '=', ',', ';', 'asm' or '__attribute__' before 'unsigned'
make[5]: *** [mf-runtime.lo] Error 1
In file included from /home/openmoko/om/build/tmp/work/armv4t-angstrom-linux-gnueabi/gcc-cross-4.1.2-r9/gcc-4.1.2/libmudflap/mf-hooks2.c:57:
/home/openmoko/om/build/tmp/cross/arm-angstrom-linux-gnueabi/include/sys/stat.h:450: error: expected '=', ',', ';', 'asm' or '__attribute__' before 'int'
/home/openmoko/om/build/tmp/cross/arm-angstrom-linux-gnueabi/include/sys/stat.h:457: error: expected '=', ',', ';', 'asm' or '__attribute__' before 'int'
/home/openmoko/om/build/tmp/cross/arm-angstrom-linux-gnueabi/include/sys/stat.h:464: error: expected '=', ',', ';', 'asm' or '__attribute__' before 'int'
/home/openmoko/om/build/tmp/cross/arm-angstrom-linux-gnueabi/include/sys/stat.h:471: error: expected '=', ',', ';', 'asm' or '__attribute__' before 'int'
/home/openmoko/om/build/tmp/cross/arm-angstrom-linux-gnueabi/include/sys/stat.h:480: error: expected '=', ',', ';', 'asm' or '__attribute__' before 'int'
/home/openmoko/om/build/tmp/cross/arm-angstrom-linux-gnueabi/include/sys/stat.h:488: error: expected '=', ',', ';', 'asm' or '__attribute__' before 'int'
/home/openmoko/om/build/tmp/cross/arm-angstrom-linux-gnueabi/include/sys/stat.h:499: error: expected '=', ',', ';', 'asm' or '__attribute__' before 'int'
/home/openmoko/om/build/tmp/cross/arm-angstrom-linux-gnueabi/include/sys/stat.h:506: error: expected '=', ',', ';', 'asm' or '__attribute__' before 'int'
/home/openmoko/om/build/tmp/cross/arm-angstrom-linux-gnueabi/include/sys/stat.h:513: error: expected '=', ',', ';', 'asm' or '__attribute__' before 'int'
/home/openmoko/om/build/tmp/cross/arm-angstrom-linux-gnueabi/include/sys/stat.h:520: error: expected '=', ',', ';', 'asm' or '__attribute__' before 'int'
In file included from /home/openmoko/om/build/tmp/work/armv4t-angstrom-linux-gnueabi/gcc-cross-4.1.2-r9/gcc-4.1.2/libmudflap/mf-hooks2.c:60:
/home/openmoko/om/build/tmp/cross/arm-angstrom-linux-gnueabi/include/unistd.h:245: error: two or more data types in declaration specifiers
/home/openmoko/om/build/tmp/work/armv4t-angstrom-linux-gnueabi/gcc-cross-4.1.2-r9/gcc-4.1.2/build.i686-linux.arm-angstrom-linux-gnueabi/./gcc/xgcc -B/home/openmoko/om/build/tmp/work/armv4t-angstrom-linux-gnueabi/gcc-cross-4.1.2-r9/gcc-4.1.2/build.i686-linux.arm-angstrom-linux-gnueabi/./gcc/ -isystem/home/openmoko/om/build/tmp/staging/i686-linux/include -B/home/openmoko/om/build/tmp/cross/arm-angstrom-linux-gnueabi/bin/ -B/home/openmoko/om/build/tmp/cross/arm-angstrom-linux-gnueabi/lib/ -isystem /home/openmoko/om/build/tmp/cross/arm-angstrom-linux-gnueabi/include -isystem /home/openmoko/om/build/tmp/cross/arm-angstrom-linux-gnueabi/sys-include -DHAVE_CONFIG_H -I. -I/home/openmoko/om/build/tmp/work/armv4t-angstrom-linux-gnueabi/gcc-cross-4.1.2-r9/gcc-4.1.2/libmudflap -I. -Wall -ffunction-sections -fdata-sections -g -Os -DLIBMUDFLAPTH -c /home/openmoko/om/build/tmp/work/armv4t-angstrom-linux-gnueabi/gcc-cross-4.1.2-r9/gcc-4.1.2/libmudflap/mf-runtime.c  -fPIC -DPIC -o pth/.libs/mf-runtime.o
In file included from /home/openmoko/om/build/tmp/cross/arm-angstrom-linux-gnueabi/include/sys/types.h:223,
                 from /home/openmoko/om/build/tmp/cross/arm-angstrom-linux-gnueabi/include/stdlib.h:438,
                 from /home/openmoko/om/build/tmp/work/armv4t-angstrom-linux-gnueabi/gcc-cross-4.1.2-r9/gcc-4.1.2/libmudflap/mf-runtime.c:50:
/home/openmoko/om/build/tmp/cross/arm-angstrom-linux-gnueabi/include/sys/sysmacros.h:31: error: expected '=', ',', ';', 'asm' or '__attribute__' before 'unsigned'
/home/openmoko/om/build/tmp/cross/arm-angstrom-linux-gnueabi/include/sys/sysmacros.h:34: error: expected '=', ',', ';', 'asm' or '__attribute__' before 'unsigned'
/home/openmoko/om/build/tmp/cross/arm-angstrom-linux-gnueabi/include/sys/sysmacros.h:37: error: expected '=', ',', ';', 'asm' or '__attribute__' before 'unsigned'
/home/openmoko/om/build/tmp/cross/arm-angstrom-linux-gnueabi/include/sys/sysmacros.h:42: error: expected '=', ',', ';', 'asm' or '__attribute__' before 'unsigned'
/home/openmoko/om/build/tmp/cross/arm-angstrom-linux-gnueabi/include/sys/sysmacros.h:48: error: expected '=', ',', ';', 'asm' or '__attribute__' before 'unsigned'
/home/openmoko/om/build/tmp/cross/arm-angstrom-linux-gnueabi/include/sys/sysmacros.h:54: error: expected '=', ',', ';', 'asm' or '__attribute__' before 'unsigned'
make[5]: *** [mf-hooks2.lo] Error 1
make[5]: *** [pth/mf-runtime.lo] Error 1
make[5]: Leaving directory `/home/openmoko/om/build/tmp/work/armv4t-angstrom-linux-gnueabi/gcc-cross-4.1.2-r9/gcc-4.1.2/build.i686-linux.arm-angstrom-linux-gnueabi/arm-angstrom-linux-gnueabi/libmudflap'
make[4]: *** [all-recursive] Error 1
make[4]: Leaving directory `/home/openmoko/om/build/tmp/work/armv4t-angstrom-linux-gnueabi/gcc-cross-4.1.2-r9/gcc-4.1.2/build.i686-linux.arm-angstrom-linux-gnueabi/arm-angstrom-linux-gnueabi/libmudflap'
make[3]: *** [all] Error 2
make[3]: Leaving directory `/home/openmoko/om/build/tmp/work/armv4t-angstrom-linux-gnueabi/gcc-cross-4.1.2-r9/gcc-4.1.2/build.i686-linux.arm-angstrom-linux-gnueabi/arm-angstrom-linux-gnueabi/libmudflap'
make[2]: *** [all-target-libmudflap] Error 2
make[2]: Leaving directory `/home/openmoko/om/build/tmp/work/armv4t-angstrom-linux-gnueabi/gcc-cross-4.1.2-r9/gcc-4.1.2/build.i686-linux.arm-angstrom-linux-gnueabi'
make[1]: *** [all] Error 2
make[1]: Leaving directory `/home/openmoko/om/build/tmp/work/armv4t-angstrom-linux-gnueabi/gcc-cross-4.1.2-r9/gcc-4.1.2/build.i686-linux.arm-angstrom-linux-gnueabi'
FATAL: oe_runmake failed