Something
public text v1 · immutableezcUnitTest uses the PHPUnit 3.1.7 framework from Sebastian Bergmann.
[Preparing tests]:
eZ Components:
Webdav:
ezcWebdavBasicServerTest: ..........
ezcWebdavPluginConfigurationTest: ...
ezcWebdavPluginRegistryTest: ...............
ezcWebdavTransportConfigurationTest: ............
ezcWebdavTransportDispatcherTest: .................
ezcWebdavFlaggedPropertyStorageTest: ............
ezcWebdavPropertyStorageTest: .............................
ezcWebdavInfrastructureBaseTest: ....
ezcWebdavCreationDatePropertyTest: ............
ezcWebdavDeadPropertyTest: ............
ezcWebdavDisplayNamePropertyTest: ............
ezcWebdavGetContentLanguagePropertyTest: ............
ezcWebdavGetContentLengthPropertyTest: ............
ezcWebdavGetContentTypePropertyTest: ............
ezcWebdavGetEtagPropertyTest: ............
ezcWebdavGetLastModifiedPropertyTest: ............
ezcWebdavLockDiscoveryPropertyActiveLockTest: ............
ezcWebdavLockDiscoveryPropertyTest: ............
ezcWebdavResourceTypePropertyTest: ............
ezcWebdavSourcePropertyLinkTest: ............
ezcWebdavSourcePropertyTest: ............
ezcWebdavSupportedLockPropertyLockentryTest: ............
ezcWebdavSupportedLockPropertyTest: ............
ezcWebdavCopyRequestTest: ........
ezcWebdavLockRequestTest: ........
ezcWebdavMoveRequestTest: ........
ezcWebdavPropFindRequestTest: ........
ezcWebdavPropPatchRequestTest: ......
ezcWebdavUnlockRequestTest: ........
ezcWebdavRequestPropertyBehaviourContentTest: .......
ezcWebdavErrorResonseTest: .....
ezcWebdavGetResponseTest: ......
ezcWebdavOptionsResponseTest: ......
ezcWebdavResponseTest: ..........
ezcWebdavMemoryBackendTest: .....................................................FFFF.F.......
ezcWebdavFileBackendTest: ...........................................F.FFF.EF.E.E
ezcWebdavFileBackendOptionsTestCase: .......
ezcWebdavBasicPathFactoryTest: ..........
ezcWebdavAutomaticPathFactoryTest: ...........
ezcWebdavClientRfcTest: ................
ezcWebdavClientLitmusTest: ...........................................................................................................................................................
ezcWebdavClientCadaverTest: .................................
ezcWebdavClientNautilusTest: F
Time: 3 seconds
There were 3 errors:
1) testPropPatchSetLiveProperty(ezcWebdavFileBackendTest)
ezcBasePropertyNotFoundException: No such property name 'mime'.
/home/derick/dev/ezcomponents/trunk/Webdav/src/transports/property_handler.php:453
/home/derick/dev/ezcomponents/trunk/Webdav/src/transports/property_handler.php:246
/home/derick/dev/ezcomponents/trunk/Webdav/src/backends/file.php:408
/home/derick/dev/ezcomponents/trunk/Webdav/src/backends/file.php:479
/home/derick/dev/ezcomponents/trunk/Webdav/src/backends/simple.php:631
/home/derick/dev/ezcomponents/trunk/Webdav/src/backends/file.php:937
/home/derick/dev/ezcomponents/trunk/Webdav/tests/backend_file_test.php:1581
/home/derick/dev/ezcomponents/trunk/Webdav/tests/test_case.php:44
/home/derick/dev/ezcomponents/trunk/UnitTest/src/test/runner.php:209
/home/derick/dev/ezcomponents/trunk/UnitTest/src/test/runner.php:20
/home/derick/dev/ezcomponents/trunk/UnitTest/src/runtests.php:27
2) testPropPatchFailOnRemoveProperty(ezcWebdavFileBackendTest)
ezcBasePropertyNotFoundException: No such property name 'mime'.
/home/derick/dev/ezcomponents/trunk/Webdav/src/transports/property_handler.php:453
/home/derick/dev/ezcomponents/trunk/Webdav/src/transports/property_handler.php:246
/home/derick/dev/ezcomponents/trunk/Webdav/src/backends/file.php:408
/home/derick/dev/ezcomponents/trunk/Webdav/src/backends/file.php:479
/home/derick/dev/ezcomponents/trunk/Webdav/src/backends/simple.php:631
/home/derick/dev/ezcomponents/trunk/Webdav/src/backends/file.php:937
/home/derick/dev/ezcomponents/trunk/Webdav/tests/backend_file_test.php:1776
/home/derick/dev/ezcomponents/trunk/Webdav/tests/test_case.php:44
/home/derick/dev/ezcomponents/trunk/UnitTest/src/test/runner.php:209
/home/derick/dev/ezcomponents/trunk/UnitTest/src/test/runner.php:20
/home/derick/dev/ezcomponents/trunk/UnitTest/src/runtests.php:27
3) testPropPatchCombinedSetDeleteFail(ezcWebdavFileBackendTest)
ezcBasePropertyNotFoundException: No such property name 'mime'.
/home/derick/dev/ezcomponents/trunk/Webdav/src/transports/property_handler.php:453
/home/derick/dev/ezcomponents/trunk/Webdav/src/transports/property_handler.php:246
/home/derick/dev/ezcomponents/trunk/Webdav/src/backends/file.php:408
/home/derick/dev/ezcomponents/trunk/Webdav/src/backends/file.php:479
/home/derick/dev/ezcomponents/trunk/Webdav/src/backends/simple.php:631
/home/derick/dev/ezcomponents/trunk/Webdav/src/backends/file.php:937
/home/derick/dev/ezcomponents/trunk/Webdav/tests/backend_file_test.php:1932
/home/derick/dev/ezcomponents/trunk/Webdav/tests/test_case.php:44
/home/derick/dev/ezcomponents/trunk/UnitTest/src/test/runner.php:209
/home/derick/dev/ezcomponents/trunk/UnitTest/src/test/runner.php:20
/home/derick/dev/ezcomponents/trunk/UnitTest/src/runtests.php:27
There were 11 failures:
1) testPropFindNamesOnCollection(ezcWebdavMemoryBackendTest)
Expected response does not match real response.
Failed asserting that two objects are equal.
--- Expected
+++ Actual
@@ -99,27 +99,6 @@
)
- [getcontenttype] => ezcWebdavGetContentTypeProperty Object
- (
- [properties:protected] => Array
- (
- [hasError] =>
- [errors] => Array
- (
- )
-
- [namespace] => DAV:
- [name] => getcontenttype
- [mime] =>
- [charset] =>
- )
-
- [pluginData:protected] => Array
- (
- )
-
- )
-
[getetag] => ezcWebdavGetEtagProperty Object
(
[properties:protected] => Array
@@ -227,28 +206,22 @@
[3] => Array
(
[0] => DAV:
- [1] => getcontenttype
- )
-
- [4] => Array
- (
- [0] => DAV:
[1] => getetag
)
- [5] => Array
+ [4] => Array
(
[0] => DAV:
[1] => getlastmodified
)
- [6] => Array
+ [5] => Array
(
[0] => DAV:
[1] => getcontentlength
)
- [7] => Array
+ [6] => Array
(
[0] => DAV:
[1] => resourcetype
@@ -257,7 +230,7 @@
)
[propertyOrderPosition:protected] => 0
- [propertyOrderNextId:protected] => 8
+ [propertyOrderNextId:protected] => 7
)
)
/home/derick/dev/ezcomponents/trunk/Webdav/tests/backend_memory_test.php:1985
/home/derick/dev/ezcomponents/trunk/Webdav/tests/test_case.php:44
/home/derick/dev/ezcomponents/trunk/UnitTest/src/test/runner.php:209
/home/derick/dev/ezcomponents/trunk/UnitTest/src/test/runner.php:20
/home/derick/dev/ezcomponents/trunk/UnitTest/src/runtests.php:27
2) testPropFindNamesOnCollectionDepthZero(ezcWebdavMemoryBackendTest)
Expected response does not match real response.
Failed asserting that two objects are equal.
--- Expected
+++ Actual
@@ -99,27 +99,6 @@
)
- [getcontenttype] => ezcWebdavGetContentTypeProperty Object
- (
- [properties:protected] => Array
- (
- [hasError] =>
- [errors] => Array
- (
- )
-
- [namespace] => DAV:
- [name] => getcontenttype
- [mime] =>
- [charset] =>
- )
-
- [pluginData:protected] => Array
- (
- )
-
- )
-
[getetag] => ezcWebdavGetEtagProperty Object
(
[properties:protected] => Array
@@ -227,28 +206,22 @@
[3] => Array
(
[0] => DAV:
- [1] => getcontenttype
- )
-
- [4] => Array
- (
- [0] => DAV:
[1] => getetag
)
- [5] => Array
+ [4] => Array
(
[0] => DAV:
[1] => getlastmodified
)
- [6] => Array
+ [5] => Array
(
[0] => DAV:
[1] => getcontentlength
)
- [7] => Array
+ [6] => Array
(
[0] => DAV:
[1] => resourcetype
@@ -257,7 +230,7 @@
)
[propertyOrderPosition:protected] => 0
- [propertyOrderNextId:protected] => 8
+ [propertyOrderNextId:protected] => 7
)
)
/home/derick/dev/ezcomponents/trunk/Webdav/tests/backend_memory_test.php:2053
/home/derick/dev/ezcomponents/trunk/Webdav/tests/test_case.php:44
/home/derick/dev/ezcomponents/trunk/UnitTest/src/test/runner.php:209
/home/derick/dev/ezcomponents/trunk/UnitTest/src/test/runner.php:20
/home/derick/dev/ezcomponents/trunk/UnitTest/src/runtests.php:27
3) testPropFindNamesOnCollectionDepthOne(ezcWebdavMemoryBackendTest)
Expected response does not match real response.
Failed asserting that two objects are equal.
--- Expected
+++ Actual
@@ -99,27 +99,6 @@
)
- [getcontenttype] => ezcWebdavGetContentTypeProperty Object
- (
- [properties:protected] => Array
- (
- [hasError] =>
- [errors] => Array
- (
- )
-
- [namespace] => DAV:
- [name] => getcontenttype
- [mime] =>
- [charset] =>
- )
-
- [pluginData:protected] => Array
- (
- )
-
- )
-
[getetag] => ezcWebdavGetEtagProperty Object
(
[properties:protected] => Array
@@ -227,28 +206,22 @@
[3] => Array
(
[0] => DAV:
- [1] => getcontenttype
- )
-
- [4] => Array
- (
- [0] => DAV:
[1] => getetag
)
- [5] => Array
+ [4] => Array
(
[0] => DAV:
[1] => getlastmodified
)
- [6] => Array
+ [5] => Array
(
[0] => DAV:
[1] => getcontentlength
)
- [7] => Array
+ [6] => Array
(
[0] => DAV:
[1] => resourcetype
@@ -257,7 +230,7 @@
)
[propertyOrderPosition:protected] => 0
- [propertyOrderNextId:protected] => 8
+ [propertyOrderNextId:protected] => 7
)
)
@@ -371,27 +344,6 @@
)
- [getcontenttype] => ezcWebdavGetContentTypeProperty Object
- (
- [properties:protected] => Array
- (
- [hasError] =>
- [errors] => Array
- (
- )
-
- [namespace] => DAV:
- [name] => getcontenttype
- [mime] =>
- [charset] =>
- )
-
- [pluginData:protected] => Array
- (
- )
-
- )
-
[getetag] => ezcWebdavGetEtagProperty Object
(
[properties:protected] => Array
@@ -499,28 +451,22 @@
[3] => Array
(
[0] => DAV:
- [1] => getcontenttype
- )
-
- [4] => Array
- (
- [0] => DAV:
[1] => getetag
)
- [5] => Array
+ [4] => Array
(
[0] => DAV:
[1] => getlastmodified
)
- [6] => Array
+ [5] => Array
(
[0] => DAV:
[1] => getcontentlength
)
- [7] => Array
+ [6] => Array
(
[0] => DAV:
[1] => resourcetype
@@ -529,7 +475,7 @@
)
[propertyOrderPosition:protected] => 0
- [propertyOrderNextId:protected] => 8
+ [propertyOrderNextId:protected] => 7
)
)
/home/derick/dev/ezcomponents/trunk/Webdav/tests/backend_memory_test.php:2137
/home/derick/dev/ezcomponents/trunk/Webdav/tests/test_case.php:44
/home/derick/dev/ezcomponents/trunk/UnitTest/src/test/runner.php:209
/home/derick/dev/ezcomponents/trunk/UnitTest/src/test/runner.php:20
/home/derick/dev/ezcomponents/trunk/UnitTest/src/runtests.php:27
4) testPropFindNamesOnCollectionDepthInfinite(ezcWebdavMemoryBackendTest)
Expected response does not match real response.
Failed asserting that two objects are equal.
--- Expected
+++ Actual
@@ -99,27 +99,6 @@
)
- [getcontenttype] => ezcWebdavGetContentTypeProperty Object
- (
- [properties:protected] => Array
- (
- [hasError] =>
- [errors] => Array
- (
- )
-
- [namespace] => DAV:
- [name] => getcontenttype
- [mime] =>
- [charset] =>
- )
-
- [pluginData:protected] => Array
- (
- )
-
- )
-
[getetag] => ezcWebdavGetEtagProperty Object
(
[properties:protected] => Array
@@ -227,28 +206,22 @@
[3] => Array
(
[0] => DAV:
- [1] => getcontenttype
- )
-
- [4] => Array
- (
- [0] => DAV:
[1] => getetag
)
- [5] => Array
+ [4] => Array
(
[0] => DAV:
[1] => getlastmodified
)
- [6] => Array
+ [5] => Array
(
[0] => DAV:
[1] => getcontentlength
)
- [7] => Array
+ [6] => Array
(
[0] => DAV:
[1] => resourcetype
@@ -257,7 +230,7 @@
)
[propertyOrderPosition:protected] => 0
- [propertyOrderNextId:protected] => 8
+ [propertyOrderNextId:protected] => 7
)
)
@@ -371,27 +344,6 @@
)
- [getcontenttype] => ezcWebdavGetContentTypeProperty Object
- (
- [properties:protected] => Array
- (
- [hasError] =>
- [errors] => Array
- (
- )
-
- [namespace] => DAV:
- [name] => getcontenttype
- [mime] =>
- [charset] =>
- )
-
- [pluginData:protected] => Array
- (
- )
-
- )
-
[getetag] => ezcWebdavGetEtagProperty Object
(
[properties:protected] => Array
@@ -499,28 +451,22 @@
[3] => Array
(
[0] => DAV:
- [1] => getcontenttype
- )
-
- [4] => Array
- (
- [0] => DAV:
[1] => getetag
)
- [5] => Array
+ [4] => Array
(
[0] => DAV:
[1] => getlastmodified
)
- [6] => Array
+ [5] => Array
(
[0] => DAV:
[1] => getcontentlength
)
- [7] => Array
+ [6] => Array
(
[0] => DAV:
[1] => resourcetype
@@ -529,7 +475,7 @@
)
[propertyOrderPosition:protected] => 0
- [propertyOrderNextId:protected] => 8
+ [propertyOrderNextId:protected] => 7
)
)
@@ -912,27 +858,6 @@
)
- [getcontenttype] => ezcWebdavGetContentTypeProperty Object
- (
- [properties:protected] => Array
- (
- [hasError] =>
- [errors] => Array
- (
- )
-
- [namespace] => DAV:
- [name] => getcontenttype
- [mime] =>
- [charset] =>
- )
-
- [pluginData:protected] => Array
- (
- )
-
- )
-
[getetag] => ezcWebdavGetEtagProperty Object
(
[properties:protected] => Array
@@ -1040,28 +965,22 @@
[3] => Array
(
[0] => DAV:
- [1] => getcontenttype
- )
-
- [4] => Array
- (
- [0] => DAV:
[1] => getetag
)
- [5] => Array
+ [4] => Array
(
[0] => DAV:
[1] => getlastmodified
)
- [6] => Array
+ [5] => Array
(
[0] => DAV:
[1] => getcontentlength
)
- [7] => Array
+ [6] => Array
(
[0] => DAV:
[1] => resourcetype
@@ -1070,7 +989,7 @@
)
[propertyOrderPosition:protected] => 0
- [propertyOrderNextId:protected] => 8
+ [propertyOrderNextId:protected] => 7
)
)
/home/derick/dev/ezcomponents/trunk/Webdav/tests/backend_memory_test.php:2237
/home/derick/dev/ezcomponents/trunk/Webdav/tests/test_case.php:44
/home/derick/dev/ezcomponents/trunk/UnitTest/src/test/runner.php:209
/home/derick/dev/ezcomponents/trunk/UnitTest/src/test/runner.php:20
/home/derick/dev/ezcomponents/trunk/UnitTest/src/runtests.php:27
5) testPropFindAllPropsOnCollection(ezcWebdavMemoryBackendTest)
Expected response does not match real response.
Failed asserting that two objects are equal.
--- Expected
+++ Actual
@@ -104,27 +104,6 @@
)
- [getcontenttype] => ezcWebdavGetContentTypeProperty Object
- (
- [properties:protected] => Array
- (
- [hasError] =>
- [errors] => Array
- (
- )
-
- [namespace] => DAV:
- [name] => getcontenttype
- [mime] => application/octet-stream
- [charset] =>
- )
-
- [pluginData:protected] => Array
- (
- )
-
- )
-
[getetag] => ezcWebdavGetEtagProperty Object
(
[properties:protected] => Array
@@ -236,28 +215,22 @@
[3] => Array
(
[0] => DAV:
- [1] => getcontenttype
- )
-
- [4] => Array
- (
- [0] => DAV:
[1] => getetag
)
- [5] => Array
+ [4] => Array
(
[0] => DAV:
[1] => getlastmodified
)
- [6] => Array
+ [5] => Array
(
[0] => DAV:
[1] => getcontentlength
)
- [7] => Array
+ [6] => Array
(
[0] => DAV:
[1] => resourcetype
@@ -266,7 +239,7 @@
)
[propertyOrderPosition:protected] => 0
- [propertyOrderNextId:protected] => 8
+ [propertyOrderNextId:protected] => 7
)
)
/home/derick/dev/ezcomponents/trunk/Webdav/tests/backend_memory_test.php:2401
/home/derick/dev/ezcomponents/trunk/Webdav/tests/test_case.php:44
/home/derick/dev/ezcomponents/trunk/UnitTest/src/test/runner.php:209
/home/derick/dev/ezcomponents/trunk/UnitTest/src/test/runner.php:20
/home/derick/dev/ezcomponents/trunk/UnitTest/src/runtests.php:27
6) testPropFindOnResource(ezcWebdavFileBackendTest)
Response does not equal serialzed response.
Failed asserting that two objects are equal.
--- Expected
+++ Actual
@@ -66,7 +66,7 @@
[name] => getlastmodified
[date] => ezcWebdavDateTime Object
(
- [backupTime:private] =>
+ [backupTime:private] => Tue, 19 Jan 2038 03:14:07 +0100
)
)
@@ -183,7 +183,6 @@
[headers:protected] => Array
(
- [Content-Type] => text/xml; charset="utf-8"
)
)
/home/derick/dev/ezcomponents/trunk/Webdav/tests/backend_file_test.php:70
/home/derick/dev/ezcomponents/trunk/Webdav/tests/backend_file_test.php:1292
/home/derick/dev/ezcomponents/trunk/Webdav/tests/test_case.php:44
/home/derick/dev/ezcomponents/trunk/UnitTest/src/test/runner.php:209
/home/derick/dev/ezcomponents/trunk/UnitTest/src/test/runner.php:20
/home/derick/dev/ezcomponents/trunk/UnitTest/src/runtests.php:27
7) testPropFindNamesOnResource(ezcWebdavFileBackendTest)
Response does not equal serialzed response.
Failed asserting that two objects are equal.
--- Expected
+++ Actual
@@ -137,14 +137,14 @@
(
[properties:protected] => Array
(
- [hasError] => 1
+ [hasError] =>
[errors] => Array
(
- [0] => The property 'mime' only accepts values of type 'string' - 'boolean' given.
)
[namespace] => DAV:
[name] => getcontenttype
+ [mime] =>
[charset] =>
)
@@ -304,7 +304,6 @@
[headers:protected] => Array
(
- [Content-Type] => text/xml; charset="utf-8"
)
)
/home/derick/dev/ezcomponents/trunk/Webdav/tests/backend_file_test.php:70
/home/derick/dev/ezcomponents/trunk/Webdav/tests/backend_file_test.php:1435
/home/derick/dev/ezcomponents/trunk/Webdav/tests/test_case.php:44
/home/derick/dev/ezcomponents/trunk/UnitTest/src/test/runner.php:209
/home/derick/dev/ezcomponents/trunk/UnitTest/src/test/runner.php:20
/home/derick/dev/ezcomponents/trunk/UnitTest/src/runtests.php:27
8) testPropFindNamesOnCollectionDepthZero(ezcWebdavFileBackendTest)
Response does not equal serialzed response.
Failed asserting that two objects are equal.
--- Expected
+++ Actual
@@ -140,14 +140,14 @@
(
[properties:protected] => Array
(
- [hasError] => 1
+ [hasError] =>
[errors] => Array
(
- [0] => The property 'mime' only accepts values of type 'string' - 'boolean' given.
)
[namespace] => DAV:
[name] => getcontenttype
+ [mime] =>
[charset] =>
)
@@ -307,7 +307,6 @@
[headers:protected] => Array
(
- [Content-Type] => text/xml; charset="utf-8"
)
)
/home/derick/dev/ezcomponents/trunk/Webdav/tests/backend_file_test.php:70
/home/derick/dev/ezcomponents/trunk/Webdav/tests/backend_file_test.php:1448
/home/derick/dev/ezcomponents/trunk/Webdav/tests/test_case.php:44
/home/derick/dev/ezcomponents/trunk/UnitTest/src/test/runner.php:209
/home/derick/dev/ezcomponents/trunk/UnitTest/src/test/runner.php:20
/home/derick/dev/ezcomponents/trunk/UnitTest/src/runtests.php:27
9) testPropFindAllPropsOnResource(ezcWebdavFileBackendTest)
Response does not equal serialzed response.
Failed asserting that two objects are equal.
--- Expected
+++ Actual
@@ -66,7 +66,7 @@
[name] => getlastmodified
[date] => ezcWebdavDateTime Object
(
- [backupTime:private] =>
+ [backupTime:private] => Tue, 19 Jan 2038 03:14:07 +0100
)
)
@@ -90,7 +90,7 @@
[name] => creationdate
[date] => ezcWebdavDateTime Object
(
- [backupTime:private] =>
+ [backupTime:private] => Thu, 11 Oct 2007 13:53:42 +0100
)
)
@@ -145,14 +145,14 @@
(
[properties:protected] => Array
(
- [hasError] => 1
+ [hasError] =>
[errors] => Array
(
- [0] => The property 'mime' only accepts values of type 'string' - 'boolean' given.
)
[namespace] => DAV:
[name] => getcontenttype
+ [mime] => text/plain
[charset] =>
)
@@ -312,7 +312,6 @@
[headers:protected] => Array
(
- [Content-Type] => text/xml; charset="utf-8"
)
)
/home/derick/dev/ezcomponents/trunk/Webdav/tests/backend_file_test.php:70
/home/derick/dev/ezcomponents/trunk/Webdav/tests/backend_file_test.php:1494
/home/derick/dev/ezcomponents/trunk/Webdav/tests/test_case.php:44
/home/derick/dev/ezcomponents/trunk/UnitTest/src/test/runner.php:209
/home/derick/dev/ezcomponents/trunk/UnitTest/src/test/runner.php:20
/home/derick/dev/ezcomponents/trunk/UnitTest/src/runtests.php:27
10) testPropPatchAddPropertyFail(ezcWebdavFileBackendTest)
Response does not equal serialzed response.
Failed asserting that two objects are equal.
--- Expected
+++ Actual
@@ -153,7 +153,6 @@
[headers:protected] => Array
(
- [Content-Type] => text/xml; charset="utf-8"
)
)
/home/derick/dev/ezcomponents/trunk/Webdav/tests/backend_file_test.php:70
/home/derick/dev/ezcomponents/trunk/Webdav/tests/backend_file_test.php:1644
/home/derick/dev/ezcomponents/trunk/Webdav/tests/test_case.php:44
/home/derick/dev/ezcomponents/trunk/UnitTest/src/test/runner.php:209
/home/derick/dev/ezcomponents/trunk/UnitTest/src/test/runner.php:20
/home/derick/dev/ezcomponents/trunk/UnitTest/src/runtests.php:27
11) Warning(PHPUnit_Framework_Warning)
No client tests found in class "ezcWebdavClientNautilusTest".
/home/derick/dev/ezcomponents/trunk/UnitTest/src/test/runner.php:209
/home/derick/dev/ezcomponents/trunk/UnitTest/src/test/runner.php:20
/home/derick/dev/ezcomponents/trunk/UnitTest/src/runtests.php:27
FAILURES!
Tests: 716, Failures: 11, Errors: 3.