All pastes #73931 Raw Edit

config.log

public text v1 · immutable
#73931 ·published 2006-06-28 13:31 UTC
rendered paste body
This file contains any messages produced by compilers while
running configure, to aid debugging if configure makes a mistake.

It was created by supertux configure 0.2-svn, which was
generated by GNU Autoconf 2.59.  Invocation command line was

  $ ./configure --enable-debug

## --------- ##
## Platform. ##
## --------- ##

hostname = IBM
uname -m = i686
uname -r = 1.0.11(0.46/3/2)
uname -s = MINGW32_NT-5.1
uname -v = 2004-04-30 18:55

/usr/bin/uname -p = unknown
/bin/uname -X     = unknown

/bin/arch              = unknown
/usr/bin/arch -k       = unknown
/usr/convex/getsysinfo = unknown
hostinfo               = unknown
/bin/machine           = unknown
/usr/bin/oslevel       = unknown
/bin/universe          = unknown

PATH: .
PATH: /usr/local/bin
PATH: /mingw/bin
PATH: /bin
PATH: /mingw/bin
PATH: /c/watcom/BINNT
PATH: /c/watcom/BINW
PATH: /c/PROGRAM FILES/THINKPAD/UTILITIES
PATH: /c/WINDOWS/system32
PATH: /c/WINDOWS
PATH: /c/WINDOWS/System32/Wbem
PATH: /c/Program Files/ATI Technologies/ATI Control Panel
PATH: /c/Program Files/PC-Doctor for Windows/services
PATH: /c/Program Files/Common Files/GTK/2.0/bin
PATH: /c/Program Files/QuickTime/QTSystem/


## ----------- ##
## Core tests. ##
## ----------- ##

configure:1385: checking build system type
configure:1403: result: i686-pc-mingw32
configure:1411: checking host system type
configure:1425: result: i686-pc-mingw32
configure:1433: checking target system type
configure:1447: result: i686-pc-mingw32
configure:1516: checking for gcc
configure:1532: found /mingw/bin/gcc
configure:1542: result: gcc
configure:1786: checking for C compiler version
configure:1789: gcc --version </dev/null >&5
gcc.exe (GCC) 3.4.4 (mingw special)
Copyright (C) 2004 Free Software Foundation, Inc.
This is free software; see the source for copying conditions.  There is NO
warranty; not even for MERCHANTABILITY or FITNESS FOR A PARTICULAR PURPOSE.

configure:1792: $? = 0
configure:1794: gcc -v </dev/null >&5
Reading specs from c:/MinGW/bin/../lib/gcc/mingw32/3.4.4/specs
Configured with: ../gcc/configure --with-gcc --with-gnu-ld --with-gnu-as --host=mingw32 --target=mingw32 --prefix=/mingw --enable-threads --disable-nls --enable-languages=c,c++,f77,ada,objc,java --disable-win32-registry --disable-shared --enable-sjlj-exceptions --enable-libgcj --disable-java-awt --without-x --enable-java-gc=boehm --disable-libgcj-debug --enable-interpreter --enable-hash-synchronization --enable-libstdcxx-debug
Thread model: win32
gcc version 3.4.4 (mingw special)
configure:1797: $? = 0
configure:1799: gcc -V </dev/null >&5
gcc.exe: `-V' option must have argument
configure:1802: $? = 1
configure:1825: checking for C compiler default output file name
configure:1828: gcc -I/usr/local/include   conftest.c  >&5
configure:1831: $? = 0
configure:1877: result: a.exe
configure:1882: checking whether the C compiler works
configure:1888: ./a.exe
configure:1891: $? = 0
configure:1908: result: yes
configure:1915: checking whether we are cross compiling
configure:1917: result: no
configure:1920: checking for suffix of executables
configure:1922: gcc -o conftest.exe -I/usr/local/include   conftest.c  >&5
configure:1925: $? = 0
configure:1950: result: .exe
configure:1956: checking for suffix of object files
configure:1977: gcc -c -I/usr/local/include  conftest.c >&5
configure:1980: $? = 0
configure:2002: result: o
configure:2006: checking whether we are using the GNU C compiler
configure:2030: gcc -c -I/usr/local/include  conftest.c >&5
configure:2036: $? = 0
configure:2040: test -z 
			 || test ! -s conftest.err
configure:2043: $? = 0
configure:2046: test -s conftest.o
configure:2049: $? = 0
configure:2062: result: yes
configure:2068: checking whether gcc accepts -g
configure:2089: gcc -c -g  conftest.c >&5
configure:2095: $? = 0
configure:2099: test -z 
			 || test ! -s conftest.err
configure:2102: $? = 0
configure:2105: test -s conftest.o
configure:2108: $? = 0
configure:2119: result: yes
configure:2136: checking for gcc option to accept ANSI C
configure:2206: gcc  -c -I/usr/local/include  conftest.c >&5
configure:2212: $? = 0
configure:2216: test -z 
			 || test ! -s conftest.err
configure:2219: $? = 0
configure:2222: test -s conftest.o
configure:2225: $? = 0
configure:2243: result: none needed
configure:2261: gcc -c -I/usr/local/include  conftest.c >&5
conftest.c:2: error: syntax error before "me"
configure:2267: $? = 1
configure: failed program was:
| #ifndef __cplusplus
|   choke me
| #endif
configure:2452: checking for g++
configure:2468: found /mingw/bin/g++
configure:2478: result: g++
configure:2494: checking for C++ compiler version
configure:2497: g++ --version </dev/null >&5
g++.exe (GCC) 3.4.4 (mingw special)
Copyright (C) 2004 Free Software Foundation, Inc.
This is free software; see the source for copying conditions.  There is NO
warranty; not even for MERCHANTABILITY or FITNESS FOR A PARTICULAR PURPOSE.

configure:2500: $? = 0
configure:2502: g++ -v </dev/null >&5
Reading specs from c:/MinGW/bin/../lib/gcc/mingw32/3.4.4/specs
Configured with: ../gcc/configure --with-gcc --with-gnu-ld --with-gnu-as --host=mingw32 --target=mingw32 --prefix=/mingw --enable-threads --disable-nls --enable-languages=c,c++,f77,ada,objc,java --disable-win32-registry --disable-shared --enable-sjlj-exceptions --enable-libgcj --disable-java-awt --without-x --enable-java-gc=boehm --disable-libgcj-debug --enable-interpreter --enable-hash-synchronization --enable-libstdcxx-debug
Thread model: win32
gcc version 3.4.4 (mingw special)
configure:2505: $? = 0
configure:2507: g++ -V </dev/null >&5
g++.exe: `-V' option must have argument
configure:2510: $? = 1
configure:2513: checking whether we are using the GNU C++ compiler
configure:2537: g++ -c   -ffast-math  conftest.cc >&5
configure:2543: $? = 0
configure:2547: test -z 
			 || test ! -s conftest.err
configure:2550: $? = 0
configure:2553: test -s conftest.o
configure:2556: $? = 0
configure:2569: result: yes
configure:2575: checking whether g++ accepts -g
configure:2596: g++ -c -g  conftest.cc >&5
configure:2602: $? = 0
configure:2606: test -z 
			 || test ! -s conftest.err
configure:2609: $? = 0
configure:2612: test -s conftest.o
configure:2615: $? = 0
configure:2626: result: yes
configure:2668: g++ -c   -ffast-math  conftest.cc >&5
configure:2674: $? = 0
configure:2678: test -z 
			 || test ! -s conftest.err
configure:2681: $? = 0
configure:2684: test -s conftest.o
configure:2687: $? = 0
configure:2713: g++ -c   -ffast-math  conftest.cc >&5
conftest.cc: In function `int main()':
conftest.cc:13: error: `exit' undeclared (first use this function)
conftest.cc:13: error: (Each undeclared identifier is reported only once for each function it appears in.)
configure:2719: $? = 1
configure: failed program was:
| /* confdefs.h.  */
| 
| #define PACKAGE_NAME "supertux"
| #define PACKAGE_TARNAME "supertux"
| #define PACKAGE_VERSION "0.2-svn"
| #define PACKAGE_STRING "supertux 0.2-svn"
| #define PACKAGE_BUGREPORT ""
| /* end confdefs.h.  */
| 
| int
| main ()
| {
| exit (42);
|   ;
|   return 0;
| }
configure:2668: g++ -c   -ffast-math  conftest.cc >&5
configure:2674: $? = 0
configure:2678: test -z 
			 || test ! -s conftest.err
configure:2681: $? = 0
configure:2684: test -s conftest.o
configure:2687: $? = 0
configure:2713: g++ -c   -ffast-math  conftest.cc >&5
configure:2719: $? = 0
configure:2723: test -z 
			 || test ! -s conftest.err
configure:2726: $? = 0
configure:2729: test -s conftest.o
configure:2732: $? = 0
configure:2768: checking for a BSD-compatible install
configure:2823: result: /bin/install -c
configure:2836: checking for ar
configure:2854: found /mingw/bin/ar
configure:2866: result: /mingw/bin/ar
configure:2881: checking whether byte ordering is bigendian
configure:2908: gcc -c -I/usr/local/include  conftest.c >&5
configure:2914: $? = 0
configure:2918: test -z 
			 || test ! -s conftest.err
configure:2921: $? = 0
configure:2924: test -s conftest.o
configure:2927: $? = 0
configure:2951: gcc -c -I/usr/local/include  conftest.c >&5
conftest.c: In function `main':
conftest.c:19: error: `not' undeclared (first use in this function)
conftest.c:19: error: (Each undeclared identifier is reported only once
conftest.c:19: error: for each function it appears in.)
conftest.c:19: error: syntax error before "big"
configure:2957: $? = 1
configure: failed program was:
| /* confdefs.h.  */
| 
| #define PACKAGE_NAME "supertux"
| #define PACKAGE_TARNAME "supertux"
| #define PACKAGE_VERSION "0.2-svn"
| #define PACKAGE_STRING "supertux 0.2-svn"
| #define PACKAGE_BUGREPORT ""
| #ifdef __cplusplus
| extern "C" void std::exit (int) throw (); using std::exit;
| #endif
| /* end confdefs.h.  */
| #include <sys/types.h>
| #include <sys/param.h>
| 
| int
| main ()
| {
| #if BYTE_ORDER != BIG_ENDIAN
|  not big endian
| #endif
| 
|   ;
|   return 0;
| }
configure:3092: result: no
configure:3116: checking for xgettext
configure:3145: result: no
configure:3116: checking for xgettext.exe
configure:3145: result: no
configure:3171: checking for flex
configure:3200: result: no
configure:3171: checking for lex
configure:3200: result: no
configure:3210: checking for yywrap in -lfl
configure:3240: gcc -o conftest.exe -I/usr/local/include   conftest.c -lfl   >&5
c:\MinGW\bin\..\lib\gcc\mingw32\3.4.4\..\..\..\..\mingw32\bin\ld.exe: cannot find -lfl
collect2: ld returned 1 exit status
configure:3246: $? = 1
configure: failed program was:
| /* confdefs.h.  */
| 
| #define PACKAGE_NAME "supertux"
| #define PACKAGE_TARNAME "supertux"
| #define PACKAGE_VERSION "0.2-svn"
| #define PACKAGE_STRING "supertux 0.2-svn"
| #define PACKAGE_BUGREPORT ""
| #ifdef __cplusplus
| extern "C" void std::exit (int) throw (); using std::exit;
| #endif
| /* end confdefs.h.  */
| 
| /* Override any gcc2 internal prototype to avoid an error.  */
| #ifdef __cplusplus
| extern "C"
| #endif
| /* We use char because int might match the return type of a gcc2
|    builtin and then its argument prototype would still apply.  */
| char yywrap ();
| int
| main ()
| {
| yywrap ();
|   ;
|   return 0;
| }
configure:3272: result: no
configure:3277: checking for yywrap in -ll
configure:3307: gcc -o conftest.exe -I/usr/local/include   conftest.c -ll   >&5
c:\MinGW\bin\..\lib\gcc\mingw32\3.4.4\..\..\..\..\mingw32\bin\ld.exe: cannot find -ll
collect2: ld returned 1 exit status
configure:3313: $? = 1
configure: failed program was:
| /* confdefs.h.  */
| 
| #define PACKAGE_NAME "supertux"
| #define PACKAGE_TARNAME "supertux"
| #define PACKAGE_VERSION "0.2-svn"
| #define PACKAGE_STRING "supertux 0.2-svn"
| #define PACKAGE_BUGREPORT ""
| #ifdef __cplusplus
| extern "C" void std::exit (int) throw (); using std::exit;
| #endif
| /* end confdefs.h.  */
| 
| /* Override any gcc2 internal prototype to avoid an error.  */
| #ifdef __cplusplus
| extern "C"
| #endif
| /* We use char because int might match the return type of a gcc2
|    builtin and then its argument prototype would still apply.  */
| char yywrap ();
| int
| main ()
| {
| yywrap ();
|   ;
|   return 0;
| }
configure:3339: result: no
configure:3447: checking for bison
configure:3476: result: no
configure:3447: checking for bison.exe
configure:3476: result: no
configure:3493: checking for dirent.h that defines DIR
configure:3517: gcc -c -I/usr/local/include  conftest.c >&5
configure:3523: $? = 0
configure:3527: test -z 
			 || test ! -s conftest.err
configure:3530: $? = 0
configure:3533: test -s conftest.o
configure:3536: $? = 0
configure:3547: result: yes
configure:3560: checking for library containing opendir
configure:3590: gcc -o conftest.exe -I/usr/local/include   conftest.c  >&5
configure:3596: $? = 0
configure:3600: test -z 
			 || test ! -s conftest.err
configure:3603: $? = 0
configure:3606: test -s conftest.exe
configure:3609: $? = 0
configure:3679: result: none required
configure:3820: checking how to run the C preprocessor
configure:3855: gcc -E  conftest.c
configure:3861: $? = 0
configure:3893: gcc -E  conftest.c
conftest.c:13:28: ac_nonexistent.h: No such file or directory
configure:3899: $? = 1
configure: failed program was:
| /* confdefs.h.  */
| 
| #define PACKAGE_NAME "supertux"
| #define PACKAGE_TARNAME "supertux"
| #define PACKAGE_VERSION "0.2-svn"
| #define PACKAGE_STRING "supertux 0.2-svn"
| #define PACKAGE_BUGREPORT ""
| #ifdef __cplusplus
| extern "C" void std::exit (int) throw (); using std::exit;
| #endif
| #define HAVE_DIRENT_H 1
| /* end confdefs.h.  */
| #include <ac_nonexistent.h>
configure:3938: result: gcc -E
configure:3962: gcc -E  conftest.c
configure:3968: $? = 0
configure:4000: gcc -E  conftest.c
conftest.c:13:28: ac_nonexistent.h: No such file or directory
configure:4006: $? = 1
configure: failed program was:
| /* confdefs.h.  */
| 
| #define PACKAGE_NAME "supertux"
| #define PACKAGE_TARNAME "supertux"
| #define PACKAGE_VERSION "0.2-svn"
| #define PACKAGE_STRING "supertux 0.2-svn"
| #define PACKAGE_BUGREPORT ""
| #ifdef __cplusplus
| extern "C" void std::exit (int) throw (); using std::exit;
| #endif
| #define HAVE_DIRENT_H 1
| /* end confdefs.h.  */
| #include <ac_nonexistent.h>
configure:4050: checking for egrep
configure:4060: result: grep -E
configure:4065: checking for ANSI C header files
configure:4090: gcc -c -I/usr/local/include  conftest.c >&5
configure:4096: $? = 0
configure:4100: test -z 
			 || test ! -s conftest.err
configure:4103: $? = 0
configure:4106: test -s conftest.o
configure:4109: $? = 0
configure:4195: gcc -o conftest.exe -I/usr/local/include   conftest.c  >&5
configure:4198: $? = 0
configure:4200: ./conftest.exe
configure:4203: $? = 0
configure:4218: result: yes
configure:4242: checking for sys/types.h
configure:4258: gcc -c -I/usr/local/include  conftest.c >&5
configure:4264: $? = 0
configure:4268: test -z 
			 || test ! -s conftest.err
configure:4271: $? = 0
configure:4274: test -s conftest.o
configure:4277: $? = 0
configure:4288: result: yes
configure:4242: checking for sys/stat.h
configure:4258: gcc -c -I/usr/local/include  conftest.c >&5
configure:4264: $? = 0
configure:4268: test -z 
			 || test ! -s conftest.err
configure:4271: $? = 0
configure:4274: test -s conftest.o
configure:4277: $? = 0
configure:4288: result: yes
configure:4242: checking for stdlib.h
configure:4258: gcc -c -I/usr/local/include  conftest.c >&5
configure:4264: $? = 0
configure:4268: test -z 
			 || test ! -s conftest.err
configure:4271: $? = 0
configure:4274: test -s conftest.o
configure:4277: $? = 0
configure:4288: result: yes
configure:4242: checking for string.h
configure:4258: gcc -c -I/usr/local/include  conftest.c >&5
configure:4264: $? = 0
configure:4268: test -z 
			 || test ! -s conftest.err
configure:4271: $? = 0
configure:4274: test -s conftest.o
configure:4277: $? = 0
configure:4288: result: yes
configure:4242: checking for memory.h
configure:4258: gcc -c -I/usr/local/include  conftest.c >&5
configure:4264: $? = 0
configure:4268: test -z 
			 || test ! -s conftest.err
configure:4271: $? = 0
configure:4274: test -s conftest.o
configure:4277: $? = 0
configure:4288: result: yes
configure:4242: checking for strings.h
configure:4258: gcc -c -I/usr/local/include  conftest.c >&5
configure:4264: $? = 0
configure:4268: test -z 
			 || test ! -s conftest.err
configure:4271: $? = 0
configure:4274: test -s conftest.o
configure:4277: $? = 0
configure:4288: result: yes
configure:4242: checking for inttypes.h
configure:4258: gcc -c -I/usr/local/include  conftest.c >&5
configure:4264: $? = 0
configure:4268: test -z 
			 || test ! -s conftest.err
configure:4271: $? = 0
configure:4274: test -s conftest.o
configure:4277: $? = 0
configure:4288: result: yes
configure:4242: checking for stdint.h
configure:4258: gcc -c -I/usr/local/include  conftest.c >&5
configure:4264: $? = 0
configure:4268: test -z 
			 || test ! -s conftest.err
configure:4271: $? = 0
configure:4274: test -s conftest.o
configure:4277: $? = 0
configure:4288: result: yes
configure:4242: checking for unistd.h
configure:4258: gcc -c -I/usr/local/include  conftest.c >&5
configure:4264: $? = 0
configure:4268: test -z 
			 || test ! -s conftest.err
configure:4271: $? = 0
configure:4274: test -s conftest.o
configure:4277: $? = 0
configure:4288: result: yes
configure:4305: checking for unistd.h
configure:4310: result: yes
configure:4451: checking for an ANSI C-conforming const
configure:4518: gcc -c -I/usr/local/include  conftest.c >&5
configure:4524: $? = 0
configure:4528: test -z 
			 || test ! -s conftest.err
configure:4531: $? = 0
configure:4534: test -s conftest.o
configure:4537: $? = 0
configure:4548: result: yes
configure:4558: checking whether byte ordering is bigendian
configure:4769: result: no
configure:4788: checking for void *
configure:4812: gcc -c -I/usr/local/include  conftest.c >&5
configure:4818: $? = 0
configure:4822: test -z 
			 || test ! -s conftest.err
configure:4825: $? = 0
configure:4828: test -s conftest.o
configure:4831: $? = 0
configure:4842: result: yes
configure:4845: checking size of void *
configure:5164: gcc -o conftest.exe -I/usr/local/include   conftest.c  >&5
configure:5167: $? = 0
configure:5169: ./conftest.exe
configure:5172: $? = 0
configure:5195: result: 4
configure:5207: checking for build variant
configure:5239: result: debug
configure:5298: checking for ld used by GCC
configure:5362: result: c:/MinGW/mingw32/bin/ld.exe
configure:5371: checking if the linker (c:/MinGW/mingw32/bin/ld.exe) is GNU ld
configure:5384: result: yes
configure:5390: checking for shared library run path origin
configure:5403: result: done
configure:5833: checking for iconv
configure:5860: gcc -o conftest.exe -I/usr/local/include -I/usr/local/include  conftest.c  >&5
C:/DOCUME~1/EUGENE~1/LOCALS~1/Temp/ccU5baaa.o:conftest.c:(.text+0x3a): undefined reference to `_imp__libiconv_open'
C:/DOCUME~1/EUGENE~1/LOCALS~1/Temp/ccU5baaa.o:conftest.c:(.text+0x6a): undefined reference to `_imp__libiconv'
C:/DOCUME~1/EUGENE~1/LOCALS~1/Temp/ccU5baaa.o:conftest.c:(.text+0x77): undefined reference to `_imp__libiconv_close'
collect2: ld returned 1 exit status
configure:5866: $? = 1
configure: failed program was:
| /* confdefs.h.  */
| 
| #define PACKAGE_NAME "supertux"
| #define PACKAGE_TARNAME "supertux"
| #define PACKAGE_VERSION "0.2-svn"
| #define PACKAGE_STRING "supertux 0.2-svn"
| #define PACKAGE_BUGREPORT ""
| #ifdef __cplusplus
| extern "C" void std::exit (int) throw (); using std::exit;
| #endif
| #define HAVE_DIRENT_H 1
| #define STDC_HEADERS 1
| #define HAVE_SYS_TYPES_H 1
| #define HAVE_SYS_STAT_H 1
| #define HAVE_STDLIB_H 1
| #define HAVE_STRING_H 1
| #define HAVE_MEMORY_H 1
| #define HAVE_STRINGS_H 1
| #define HAVE_INTTYPES_H 1
| #define HAVE_STDINT_H 1
| #define HAVE_UNISTD_H 1
| #define HAVE_UNISTD_H 1
| #define SIZEOF_VOID_P 4
| #define DEBUG 1
| /* end confdefs.h.  */
| #include <stdlib.h>
| #include <iconv.h>
| int
| main ()
| {
| iconv_t cd = iconv_open("","");
|        iconv(cd,NULL,NULL,NULL,NULL);
|        iconv_close(cd);
|   ;
|   return 0;
| }
configure:5911: gcc -o conftest.exe -I/usr/local/include -I/usr/local/include  conftest.c  /usr/local/lib/libiconv.a >&5
configure:5917: $? = 0
configure:5921: test -z 
			 || test ! -s conftest.err
configure:5924: $? = 0
configure:5927: test -s conftest.exe
configure:5930: $? = 0
configure:5945: result: yes
configure:5955: checking how to link with libiconv
configure:5957: result: /usr/local/lib/libiconv.a
configure:5968: checking for iconv declaration
configure:6002: gcc -c -I/usr/local/include -I/usr/local/include conftest.c >&5
conftest.c:35: error: conflicting types for 'libiconv'
C:/msys/1.0/local/include/iconv.h:88: error: previous declaration of 'libiconv' was here
conftest.c:35: error: conflicting types for 'libiconv'
C:/msys/1.0/local/include/iconv.h:88: error: previous declaration of 'libiconv' was here
configure:6008: $? = 1
configure: failed program was:
| /* confdefs.h.  */
| 
| #define PACKAGE_NAME "supertux"
| #define PACKAGE_TARNAME "supertux"
| #define PACKAGE_VERSION "0.2-svn"
| #define PACKAGE_STRING "supertux 0.2-svn"
| #define PACKAGE_BUGREPORT ""
| #ifdef __cplusplus
| extern "C" void std::exit (int) throw (); using std::exit;
| #endif
| #define HAVE_DIRENT_H 1
| #define STDC_HEADERS 1
| #define HAVE_SYS_TYPES_H 1
| #define HAVE_SYS_STAT_H 1
| #define HAVE_STDLIB_H 1
| #define HAVE_STRING_H 1
| #define HAVE_MEMORY_H 1
| #define HAVE_STRINGS_H 1
| #define HAVE_INTTYPES_H 1
| #define HAVE_STDINT_H 1
| #define HAVE_UNISTD_H 1
| #define HAVE_UNISTD_H 1
| #define SIZEOF_VOID_P 4
| #define DEBUG 1
| #define HAVE_ICONV 1
| /* end confdefs.h.  */
| 
| #include <stdlib.h>
| #include <iconv.h>
| extern
| #ifdef __cplusplus
| "C"
| #endif
| #if defined(__STDC__) || defined(__cplusplus)
| size_t iconv (iconv_t cd, char * *inbuf, size_t *inbytesleft, char * *outbuf, size_t *outbytesleft);
| #else
| size_t iconv();
| #endif
| 
| int
| main ()
| {
| 
|   ;
|   return 0;
| }
configure:6036: result: 
         extern size_t iconv (iconv_t cd, const char * *inbuf, size_t *inbytesleft, char * *outbuf, size_t *outbytesleft);
configure:6091: checking for sdl-config
configure:6109: found /usr/local/bin/sdl-config
configure:6122: result: /usr/local/bin/sdl-config
configure:6130: checking for SDL - version >= 1.2.4
configure:6220: gcc -o conftest.exe -I/usr/local/include -I/usr/local/include/SDL -Dmain=SDL_main -I/usr/local/include  conftest.c  -L/usr/local/lib -lmingw32 -lSDLmain -lSDL -mwindows >&5
configure:6223: $? = 0
configure:6225: ./conftest.exe
configure:6228: $? = 0
configure:6246: result: yes
configure:6397: checking for Vorbis
configure:6444: gcc -o conftest.exe -I/usr/local/include   -I/usr/local/include  conftest.c   -lvorbis -lm -lvorbisenc  >&5
c:\MinGW\bin\..\lib\gcc\mingw32\3.4.4\..\..\..\..\mingw32\bin\ld.exe: cannot find -lvorbis
collect2: ld returned 1 exit status
configure:6447: $? = 1
configure: program exited with status 1
configure: failed program was:
| /* confdefs.h.  */
| 
| #define PACKAGE_NAME "supertux"
| #define PACKAGE_TARNAME "supertux"
| #define PACKAGE_VERSION "0.2-svn"
| #define PACKAGE_STRING "supertux 0.2-svn"
| #define PACKAGE_BUGREPORT ""
| #ifdef __cplusplus
| extern "C" void std::exit (int) throw (); using std::exit;
| #endif
| #define HAVE_DIRENT_H 1
| #define STDC_HEADERS 1
| #define HAVE_SYS_TYPES_H 1
| #define HAVE_SYS_STAT_H 1
| #define HAVE_STDLIB_H 1
| #define HAVE_STRING_H 1
| #define HAVE_MEMORY_H 1
| #define HAVE_STRINGS_H 1
| #define HAVE_INTTYPES_H 1
| #define HAVE_STDINT_H 1
| #define HAVE_UNISTD_H 1
| #define HAVE_UNISTD_H 1
| #define SIZEOF_VOID_P 4
| #define DEBUG 1
| #define HAVE_ICONV 1
| #define ICONV_CONST const
| /* end confdefs.h.  */
| 
| #include <stdio.h>
| #include <stdlib.h>
| #include <string.h>
| #include <vorbis/codec.h>
| #include <vorbis/vorbisenc.h>
| 
| int main ()
| {
|     vorbis_block 	vb;
|     vorbis_dsp_state	vd;
|     vorbis_info		vi;
| 
|     vorbis_info_init (&vi);
|     vorbis_encode_init (&vi, 2, 44100, -1, 128000, -1);
|     vorbis_analysis_init (&vd, &vi);
|     vorbis_block_init (&vd, &vb);
|     /* this function was added in 1.0rc3, so this is what we're testing for */
|     vorbis_bitrate_addblock (&vb);
| 
|     system("touch conf.vorbistest");
|     return 0;
| }
| 
| 
configure:6474: result: no
configure:6501: gcc -o conftest.exe -I/usr/local/include  -I/usr/local/include  conftest.c   -lvorbis -lm  >&5
c:\MinGW\bin\..\lib\gcc\mingw32\3.4.4\..\..\..\..\mingw32\bin\ld.exe: cannot find -lvorbis
collect2: ld returned 1 exit status
configure:6507: $? = 1
configure: failed program was:
| /* confdefs.h.  */
| 
| #define PACKAGE_NAME "supertux"
| #define PACKAGE_TARNAME "supertux"
| #define PACKAGE_VERSION "0.2-svn"
| #define PACKAGE_STRING "supertux 0.2-svn"
| #define PACKAGE_BUGREPORT ""
| #ifdef __cplusplus
| extern "C" void std::exit (int) throw (); using std::exit;
| #endif
| #define HAVE_DIRENT_H 1
| #define STDC_HEADERS 1
| #define HAVE_SYS_TYPES_H 1
| #define HAVE_SYS_STAT_H 1
| #define HAVE_STDLIB_H 1
| #define HAVE_STRING_H 1
| #define HAVE_MEMORY_H 1
| #define HAVE_STRINGS_H 1
| #define HAVE_INTTYPES_H 1
| #define HAVE_STDINT_H 1
| #define HAVE_UNISTD_H 1
| #define HAVE_UNISTD_H 1
| #define SIZEOF_VOID_P 4
| #define DEBUG 1
| #define HAVE_ICONV 1
| #define ICONV_CONST const
| /* end confdefs.h.  */
| 
| #include <stdio.h>
| #include <vorbis/codec.h>
| 
| int
| main ()
| {
|  return 0;
|   ;
|   return 0;
| }
configure:6548: error: Please install libvorbis

## ---------------- ##
## Cache variables. ##
## ---------------- ##

ac_cv_build=i686-pc-mingw32
ac_cv_build_alias=i686-pc-mingw32
ac_cv_c_bigendian=no
ac_cv_c_compiler_gnu=yes
ac_cv_c_const=yes
ac_cv_cxx_compiler_gnu=yes
ac_cv_env_CC_set=
ac_cv_env_CC_value=
ac_cv_env_CFLAGS_set=set
ac_cv_env_CFLAGS_value=-I/usr/local/include
ac_cv_env_CPPFLAGS_set=
ac_cv_env_CPPFLAGS_value=
ac_cv_env_CPP_set=
ac_cv_env_CPP_value=
ac_cv_env_CXXFLAGS_set=
ac_cv_env_CXXFLAGS_value=
ac_cv_env_CXX_set=
ac_cv_env_CXX_value=
ac_cv_env_LDFLAGS_set=
ac_cv_env_LDFLAGS_value=
ac_cv_env_build_alias_set=
ac_cv_env_build_alias_value=
ac_cv_env_host_alias_set=
ac_cv_env_host_alias_value=
ac_cv_env_target_alias_set=
ac_cv_env_target_alias_value=
ac_cv_exeext=.exe
ac_cv_header_dirent_dirent_h=yes
ac_cv_header_inttypes_h=yes
ac_cv_header_memory_h=yes
ac_cv_header_stdc=yes
ac_cv_header_stdint_h=yes
ac_cv_header_stdlib_h=yes
ac_cv_header_string_h=yes
ac_cv_header_strings_h=yes
ac_cv_header_sys_stat_h=yes
ac_cv_header_sys_types_h=yes
ac_cv_header_unistd_h=yes
ac_cv_host=i686-pc-mingw32
ac_cv_host_alias=i686-pc-mingw32
ac_cv_lib_fl_yywrap=no
ac_cv_lib_l_yywrap=no
ac_cv_objext=o
ac_cv_path_AR=/mingw/bin/ar
ac_cv_path_SDL_CONFIG=/usr/local/bin/sdl-config
ac_cv_path_install='/bin/install -c'
ac_cv_prog_CPP='gcc -E'
ac_cv_prog_ac_ct_CC=gcc
ac_cv_prog_ac_ct_CXX=g++
ac_cv_prog_cc_g=yes
ac_cv_prog_cc_stdc=
ac_cv_prog_cxx_g=yes
ac_cv_prog_egrep='grep -E'
ac_cv_search_opendir='none required'
ac_cv_sizeof_void_p=4
ac_cv_target=i686-pc-mingw32
ac_cv_target_alias=i686-pc-mingw32
ac_cv_type_void_p=yes
acl_cv_hardcode_direct=no
acl_cv_hardcode_libdir_flag_spec='${wl}-rpath ${wl}$libdir'
acl_cv_hardcode_libdir_separator=
acl_cv_hardcode_minus_L=no
acl_cv_libext=a
acl_cv_path_LD=c:/MinGW/mingw32/bin/ld.exe
acl_cv_prog_gnu_ld=yes
acl_cv_rpath=done
acl_cv_shlibext=dll
acl_cv_wl=-Wl,
am_cv_func_iconv=yes
am_cv_lib_iconv=yes
am_cv_proto_iconv='extern size_t iconv (iconv_t cd, const char * *inbuf, size_t *inbytesleft, char * *outbuf, size_t *outbytesleft);'
am_cv_proto_iconv_arg1=const

## ----------------- ##
## Output variables. ##
## ----------------- ##

AR='/mingw/bin/ar ru'
BISON=''
CC='gcc'
CFLAGS='-I/usr/local/include'
CPP='gcc -E'
CPPFLAGS='-I/usr/local/include'
CXX='g++'
CXXFLAGS='  -ffast-math'
DEFS=''
ECHO_C=''
ECHO_N='-n'
ECHO_T=''
EGREP='grep -E'
EXEEXT='.exe'
GL_CFLAGS=''
GL_LIBS=''
ICONV_LIBS='/usr/local/lib/libiconv.a'
INSTALL='/bin/install -c'
INSTALL_DATA='${INSTALL} -m 644'
INSTALL_PROGRAM='${INSTALL}'
INSTALL_SCRIPT='${INSTALL}'
LDFLAGS=''
LEX=':'
LEXLIB=''
LEX_LIBS=''
LEX_OUTPUT_ROOT=''
LIBICONV='/usr/local/lib/libiconv.a'
LIBOBJS=''
LIBS=''
LTLIBICONV='-L/usr/local/lib -liconv'
LTLIBOBJS=''
OBJEXT='o'
OGG_CFLAGS=''
OGG_LIBS=''
OPENAL_AVAILABLE=''
OPENAL_CFLAGS=''
OPENAL_LIBS=''
PACKAGE_BUGREPORT=''
PACKAGE_NAME='supertux'
PACKAGE_STRING='supertux 0.2-svn'
PACKAGE_TARNAME='supertux'
PACKAGE_VERSION='0.2-svn'
PATH_SEPARATOR=':'
PHYSFS_AVAILABLE=''
PHYSFS_CFLAGS=''
PHYSFS_LIBS=''
PTHREAD_CC=''
PTHREAD_CFLAGS=''
PTHREAD_LIBS=''
SDLIMAGE_AVAILABLE=''
SDLIMAGE_CFLAGS=''
SDLIMAGE_LIBS=''
SDL_CFLAGS='-I/usr/local/include/SDL -Dmain=SDL_main'
SDL_CONFIG='/usr/local/bin/sdl-config'
SDL_LIBS='-L/usr/local/lib -lmingw32 -lSDLmain -lSDL -mwindows'
SHELL='/bin/sh'
VARIANT='debug'
VORBISENC_LIBS=''
VORBISFILE_LIBS=''
VORBIS_CFLAGS=''
VORBIS_LIBS=''
XGETTEXT=''
ac_ct_CC='gcc'
ac_ct_CXX='g++'
acx_pthread_config=''
bindir='${exec_prefix}/bin'
build='i686-pc-mingw32'
build_alias=''
build_cpu='i686'
build_os='mingw32'
build_vendor='pc'
datadir='${prefix}/share'
enable_sqdbg='no'
exec_prefix='NONE'
host='i686-pc-mingw32'
host_alias=''
host_cpu='i686'
host_os='mingw32'
host_vendor='pc'
includedir='${prefix}/include'
infodir='${prefix}/info'
libdir='${exec_prefix}/lib'
libexecdir='${exec_prefix}/libexec'
localstatedir='${prefix}/var'
mandir='${prefix}/man'
oldincludedir='/usr/include'
prefix='NONE'
program_transform_name='s,x,x,'
sbindir='${exec_prefix}/sbin'
sharedstatedir='${prefix}/com'
sysconfdir='${prefix}/etc'
target='i686-pc-mingw32'
target_alias=''
target_cpu='i686'
target_os='mingw32'
target_vendor='pc'

## ----------- ##
## confdefs.h. ##
## ----------- ##

#define DEBUG 1
#define HAVE_DIRENT_H 1
#define HAVE_ICONV 1
#define HAVE_INTTYPES_H 1
#define HAVE_MEMORY_H 1
#define HAVE_STDINT_H 1
#define HAVE_STDLIB_H 1
#define HAVE_STRINGS_H 1
#define HAVE_STRING_H 1
#define HAVE_SYS_STAT_H 1
#define HAVE_SYS_TYPES_H 1
#define HAVE_UNISTD_H 1
#define HAVE_UNISTD_H 1
#define ICONV_CONST const
#define PACKAGE_BUGREPORT ""
#define PACKAGE_NAME "supertux"
#define PACKAGE_STRING "supertux 0.2-svn"
#define PACKAGE_TARNAME "supertux"
#define PACKAGE_VERSION "0.2-svn"
#define SIZEOF_VOID_P 4
#define STDC_HEADERS 1
#endif
#ifdef __cplusplus
extern "C" void std::exit (int) throw (); using std::exit;

configure: exit 1