All pastes #738904 Raw Edit

bsdfox

public text v1 · immutable
·published 2007-10-16 18:46 UTC
rendered paste body
>>> Emerging (1 of 2) app-emulation/xen-tools-3.1.1 to /
>>> Downloading 'http://distfiles.gentoo.org/distfiles/xen-3.1.1.tgz'
--11:01:53--  http://distfiles.gentoo.org/distfiles/xen-3.1.1.tgz
           => `/usr/portage/distfiles/xen-3.1.1.tgz'
Resolving distfiles.gentoo.org... 216.165.129.135, 156.56.247.195, 64.50.238.52, ...
Connecting to distfiles.gentoo.org|216.165.129.135|:80... connected.
HTTP request sent, awaiting response... 200 OK
Length: 6,868,014 (6.5M) [application/x-gzip]

100%[====================================>] 6,868,014      2.87K/s    ETA 00:00

11:43:10 (2.71 KB/s) - `/usr/portage/distfiles/xen-3.1.1.tgz' saved [6868014/6868014]

 * checking ebuild checksums ;-) ...                                      [ ok ]
 * checking auxfile checksums ;-) ...                                     [ ok ]
 * checking miscfile checksums ;-) ...                                    [ ok ]
 * checking xen-3.1.1.tgz ;-) ...                                         [ ok ]
>>> Unpacking source...
>>> Unpacking xen-3.1.1.tgz to /var/tmp/portage/app-emulation/xen-tools-3.1.1/work
 * Applying xen-tools-3.0.4_p1--as-needed.patch ...                       [ ok ]
 * Applying xen-tools-3.0.4_p1-network-bridge-broadcast.patch ...         [ ok ]
 * Applying xen-tools-3.1.0-xen-detect-nopie-fix.patch ...                [ ok ]
>>> Source unpacked.
>>> Compiling source in /var/tmp/portage/app-emulation/xen-tools-3.1.1/work/xen-3.1.1 ...
./configure --prefix=/usr --host=x86_64-pc-linux-gnu --mandir=/usr/share/man --infodir=/usr/share/info --datadir=/usr/share --sysconfdir=/etc --localstatedir=/var/lib --disable-system --disable-user --libdir=/usr/lib64 --build=x86_64-pc-linux-gnu
Install prefix    /usr
BIOS directory    /usr/share/xen/qemu
binary directory  /usr/lib64/xen/bin
Manual directory  /usr/share/man
ELF interp prefix
Source path       /var/tmp/portage/app-emulation/xen-tools-3.1.1/work/xen-3.1.1/tools/ioemu
C compiler        gcc
Host C compiler   gcc
make              make
install           install
host CPU          x86_64
host big endian   no
target list       i386-dm
gprof enabled     no
profiler          no
static build      no
SDL support       yes
SDL static link   yes
mingw32 support   no
Adlib support     no
CoreAudio support no
ALSA support      no
DSound support    no
FMOD support      no
kqemu support     no
Documentation     yes
Xen CHECK-BUILD  Tue Oct 16 11:43:13 PDT 2007
Checking check_crypto_lib: OK
Checking check_libvncserver: unused, OK
Checking check_openssl_devel: OK
Checking check_python: OK
Checking check_python_devel: OK
Checking check_sdl: unused, OK
Checking check_x11_devel: OK
Checking check_xgettext: OK
Checking check_zlib_devel: OK
Checking check_zlib_lib: OK


PCI-Bios header at: 0xA3B0
Current checksum:     0x6A
Calculated checksum:  0x6A


$PIR header at:     0xA660
Current checksum:     0x07
Calculated checksum:  0xF7
  Setting checksum.


Bios checksum at:   0xFFFF
Current checksum:     0x00
Calculated checksum:  0x12  Setting checksum.

Bios checksum at:   0x7FFF
Current checksum:     0x00
Calculated checksum:  0xC0  Setting checksum.
-rw-r--r-- 1 root root 32768 2007-10-16 11:43 VGABIOS-lgpl-latest.bin

Bios checksum at:   0x7FFF
Current checksum:     0x00
Calculated checksum:  0xC0  Setting checksum.
-rw-r--r-- 1 root root 32768 2007-10-16 11:43 VGABIOS-lgpl-latest.debug.bin

Bios checksum at:   0x7FFF
Current checksum:     0x00
Calculated checksum:  0x4A  Setting checksum.
-rw-r--r-- 1 root root 32768 2007-10-16 11:43 VGABIOS-lgpl-latest.cirrus.bin

Bios checksum at:   0x7FFF
Current checksum:     0x00
Calculated checksum:  0x6B  Setting checksum.
-rw-r--r-- 1 root root 32768 2007-10-16 11:43 VGABIOS-lgpl-latest.cirrus.debug.bin
42+1 records in
43+0 records out
22016 bytes (22 kB) copied, 0.000156012 s, 141 MB/s
build.c: In function ‘construct_processor_objects’:
build.c:229: warning: pointer targets in passing argument 1 of ‘strncpy’ differ in signedness
../../../tools/xenstat/libxenstat/src/libxenstat.a(xenstat.o): In function `xenstat_collect_xen_version':
xenstat.c:(.text+0x50f): undefined reference to `xc_version'
xenstat.c:(.text+0x529): undefined reference to `xc_version'
../../../tools/xenstat/libxenstat/src/libxenstat.a(xenstat.o): In function `xenstat_collect_vcpus':
xenstat.c:(.text+0x62d): undefined reference to `xc_vcpu_getinfo'
../../../tools/xenstat/libxenstat/src/libxenstat.a(xenstat.o): In function `xenstat_get_node':
xenstat.c:(.text+0x740): undefined reference to `xc_physinfo'
xenstat.c:(.text+0x7e7): undefined reference to `xc_domain_getinfolist'
xenstat.c:(.text+0x92a): undefined reference to `xs_read'
../../../tools/xenstat/libxenstat/src/libxenstat.a(xenstat.o): In function `xenstat_uninit':
xenstat.c:(.text+0xa4a): undefined reference to `xc_interface_close'
xenstat.c:(.text+0xa53): undefined reference to `xs_daemon_close'
../../../tools/xenstat/libxenstat/src/libxenstat.a(xenstat.o): In function `xenstat_init':
xenstat.c:(.text+0xaa2): undefined reference to `xc_interface_open'
xenstat.c:(.text+0xaad): undefined reference to `xs_daemon_open_readonly'
xenstat.c:(.text+0xae2): undefined reference to `xc_interface_close'
collect2: ld returned 1 exit status
make[2]: *** [xentop] Error 1
make[1]: *** [all] Error 2
make: *** [all] Error 2
 *
 * ERROR: app-emulation/xen-tools-3.1.1 failed.
 * Call stack:
 *                ebuild.sh, line 1695:  Called dyn_compile
 *                ebuild.sh, line 1033:  Called qa_call 'src_compile'
 *                ebuild.sh, line   44:  Called src_compile
 *   xen-tools-3.1.1.ebuild, line  135:  Called die
 * The specific snippet of code:
 *      emake -C tools ${myopt} || die "compile failed"
 *  The die message:
 *   compile failed
 *
 * If you need support, post the topmost build error, and the call stack if relevant.
 * A complete build log is located at '/var/tmp/portage/app-emulation/xen-tools-3.1.1/temp/build.log'.
 *

 * Messages for package app-emulation/xen-tools-3.1.1:

 *
 * ERROR: app-emulation/xen-tools-3.1.1 failed.
 * Call stack:
 *                ebuild.sh, line 1695:  Called dyn_compile
 *                ebuild.sh, line 1033:  Called qa_call 'src_compile'
 *                ebuild.sh, line   44:  Called src_compile
 *   xen-tools-3.1.1.ebuild, line  135:  Called die
 * The specific snippet of code:
 *      emake -C tools ${myopt} || die "compile failed"
 *  The die message:
 *   compile failed
 *
 * If you need support, post the topmost build error, and the call stack if relevant.
 * A complete build log is located at '/var/tmp/portage/app-emulation/xen-tools-3.1.1/temp/build.log'.
 *