All pastes #738768 Raw Edit

Stuff

public text v1 · immutable
·published 2007-10-16 16:39 UTC
rendered paste body
pardus pycg # pisi bi pspec.xml -d
DEBUG: PiSi API initialized
Paketler çalışma dizinine yazılıyor.
PiSi kaynak paketi PyCg inşa ediliyor
Emniyet mandalı: taban geliştirme sistemi system.devel halihazırda kurulu
PartOf imi tanımlanmamış, bileşen araştırılyor
Kaynak test.test bileşeninin parçası
Kaynak http://www.cs.lth.se/home/Calle_Lejdfors/pygpu/PyCg-0.14.1.tar.gz adresinden indiriliyor
PyCg-0.14.1.tar.gz [önbellekte]
Kaynak arşivi saklandı:  /var/cache/pisi/archives/PyCg-0.14.1.tar.gz
Arşiv açılıyor...
* Yama uygulanıyor: dont-rm.patch
DEBUG: "patch --remove-empty-files -p0 < "/home/cenk/pisibuild/pycg/files/dont-rm.patch"" için dönüş değeri 0
* Yama uygulanıyor: no-rm.patch
DEBUG: "patch --remove-empty-files -p0 < "/home/cenk/pisibuild/pycg/files/no-rm.patch"" için dönüş değeri 0
 açıldı (/var/pisi/PyCg-0.14.1-1/work)
Kaynak yapılandırılıyor
Kaynak inşa ediliyor...
swig -python -I/usr/include/python2.4 -Iinclude -I. cg.i
cg.i:186: Warning(121): %name is deprecated.  Use %rename instead.
cg.i:194: Warning(121): %name is deprecated.  Use %rename instead.
gcc -fpic -g -Wall -shared -o _Cg.so cg_wrap.c -I/usr/include/python2.4 -Iinclude -I. -lCgGL -lCg -lGL -lpython2.4
cg_wrap.c:2493:33: Numeric/arrayobject.h: No such file or directory
cg_wrap.c: In function `_wrap_cgSetParameter1fv':
cg_wrap.c:4755: error: `PyArrayObject' undeclared (first use in this function)
cg_wrap.c:4755: error: (Each undeclared identifier is reported only once
cg_wrap.c:4755: error: for each function it appears in.)
cg_wrap.c:4755: error: `array' undeclared (first use in this function)
cg_wrap.c:4755: error: syntax error before ')' token
cg_wrap.c:4762: error: `PyArray_FLOAT' undeclared (first use in this function)
cg_wrap.c: In function `_wrap_cgSetParameter2fv':
cg_wrap.c:4800: error: `PyArrayObject' undeclared (first use in this function)
cg_wrap.c:4800: error: `array' undeclared (first use in this function)
cg_wrap.c:4800: error: syntax error before ')' token
cg_wrap.c:4807: error: `PyArray_FLOAT' undeclared (first use in this function)
cg_wrap.c: In function `_wrap_cgSetParameter3fv':
cg_wrap.c:4845: error: `PyArrayObject' undeclared (first use in this function)
cg_wrap.c:4845: error: `array' undeclared (first use in this function)
cg_wrap.c:4845: error: syntax error before ')' token
cg_wrap.c:4852: error: `PyArray_FLOAT' undeclared (first use in this function)
cg_wrap.c: In function `_wrap_cgSetParameter4fv':
cg_wrap.c:4890: error: `PyArrayObject' undeclared (first use in this function)
cg_wrap.c:4890: error: `array' undeclared (first use in this function)
cg_wrap.c:4890: error: syntax error before ')' token
cg_wrap.c:4897: error: `PyArray_FLOAT' undeclared (first use in this function)
cg_wrap.c: In function `_wrap_cgSetParameter1dv':
cg_wrap.c:4933: error: `PyArrayObject' undeclared (first use in this function)
cg_wrap.c:4933: error: `array' undeclared (first use in this function)
cg_wrap.c:4933: error: syntax error before ')' token
cg_wrap.c:4940: error: `PyArray_DOUBLE' undeclared (first use in this function)
cg_wrap.c: In function `_wrap_cgSetParameter2dv':
cg_wrap.c:4976: error: `PyArrayObject' undeclared (first use in this function)
cg_wrap.c:4976: error: `array' undeclared (first use in this function)
cg_wrap.c:4976: error: syntax error before ')' token
cg_wrap.c:4983: error: `PyArray_DOUBLE' undeclared (first use in this function)
cg_wrap.c: In function `_wrap_cgSetParameter3dv':
cg_wrap.c:5019: error: `PyArrayObject' undeclared (first use in this function)
cg_wrap.c:5019: error: `array' undeclared (first use in this function)
cg_wrap.c:5019: error: syntax error before ')' token
cg_wrap.c:5026: error: `PyArray_DOUBLE' undeclared (first use in this function)
cg_wrap.c: In function `_wrap_cgSetParameter4dv':
cg_wrap.c:5062: error: `PyArrayObject' undeclared (first use in this function)
cg_wrap.c:5062: error: `array' undeclared (first use in this function)
cg_wrap.c:5062: error: syntax error before ')' token
cg_wrap.c:5069: error: `PyArray_DOUBLE' undeclared (first use in this function)
cg_wrap.c: In function `_wrap_cgSetMatrixParameterdr':
cg_wrap.c:5105: error: `PyArrayObject' undeclared (first use in this function)
cg_wrap.c:5105: error: `array' undeclared (first use in this function)
cg_wrap.c:5105: error: syntax error before ')' token
cg_wrap.c:5112: error: `PyArray_DOUBLE' undeclared (first use in this function)
cg_wrap.c: In function `_wrap_cgSetMatrixParameterfr':
cg_wrap.c:5150: error: `PyArrayObject' undeclared (first use in this function)
cg_wrap.c:5150: error: `array' undeclared (first use in this function)
cg_wrap.c:5150: error: syntax error before ')' token
cg_wrap.c:5157: error: `PyArray_FLOAT' undeclared (first use in this function)
cg_wrap.c: In function `_wrap_cgSetMatrixParameterdc':
cg_wrap.c:5193: error: `PyArrayObject' undeclared (first use in this function)
cg_wrap.c:5193: error: `array' undeclared (first use in this function)
cg_wrap.c:5193: error: syntax error before ')' token
cg_wrap.c:5200: error: `PyArray_DOUBLE' undeclared (first use in this function)
cg_wrap.c: In function `_wrap_cgSetMatrixParameterfc':
cg_wrap.c:5238: error: `PyArrayObject' undeclared (first use in this function)
cg_wrap.c:5238: error: `array' undeclared (first use in this function)
cg_wrap.c:5238: error: syntax error before ')' token
cg_wrap.c:5245: error: `PyArray_FLOAT' undeclared (first use in this function)
cg_wrap.c: In function `_wrap_cgGLSetParameter1fv':
cg_wrap.c:6101: error: `PyArrayObject' undeclared (first use in this function)
cg_wrap.c:6101: error: `array' undeclared (first use in this function)
cg_wrap.c:6101: error: syntax error before ')' token
cg_wrap.c:6108: error: `PyArray_FLOAT' undeclared (first use in this function)
cg_wrap.c: In function `_wrap_cgGLSetParameter2fv':
cg_wrap.c:6146: error: `PyArrayObject' undeclared (first use in this function)
cg_wrap.c:6146: error: `array' undeclared (first use in this function)
cg_wrap.c:6146: error: syntax error before ')' token
cg_wrap.c:6153: error: `PyArray_FLOAT' undeclared (first use in this function)
cg_wrap.c: In function `_wrap_cgGLSetParameter3fv':
cg_wrap.c:6191: error: `PyArrayObject' undeclared (first use in this function)
cg_wrap.c:6191: error: `array' undeclared (first use in this function)
cg_wrap.c:6191: error: syntax error before ')' token
cg_wrap.c:6198: error: `PyArray_FLOAT' undeclared (first use in this function)
cg_wrap.c: In function `_wrap_cgGLSetParameter4fv':
cg_wrap.c:6236: error: `PyArrayObject' undeclared (first use in this function)
cg_wrap.c:6236: error: `array' undeclared (first use in this function)
cg_wrap.c:6236: error: syntax error before ')' token
cg_wrap.c:6243: error: `PyArray_FLOAT' undeclared (first use in this function)
cg_wrap.c: In function `_wrap_cgGLSetParameter1dv':
cg_wrap.c:6413: error: `PyArrayObject' undeclared (first use in this function)
cg_wrap.c:6413: error: `array' undeclared (first use in this function)
cg_wrap.c:6413: error: syntax error before ')' token
cg_wrap.c:6420: error: `PyArray_DOUBLE' undeclared (first use in this function)
cg_wrap.c: In function `_wrap_cgGLSetParameter2dv':
cg_wrap.c:6456: error: `PyArrayObject' undeclared (first use in this function)
cg_wrap.c:6456: error: `array' undeclared (first use in this function)
cg_wrap.c:6456: error: syntax error before ')' token
cg_wrap.c:6463: error: `PyArray_DOUBLE' undeclared (first use in this function)
cg_wrap.c: In function `_wrap_cgGLSetParameter3dv':
cg_wrap.c:6499: error: `PyArrayObject' undeclared (first use in this function)
cg_wrap.c:6499: error: `array' undeclared (first use in this function)
cg_wrap.c:6499: error: syntax error before ')' token
cg_wrap.c:6506: error: `PyArray_DOUBLE' undeclared (first use in this function)
cg_wrap.c: In function `_wrap_cgGLSetParameter4dv':
cg_wrap.c:6542: error: `PyArrayObject' undeclared (first use in this function)
cg_wrap.c:6542: error: `array' undeclared (first use in this function)
cg_wrap.c:6542: error: syntax error before ')' token
cg_wrap.c:6549: error: `PyArray_DOUBLE' undeclared (first use in this function)
cg_wrap.c: In function `_wrap_cgGLSetParameterArray1f':
cg_wrap.c:6845: error: `PyArrayObject' undeclared (first use in this function)
cg_wrap.c:6845: error: `array' undeclared (first use in this function)
cg_wrap.c:6845: error: syntax error before ')' token
cg_wrap.c:6852: error: `PyArray_FLOAT' undeclared (first use in this function)
cg_wrap.c: In function `_wrap_cgGLSetParameterArray2f':
cg_wrap.c:6908: error: `PyArrayObject' undeclared (first use in this function)
cg_wrap.c:6908: error: `array' undeclared (first use in this function)
cg_wrap.c:6908: error: syntax error before ')' token
cg_wrap.c:6915: error: `PyArray_FLOAT' undeclared (first use in this function)
cg_wrap.c: In function `_wrap_cgGLSetParameterArray3f':
cg_wrap.c:6971: error: `PyArrayObject' undeclared (first use in this function)
cg_wrap.c:6971: error: `array' undeclared (first use in this function)
cg_wrap.c:6971: error: syntax error before ')' token
cg_wrap.c:6978: error: `PyArray_FLOAT' undeclared (first use in this function)
cg_wrap.c: In function `_wrap_cgGLSetParameterArray4f':
cg_wrap.c:7034: error: `PyArrayObject' undeclared (first use in this function)
cg_wrap.c:7034: error: `array' undeclared (first use in this function)
cg_wrap.c:7034: error: syntax error before ')' token
cg_wrap.c:7041: error: `PyArray_FLOAT' undeclared (first use in this function)
cg_wrap.c: In function `_wrap_cgGLSetParameterArray1d':
cg_wrap.c:7095: error: `PyArrayObject' undeclared (first use in this function)
cg_wrap.c:7095: error: `array' undeclared (first use in this function)
cg_wrap.c:7095: error: syntax error before ')' token
cg_wrap.c:7102: error: `PyArray_DOUBLE' undeclared (first use in this function)
cg_wrap.c: In function `_wrap_cgGLSetParameterArray2d':
cg_wrap.c:7156: error: `PyArrayObject' undeclared (first use in this function)
cg_wrap.c:7156: error: `array' undeclared (first use in this function)
cg_wrap.c:7156: error: syntax error before ')' token
cg_wrap.c:7163: error: `PyArray_DOUBLE' undeclared (first use in this function)
cg_wrap.c: In function `_wrap_cgGLSetParameterArray3d':
cg_wrap.c:7217: error: `PyArrayObject' undeclared (first use in this function)
cg_wrap.c:7217: error: `array' undeclared (first use in this function)
cg_wrap.c:7217: error: syntax error before ')' token
cg_wrap.c:7224: error: `PyArray_DOUBLE' undeclared (first use in this function)
cg_wrap.c: In function `_wrap_cgGLSetParameterArray4d':
cg_wrap.c:7278: error: `PyArrayObject' undeclared (first use in this function)
cg_wrap.c:7278: error: `array' undeclared (first use in this function)
cg_wrap.c:7278: error: syntax error before ')' token
cg_wrap.c:7285: error: `PyArray_DOUBLE' undeclared (first use in this function)
cg_wrap.c: In function `_wrap_cgGLSetParameterPointer':
cg_wrap.c:7721: error: `PyArrayObject' undeclared (first use in this function)
cg_wrap.c:7721: error: `array' undeclared (first use in this function)
cg_wrap.c:7723: warning: implicit declaration of function `PyArray_Check'
cg_wrap.c:7728: error: syntax error before ')' token
cg_wrap.c:7685: warning: unused variable `resultobj'
cg_wrap.c:7690: warning: unused variable `arg5'
cg_wrap.c:7699: error: label `fail' used but not defined
cg_wrap.c: At top level:
cg_wrap.c:7737: error: syntax error before '(' token
cg_wrap.c:7738: warning: type defaults to `int' in declaration of `resultobj'
cg_wrap.c:7738: warning: initialization makes integer from pointer without a cast
cg_wrap.c:7738: error: initializer element is not constant
cg_wrap.c:7738: warning: data definition has no type or storage class
cg_wrap.c:7739: error: syntax error before "return"
cg_wrap.c: In function `_wrap_cgGLSetMatrixParameterdr':
cg_wrap.c:7808: error: `PyArrayObject' undeclared (first use in this function)
cg_wrap.c:7808: error: `array' undeclared (first use in this function)
cg_wrap.c:7808: error: syntax error before ')' token
cg_wrap.c:7815: error: `PyArray_DOUBLE' undeclared (first use in this function)
cg_wrap.c: In function `_wrap_cgGLSetMatrixParameterfr':
cg_wrap.c:7853: error: `PyArrayObject' undeclared (first use in this function)
cg_wrap.c:7853: error: `array' undeclared (first use in this function)
cg_wrap.c:7853: error: syntax error before ')' token
cg_wrap.c:7860: error: `PyArray_FLOAT' undeclared (first use in this function)
cg_wrap.c: In function `_wrap_cgGLSetMatrixParameterdc':
cg_wrap.c:7896: error: `PyArrayObject' undeclared (first use in this function)
cg_wrap.c:7896: error: `array' undeclared (first use in this function)
cg_wrap.c:7896: error: syntax error before ')' token
cg_wrap.c:7903: error: `PyArray_DOUBLE' undeclared (first use in this function)
cg_wrap.c: In function `_wrap_cgGLSetMatrixParameterfc':
cg_wrap.c:7941: error: `PyArrayObject' undeclared (first use in this function)
cg_wrap.c:7941: error: `array' undeclared (first use in this function)
cg_wrap.c:7941: error: syntax error before ')' token
cg_wrap.c:7948: error: `PyArray_FLOAT' undeclared (first use in this function)
cg_wrap.c: In function `_wrap_cgGLSetMatrixParameterArrayfc':
cg_wrap.c:8163: error: `PyArrayObject' undeclared (first use in this function)
cg_wrap.c:8163: error: `array' undeclared (first use in this function)
cg_wrap.c:8163: error: syntax error before ')' token
cg_wrap.c:8170: error: `PyArray_FLOAT' undeclared (first use in this function)
cg_wrap.c: In function `_wrap_cgGLSetMatrixParameterArrayfr':
cg_wrap.c:8226: error: `PyArrayObject' undeclared (first use in this function)
cg_wrap.c:8226: error: `array' undeclared (first use in this function)
cg_wrap.c:8226: error: syntax error before ')' token
cg_wrap.c:8233: error: `PyArray_FLOAT' undeclared (first use in this function)
cg_wrap.c: In function `_wrap_cgGLSetMatrixParameterArraydc':
cg_wrap.c:8287: error: `PyArrayObject' undeclared (first use in this function)
cg_wrap.c:8287: error: `array' undeclared (first use in this function)
cg_wrap.c:8287: error: syntax error before ')' token
cg_wrap.c:8294: error: `PyArray_DOUBLE' undeclared (first use in this function)
cg_wrap.c: In function `_wrap_cgGLSetMatrixParameterArraydr':
cg_wrap.c:8348: error: `PyArrayObject' undeclared (first use in this function)
cg_wrap.c:8348: error: `array' undeclared (first use in this function)
cg_wrap.c:8348: error: syntax error before ')' token
cg_wrap.c:8355: error: `PyArray_DOUBLE' undeclared (first use in this function)
cg_wrap.c: In function `init_Cg':
cg_wrap.c:9556: warning: implicit declaration of function `import_array'
make: *** [_Cg.so] Hata 1
DEBUG: "make -j1" için dönüş değeri 2
İnşa başarısızlığa uğradı.
Traceback (most recent call last):
  File "error", line 16, in build
  File "/usr/lib/pardus/pisi/actionsapi/autotools.py", line 96, in make
    raise MakeError(_('Make failed.'))
pisi.actionsapi.autotools.MakeError: İnşa başarısızlığa uğradı.
Sistem Hatası: Program Sonlandırıldı.
exceptions.RuntimeError:
Genel yardım için lütfen 'pisi help' komutunu kullanınız.
Geri-iz:
  File "/usr/bin/pisi", line 89, in ?
    cli.run_command()
  File "/usr/lib/pardus/pisi/cli/pisicli.py", line 108, in run_command
    self.command.run()
  File "/usr/lib/pardus/pisi/cli/commands.py", line 500, in run
    pisi.api.build(x)
  File "/usr/lib/pardus/pisi/api.py", line 596, in build
    return pisi.atomicoperations.build(*args, **kw)
  File "/usr/lib/pardus/pisi/atomicoperations.py", line 564, in build
    return pisi.build.build(package)
  File "/usr/lib/pardus/pisi/build.py", line 950, in build
    return pb.build()
  File "/usr/lib/pardus/pisi/build.py", line 199, in build
    self.run_build_action()
  File "/usr/lib/pardus/pisi/build.py", line 336, in run_build_action
    if self.run_action_function(ctx.const.build_func):
  File "/usr/lib/pardus/pisi/build.py", line 451, in run_action_function
    raise RuntimeError
DEBUG: PiSi API finalized
pardus pycg #