nvidia-installer log file '/var/log/nvidia-installer.log'
creation time: Mon Oct 15 20:06:15 2007
option status:
license pre-accepted : false
update : false
force update : false
expert : false
uninstall : false
driver info : false
precompiled interfaces : true
no ncurses color : false
query latest version : false
OpenGL header files : true
no questions : false
silent : false
no recursion : false
no backup : false
kernel module only : false
sanity : false
add this kernel : false
no runlevel check : false
no network : false
no ABI note : false
no RPMs : false
no kernel module : false
force SELinux : default
no X server check : false
force tls : (not specified)
X install prefix : (not specified)
X library install path : (not specified)
X module install path : (not specified)
OpenGL install prefix : (not specified)
OpenGL install libdir : (not specified)
utility install prefix : (not specified)
utility install libdir : (not specified)
doc install prefix : (not specified)
kernel name : (not specified)
kernel include path : (not specified)
kernel source path : (not specified)
kernel output path : (not specified)
kernel install path : (not specified)
proc mount point : /proc
ui : (not specified)
tmpdir : /root/tmp
ftp mirror : ftp://download.nvidia.com
RPM file list : (not specified)
Using: nvidia-installer ncurses user interface
-> License accepted.
-> No precompiled kernel interface was found to match your kernel; would you li
ke the installer to attempt to download a kernel interface for your kernel f
rom the NVIDIA ftp site (ftp://download.nvidia.com)? (Answer: No)
-> No precompiled kernel interface was found to match your kernel; this means
that the installer will need to compile a new kernel interface.
-> Performing CC sanity check with CC="cc".
-> Performing CC version check with CC="cc".
-> Kernel source path: '/lib/modules/2.6.23-tmb-desktop586-0.rc8.1mdv/source'
-> Kernel output path: '/lib/modules/2.6.23-tmb-desktop586-0.rc8.1mdv/build'
-> Performing rivafb check.
-> Performing nvidiafb check.
-> Performing Xen check.
-> Cleaning kernel module build directory.
executing: 'cd ./usr/src/nv; make clean'...
rm -f -f nv.o nv-vm.o os-agp.o os-interface.o os-registry.o nv-i2c.o nv.o nv
-vm.o os-agp.o os-interface.o os-registry.o nv-i2c.o nvidia.mod.o
rm -f -f build-in.o nv-linux.o *.d .*.{cmd,flags}
rm -f -f nvidia.{o,ko,mod.{o,c}} nv_compiler.h *~
rm -f -f stprof stprof.o symtab.h Modules.symvers
rm -f -rf .tmp_versions
rm -f Makefile
-> Building kernel module:
executing: 'cd ./usr/src/nv; make module SYSSRC=/lib/modules/2.6.23-tmb-desk
top586-0.rc8.1mdv/source SYSOUT=/lib/modules/2.6.23-tmb-desktop586-0.rc8.1md
v/build'...
sh ./conftest.sh "cc" "cc" /lib/modules/2.6.23-tmb-desktop586-0.rc8.1mdv/sou
rce /lib/modules/2.6.23-tmb-desktop586-0.rc8.1mdv/build cc_sanity_check full
_output
sh ./conftest.sh "cc" "cc" /lib/modules/2.6.23-tmb-desktop586-0.rc8.1mdv/sou
rce /lib/modules/2.6.23-tmb-desktop586-0.rc8.1mdv/build select_makefile full
_output
make --no-print-directory -f Makefile module
NVIDIA: calling KBUILD...
make CC=cc KBUILD_OUTPUT=/lib/modules/2.6.23-tmb-desktop586-0.rc8.1mdv/build
KBUILD_VERBOSE=1 -C /lib/modules/2.6.23-tmb-desktop586-0.rc8.1mdv/source SUB
DIRS=/root/tmp/selfgz9423/NVIDIA-Linux-x86-1.0-9755-pkg1/usr/src/nv modules
make -C /lib/modules/2.6.23-tmb-desktop586-0.rc8.1mdv/build \
KBUILD_SRC=/usr/src/2.6.23-tmb-0.rc8.1mdv \
KBUILD_EXTMOD="/root/tmp/selfgz9423/NVIDIA-Linux-x86-1.0-9755-pkg1/usr/src/
nv" -f /usr/src/2.6.23-tmb-0.rc8.1mdv/Makefile modules
test -e include/linux/autoconf.h -a -e include/config/auto.conf || ( \
echo; \
echo " ERROR: Kernel configuration is invalid."; \
echo " include/linux/autoconf.h or include/config/auto.conf are mis
sing."; \
echo " Run 'make oldconfig && make prepare' on kernel src to fix it
."; \
echo; \
/bin/false)
mkdir -p /root/tmp/selfgz9423/NVIDIA-Linux-x86-1.0-9755-pkg1/usr/src/nv/.tmp
_versions
rm -f /root/tmp/selfgz9423/NVIDIA-Linux-x86-1.0-9755-pkg1/usr/src/nv/.tmp_ve
rsions/*
WARNING: Symbol version dump /usr/src/2.6.23-tmb-0.rc8.1mdv/Module.symvers
is missing; modules will have no dependencies and modversions.
make -f /usr/src/2.6.23-tmb-0.rc8.1mdv/scripts/Makefile.build obj=/root/tmp/
selfgz9423/NVIDIA-Linux-x86-1.0-9755-pkg1/usr/src/nv
echo \#define NV_COMPILER \"`cc -v 2>&1 | tail -n 1`\" > /root/tmp/selfgz942
3/NVIDIA-Linux-x86-1.0-9755-pkg1/usr/src/nv/nv_compiler.h
cc -Wp,-MD,/root/tmp/selfgz9423/NVIDIA-Linux-x86-1.0-9755-pkg1/usr/src/nv/
.nv.o.d -nostdinc -isystem /usr/lib/gcc/i586-mandriva-linux-gnu/4.2.2/inclu
de -D__KERNEL__ -Iinclude -Iinclude2 -I/usr/src/2.6.23-tmb-0.rc8.1mdv/includ
e -include include/linux/autoconf.
h -I/root/tmp/selfgz9423/NVIDIA-Linux-x86-1.0-9755-pkg1/usr/src/nv -Wall -W
undef -Wstrict-prototypes -Wno-trigraphs -fno-strict-aliasing -fno-common -W
error-implicit-function-declaration -Os -pipe -msoft-float -mregparm=3 -freg
-struct-return -mpreferred-stack-boundary=2 -march=i586 -mtune=generic -ffre
estanding -maccumulate-outgoing-args -DCONFIG_AS_CFI=1 -DCONFIG_AS_CFI_SIGNA
L_FRAME=1 -I/usr/src/2.6.23-tmb-0.rc8.1mdv/include/asm-i386/mach-generic -Ii
nclude/asm-i386/mach-generic -I/usr/src/2.6.23-tmb-0.rc8.1mdv/include/asm-i3
86/mach-default -Iinclude/asm-i386/mach-default -fomit-frame-pointer -fno-st
ack-protector -Wdeclaration-after-statement -Wno-pointer-sign -I/root/tmp/s
elfgz9423/NVIDIA-Linux-x86-1.0-9755-pkg1/usr/src/nv -Wall -Wimplicit -Wretur
n-type -Wswitch -Wformat -Wchar-subscripts -Wparentheses -Wpointer-arith -Wn
o-multichar -Werror -O -fno-common -msoft-float -MD -Wsign-compare -Wno-cast
-qual -Wno-error -D_LOOSE_KERNEL_NAMES -D__KERNEL__ -DMODULE -DNVRM -DNV_MAJ
OR_VERSION=1 -DNV_MINOR_VERSION=0 -D
NV_PATCHLEVEL=9755 -UDEBUG -U_DEBUG -DNDEBUG -DNV_SIGNAL_STRUCT_RLIM -DNV_MU
LTIPLE_BRIDGE_AGPGART_PRESENT -DNV_PCI_GET_CLASS_PRESENT -DNV_SYSCTL_MAX_MAP
_COUNT_PRESENT -DNV_PM_MESSAGE_T_PRESENT -DNV_PCI_CHOOSE_STATE_PRESENT -DNV_
VM_INSERT_PAGE_PRESENT -DNV_OLD_MM_KGDB_BREAKPOINT_PRESENT -DNV_REMAP_PFN_RA
NGE_PRESENT -DNV_CHANGE_PAGE_ATTR_PRESENT -DNV_VMAP_4_PRESENT -DMODULE -D"KB
UILD_STR(s)=#s" -D"KBUILD_BASENAME=KBUILD_STR(nv)" -D"KBUILD_MODNAME=KBUILD
_STR(nvidia)" -c -o /root/tmp/selfgz9423/NVIDIA-Linux-x86-1.0-9755-pkg1/usr/
src/nv/.tmp_nv.o /root/tmp/selfgz9423/NVIDIA-Linux-x86-1.0-9755-pkg1/usr/src
/nv/nv.c
In file included from include/linux/list.h:8,
from include/linux/preempt.h:11,
from include/linux/spinlock.h:49,
from include/linux/seqlock.h:29,
from include/linux/time.h:8,
from include/linux/timex.h:57,
from include/linux/sched.h:53,
from include/linux/utsname.h:35,
from /root/tmp/selfgz9423/NVIDIA-Linux-x86-1.0-9755-pkg1/us
r/src/nv/nv-linux.h:19,
from /root/tmp/selfgz9423/NVIDIA-Linux-x86-1.0-9755-pkg1/us
r/src/nv/nv.c:14:
include/linux/prefetch.h: In function ‘prefetch_range’:
include/linux/prefetch.h:62: warning: pointer of type ‘void *’ used in a
rithmetic
/root/tmp/selfgz9423/NVIDIA-Linux-x86-1.0-9755-pkg1/usr/src/nv/nv.c: At top
level:
/root/tmp/selfgz9423/NVIDIA-Linux-x86-1.0-9755-pkg1/usr/src/nv/nv.c:110: err
or: expected ‘=’, ‘,’, ‘;’, ‘asm’ or ‘__attribute__’ bef
ore ‘*’ token
/root/tmp/selfgz9423/NVIDIA-Linux-x86-1.0-9755-pkg1/usr/src/nv/nv.c: In func
tion ‘nvos_create_alloc’:
/root/tmp/selfgz9423/NVIDIA-Linux-x86-1.0-9755-pkg1/usr/src/nv/nv.c:460: err
or: ‘nv_pte_t_cache’ undeclared (first use in this function)
/root/tmp/selfgz9423/NVIDIA-Linux-x86-1.0-9755-pkg1/usr/src/nv/nv.c:460: err
or: (Each undeclared identifier is reported only once
/root/tmp/selfgz9423/NVIDIA-Linux-x86-1.0-9755-pkg1/usr/src/nv/nv.c:460: err
or: for each function it appears in.)
/root/tmp/selfgz9423/NVIDIA-Linux-x86-1.0-9755-pkg1/usr/src/nv/nv.c: In func
tion ‘nvos_free_alloc’:
/root/tmp/selfgz9423/NVIDIA-Linux-x86-1.0-9755-pkg1/usr/src/nv/nv.c:492: err
or: ‘nv_pte_t_cache’ undeclared (first use in this function)
/root/tmp/selfgz9423/NVIDIA-Linux-x86-1.0-9755-pkg1/usr/src/nv/nv.c: In func
tion ‘__nv_setup_pat_entries’:
/root/tmp/selfgz9423/NVIDIA-Linux-x86-1.0-9755-pkg1/usr/src/nv/nv.c:955: war
ning: comparison between signed and unsigned
/root/tmp/selfgz9423/NVIDIA-Linux-x86-1.0-9755-pkg1/usr/src/nv/nv.c: In func
tion ‘__nv_restore_pat_entries’:
/root/tmp/selfgz9423/NVIDIA-Linux-x86-1.0-9755-pkg1/usr/src/nv/nv.c:981: war
ning: comparison between signed and unsigned
/root/tmp/selfgz9423/NVIDIA-Linux-x86-1.0-9755-pkg1/usr/src/nv/nv.c: In func
tion ‘nv_kern_cpu_callback’:
/root/tmp/selfgz9423/NVIDIA-Linux-x86-1.0-9755-pkg1/usr/src/nv/nv.c:1287: wa
rning: comparison between signed and unsigned
/root/tmp/selfgz9423/NVIDIA-Linux-x86-1.0-9755-pkg1/usr/src/nv/nv.c:1294: wa
rning: comparison between signed and unsigned
/root/tmp/selfgz9423/NVIDIA-Linux-x86-1.0-9755-pkg1/usr/src/nv/nv.c: In func
tion ‘nvidia_init_module’:
/root/tmp/selfgz9423/NVIDIA-Linux-x86-1.0-9755-pkg1/usr/src/nv/nv.c:1420: er
ror: ‘nv_pte_t_cache’ undeclared (first use in this function)
/root/tmp/selfgz9423/NVIDIA-Linux-x86-1.0-9755-pkg1/usr/src/nv/nv.c:1420: er
ror: too many arguments to function ‘kmem_cache_create’
/root/tmp/selfgz9423/NVIDIA-Linux-x86-1.0-9755-pkg1/usr/src/nv/nv.c:1554: er
ror: void value not ignored as it ought to be
/root/tmp/selfgz9423/NVIDIA-Linux-x86-1.0-9755-pkg1/usr/src/nv/nv.c: In func
tion ‘nvidia_exit_module’:
/root/tmp/selfgz9423/NVIDIA-Linux-x86-1.0-9755-pkg1/usr/src/nv/nv.c:1581: er
ror: void value not ignored as it ought to be
/root/tmp/selfgz9423/NVIDIA-Linux-x86-1.0-9755-pkg1/usr/src/nv/nv.c:1685: er
ror: ‘nv_pte_t_cache’ undeclared (first use in this function)
make[4]: *** [/root/tmp/selfgz9423/NVIDIA-Linux-x86-1.0-9755-pkg1/usr/src/nv
/nv.o] Error 1
make[3]: *** [_module_/root/tmp/selfgz9423/NVIDIA-Linux-x86-1.0-9755-pkg1/us
r/src/nv] Error 2
make[2]: *** [modules] Error 2
NVIDIA: left KBUILD.
nvidia.ko failed to build!
make[1]: *** [module] Error 1
make: *** [module] Error 2
-> Error.
ERROR: Unable to build the NVIDIA kernel module.
ERROR: Installation has failed. Please see the file
'/var/log/nvidia-installer.log' for details. You may find suggestions
on fixing installation problems in the README available on the Linux
driver download page at www.nvidia.com.