All pastes #737867 Raw Edit

Anonymous

public text v1 · immutable
·published 2007-10-15 20:02 UTC
rendered paste body
RROR: function do_compile failed
ERROR: log data follows (/builder/newBuild/build/tmp/work/i686-linux/usbpath-native-0.0+svnr3108-r0/temp/log.do_compile.23591)
| NOTE: make
| make[1]: Entering directory `/builder/newBuild/build/tmp/work/i686-linux/usbpath-native-0.0+svnr3108-r0/usbpath'
| if ccache gcc -DPACKAGE_NAME=\"usbpath\" -DPACKAGE_TARNAME=\"usbpath\" -DPACKAGE_VERSION=\"0.1\" -DPACKAGE_STRING=\"usbpath\ 0.1\" -DPACKAGE_BUGREPORT=\"\" -DPACKAGE=\"usbpath\" -DVERSION=\"0.1\" -I. -I.   -isystem/builder/newBuild/build/tmp/staging/i686-linux/include -Wall -isystem/builder/newBuild/build/tmp/staging/i686-linux/include -Os -MT path2devnum.o -MD -MP -MF ".deps/path2devnum.Tpo" -c -o path2devnum.o path2devnum.c; \
|       then mv -f ".deps/path2devnum.Tpo" ".deps/path2devnum.Po"; else rm -f ".deps/path2devnum.Tpo"; exit 1; fi
| In file included from path2devnum.c:29:
| /usr/include/linux/usbdevice_fs.h:49: error: expected ':', ',', ';', '}' or '__attribute__' before '*' token
| /usr/include/linux/usbdevice_fs.h:56: error: expected ':', ',', ';', '}' or '__attribute__' before '*' token
| /usr/include/linux/usbdevice_fs.h:66: error: expected ':', ',', ';', '}' or '__attribute__' before '*' token
| /usr/include/linux/usbdevice_fs.h:100: error: expected ':', ',', ';', '}' or '__attribute__' before '*' token
| /usr/include/linux/usbdevice_fs.h:116: error: expected ':', ',', ';', '}' or '__attribute__' before '*' token
| make[1]: *** [path2devnum.o] Error 1
| make[1]: Leaving directory `/builder/newBuild/build/tmp/work/i686-linux/usbpath-native-0.0+svnr3108-r0/usbpath'
| FATAL: oe_runmake failed
NOTE: Task failed: /builder/newBuild/build/tmp/work/i686-linux/usbpath-native-0.0+svnr3108-r0/temp/log.do_compile.23591
NOTE: package usbpath-native-0.0+svnr3108-r0: task do_compile: failed
ERROR: TaskFailed event exception, aborting
NOTE: package usbpath-native-0.0+svnr3108: failed
ERROR: Build of /home/moko/newBuild/openembedded/packages/usbpath/usbpath-native_svn.bb do_compile failed
ERROR: Task 1148 (/home/moko/newBuild/openembedded/packages/usbpath/usbpath-native_svn.bb, do_compile) failed
NOTE: Tasks Summary: Attempted 3481 tasks of which 3476 didn't need to be rerun and 1 failed.
ERROR: '/home/moko/newBuild/openembedded/packages/usbpath/usbpath-native_svn.bb' failed
make: *** [openmoko-devel-image] Error 1