/lib/modules/2.6.20-16-generic/build/include/linux/jiffies.h:293:46: error: division by zero in #if
/lib/modules/2.6.20-16-generic/build/include/linux/jiffies.h: In function ‘msecs_to_jiffies’:
/lib/modules/2.6.20-16-generic/build/include/linux/jiffies.h:298: error: ‘CONFIG_HZ’ undeclared (first use in this function)
/lib/modules/2.6.20-16-generic/build/include/linux/jiffies.h:306:46: error: division by zero in #if
/lib/modules/2.6.20-16-generic/build/include/linux/jiffies.h: In function ‘usecs_to_jiffies’:
/lib/modules/2.6.20-16-generic/build/include/linux/jiffies.h:311: error: ‘CONFIG_HZ’ undeclared (first use in this function)
/lib/modules/2.6.20-16-generic/build/include/linux/jiffies.h: In function ‘timespec_to_jiffies’:
/lib/modules/2.6.20-16-generic/build/include/linux/jiffies.h:330: error: ‘CONFIG_HZ’ undeclared (first use in this function)
/lib/modules/2.6.20-16-generic/build/include/linux/jiffies.h:336: error: ‘SHIFT_HZ’ undeclared (first use in this function)
/lib/modules/2.6.20-16-generic/build/include/linux/jiffies.h: In function ‘jiffies_to_timespec’:
/lib/modules/2.6.20-16-generic/build/include/linux/jiffies.h:349: error: ‘CONFIG_HZ’ undeclared (first use in this function)
/lib/modules/2.6.20-16-generic/build/include/linux/jiffies.h: In function ‘timeval_to_jiffies’:
/lib/modules/2.6.20-16-generic/build/include/linux/jiffies.h:371: error: ‘CONFIG_HZ’ undeclared (first use in this function)
/lib/modules/2.6.20-16-generic/build/include/linux/jiffies.h:375: error: ‘SHIFT_HZ’ undeclared (first use in this function)
/lib/modules/2.6.20-16-generic/build/include/linux/jiffies.h: In function ‘jiffies_to_timeval’:
/lib/modules/2.6.20-16-generic/build/include/linux/jiffies.h:387: error: ‘CONFIG_HZ’ undeclared (first use in this function)
/lib/modules/2.6.20-16-generic/build/include/linux/jiffies.h:400:6: error: division by zero in #if
/lib/modules/2.6.20-16-generic/build/include/linux/jiffies.h:400:6: error: division by zero in #if
/lib/modules/2.6.20-16-generic/build/include/linux/jiffies.h:400:6: error: division by zero in #if
/lib/modules/2.6.20-16-generic/build/include/linux/jiffies.h:400:6: error: division by zero in #if
/lib/modules/2.6.20-16-generic/build/include/linux/jiffies.h:400:6: error: division by zero in #if
/lib/modules/2.6.20-16-generic/build/include/linux/jiffies.h:400:6: error: division by zero in #if
/lib/modules/2.6.20-16-generic/build/include/linux/jiffies.h:400:6: error: division by zero in #if
/lib/modules/2.6.20-16-generic/build/include/linux/jiffies.h:400:6: error: division by zero in #if
/lib/modules/2.6.20-16-generic/build/include/linux/jiffies.h:400:6: error: division by zero in #if
/lib/modules/2.6.20-16-generic/build/include/linux/jiffies.h:400:6: error: division by zero in #if
/lib/modules/2.6.20-16-generic/build/include/linux/jiffies.h:400:6: error: division by zero in #if
/lib/modules/2.6.20-16-generic/build/include/linux/jiffies.h:400:6: error: division by zero in #if
/lib/modules/2.6.20-16-generic/build/include/linux/jiffies.h:400:6: error: division by zero in #if
/lib/modules/2.6.20-16-generic/build/include/linux/jiffies.h:400:6: error: division by zero in #if
/lib/modules/2.6.20-16-generic/build/include/linux/jiffies.h:400:6: error: division by zero in #if
/lib/modules/2.6.20-16-generic/build/include/linux/jiffies.h:400:6: error: division by zero in #if
/lib/modules/2.6.20-16-generic/build/include/linux/jiffies.h: In function ‘jiffies_to_clock_t’:
/lib/modules/2.6.20-16-generic/build/include/linux/jiffies.h:401: error: ‘CONFIG_HZ’ undeclared (first use in this function)
/lib/modules/2.6.20-16-generic/build/include/linux/jiffies.h: In function ‘clock_t_to_jiffies’:
/lib/modules/2.6.20-16-generic/build/include/linux/jiffies.h:412: error: ‘CONFIG_HZ’ undeclared (first use in this function)
/lib/modules/2.6.20-16-generic/build/include/linux/jiffies.h:431:6: error: division by zero in #if
/lib/modules/2.6.20-16-generic/build/include/linux/jiffies.h:431:6: error: division by zero in #if
/lib/modules/2.6.20-16-generic/build/include/linux/jiffies.h:431:6: error: division by zero in #if
/lib/modules/2.6.20-16-generic/build/include/linux/jiffies.h:431:6: error: division by zero in #if
/lib/modules/2.6.20-16-generic/build/include/linux/jiffies.h:431:6: error: division by zero in #if
/lib/modules/2.6.20-16-generic/build/include/linux/jiffies.h:431:6: error: division by zero in #if
/lib/modules/2.6.20-16-generic/build/include/linux/jiffies.h:431:6: error: division by zero in #if
/lib/modules/2.6.20-16-generic/build/include/linux/jiffies.h:431:6: error: division by zero in #if
/lib/modules/2.6.20-16-generic/build/include/linux/jiffies.h:431:6: error: division by zero in #if
/lib/modules/2.6.20-16-generic/build/include/linux/jiffies.h:431:6: error: division by zero in #if
/lib/modules/2.6.20-16-generic/build/include/linux/jiffies.h:431:6: error: division by zero in #if
/lib/modules/2.6.20-16-generic/build/include/linux/jiffies.h:431:6: error: division by zero in #if
/lib/modules/2.6.20-16-generic/build/include/linux/jiffies.h:431:6: error: division by zero in #if
/lib/modules/2.6.20-16-generic/build/include/linux/jiffies.h:431:6: error: division by zero in #if
/lib/modules/2.6.20-16-generic/build/include/linux/jiffies.h:431:6: error: division by zero in #if
/lib/modules/2.6.20-16-generic/build/include/linux/jiffies.h:431:6: error: division by zero in #if
/lib/modules/2.6.20-16-generic/build/include/linux/jiffies.h: In function ‘jiffies_64_to_clock_t’:
/lib/modules/2.6.20-16-generic/build/include/linux/jiffies.h:432: error: ‘CONFIG_HZ’ undeclared (first use in this function)
In file included from /lib/modules/2.6.20-16-generic/build/include/linux/gfp.h:4,
from /lib/modules/2.6.20-16-generic/build/include/linux/slab.h:14,
from /lib/modules/2.6.20-16-generic/build/include/linux/percpu.h:5,
from /lib/modules/2.6.20-16-generic/build/include/linux/rcupdate.h:41,
from /lib/modules/2.6.20-16-generic/build/include/linux/pid.h:4,
from /lib/modules/2.6.20-16-generic/build/include/linux/sched.h:72,
from /lib/modules/2.6.20-16-generic/build/include/linux/utsname.h:35,
from /lib/modules/2.6.20-16-generic/build/include/asm/elf.h:12,
from /lib/modules/2.6.20-16-generic/build/include/linux/elf.h:7,
from /lib/modules/2.6.20-16-generic/build/include/linux/module.h:15,
from /usr/src/alsa/alsa-driver-1.0.9/include/adriver.h:45,
from /usr/src/alsa/alsa-driver-1.0.9/include/sound/driver.h:42,
from hpetimer.c:22:
/lib/modules/2.6.20-16-generic/build/include/linux/mmzone.h: At top level:
/lib/modules/2.6.20-16-generic/build/include/linux/mmzone.h:43: error: requested alignment is not a constant
/lib/modules/2.6.20-16-generic/build/include/linux/mmzone.h:85: error: requested alignment is not a constant
/lib/modules/2.6.20-16-generic/build/include/linux/mmzone.h:282: error: requested alignment is not a constant
In file included from /lib/modules/2.6.20-16-generic/build/include/linux/pid.h:4,
from /lib/modules/2.6.20-16-generic/build/include/linux/sched.h:72,
from /lib/modules/2.6.20-16-generic/build/include/linux/utsname.h:35,
from /lib/modules/2.6.20-16-generic/build/include/asm/elf.h:12,
from /lib/modules/2.6.20-16-generic/build/include/linux/elf.h:7,
from /lib/modules/2.6.20-16-generic/build/include/linux/module.h:15,
from /usr/src/alsa/alsa-driver-1.0.9/include/adriver.h:45,
from /usr/src/alsa/alsa-driver-1.0.9/include/sound/driver.h:42,
from hpetimer.c:22:
/lib/modules/2.6.20-16-generic/build/include/linux/rcupdate.h:71: error: requested alignment is not a constant
/lib/modules/2.6.20-16-generic/build/include/linux/rcupdate.h:74: error: requested alignment is not a constant
In file included from /lib/modules/2.6.20-16-generic/build/include/linux/module.h:21,
from /usr/src/alsa/alsa-driver-1.0.9/include/adriver.h:45,
from /usr/src/alsa/alsa-driver-1.0.9/include/sound/driver.h:42,
from hpetimer.c:22:
/lib/modules/2.6.20-16-generic/build/include/asm/module.h:62:2: error: #error unknown processor family
In file included from /lib/modules/2.6.20-16-generic/build/include/asm/hardirq.h:5,
from /lib/modules/2.6.20-16-generic/build/include/linux/hardirq.h:7,
from /lib/modules/2.6.20-16-generic/build/include/linux/interrupt.h:11,
from hpetimer.c:26:
/lib/modules/2.6.20-16-generic/build/include/linux/irq.h:172: error: requested alignment is not a constant
In file included from /lib/modules/2.6.20-16-generic/build/include/linux/hardirq.h:7,
from /lib/modules/2.6.20-16-generic/build/include/linux/interrupt.h:11,
from hpetimer.c:26:
/lib/modules/2.6.20-16-generic/build/include/asm/hardirq.h:12: error: requested alignment is not a constant
make[1]: *** [hpetimer.o] Error 1
make[1]: Leaving directory `/usr/src/alsa/alsa-driver-1.0.9/acore'
make: *** [compile] Error 1
joe@lappy386:/usr/src/alsa/alsa-driver-1.0.9$ clear
joe@lappy386:/usr/src/alsa/alsa-driver-1.0.9$ sudo make
make[1]: Entering directory `/usr/src/alsa/alsa-driver-1.0.9/acore'
gcc -D__KERNEL__ -DMODULE=1 -I/usr/src/alsa/alsa-driver-1.0.9/include -I/lib/modules/2.6.20-16-generic/build/include -I/lib/modules/2.6.20-16-generic/build/include/asm-i386/mach-default -O2 -mpreferred-stack-boundary=2 -march=i586 -D__SMP__ -DCONFIG_SMP -DLINUX -Wall -Wstrict-prototypes -fomit-frame-pointer -Wno-trigraphs -O2 -fno-strict-aliasing -fno-common -pipe -DALSA_BUILD -nostdinc -iwithprefix include -DMODVERSIONS -include /lib/modules/2.6.20-16-generic/build/include/linux/modversions.h -DKBUILD_BASENAME=hpetimer -c -o hpetimer.o hpetimer.c
cc1: error: /lib/modules/2.6.20-16-generic/build/include/linux/modversions.h: No such file or directory
In file included from hpetimer.c:22:
/usr/src/alsa/alsa-driver-1.0.9/include/sound/driver.h:29:26: error: linux/config.h: No such file or directory
In file included from /lib/modules/2.6.20-16-generic/build/include/asm/percpu.h:5,
from /lib/modules/2.6.20-16-generic/build/include/asm/processor.h:21,
from /lib/modules/2.6.20-16-generic/build/include/asm/thread_info.h:16,
from /lib/modules/2.6.20-16-generic/build/include/linux/thread_info.h:21,
from /lib/modules/2.6.20-16-generic/build/include/linux/preempt.h:9,
from /lib/modules/2.6.20-16-generic/build/include/linux/spinlock.h:49,
from /lib/modules/2.6.20-16-generic/build/include/linux/module.h:9,
from /usr/src/alsa/alsa-driver-1.0.9/include/adriver.h:45,
from /usr/src/alsa/alsa-driver-1.0.9/include/sound/driver.h:42,
from hpetimer.c:22:
/lib/modules/2.6.20-16-generic/build/include/asm-generic/percpu.h:8: error: ‘CONFIG_NR_CPUS’ undeclared here (not in a function)
In file included from /lib/modules/2.6.20-16-generic/build/include/asm/thread_info.h:16,
from /lib/modules/2.6.20-16-generic/build/include/linux/thread_info.h:21,
from /lib/modules/2.6.20-16-generic/build/include/linux/preempt.h:9,
from /lib/modules/2.6.20-16-generic/build/include/linux/spinlock.h:49,
from /lib/modules/2.6.20-16-generic/build/include/linux/module.h:9,
from /usr/src/alsa/alsa-driver-1.0.9/include/adriver.h:45,
from /usr/src/alsa/alsa-driver-1.0.9/include/sound/driver.h:42,
from hpetimer.c:22:
/lib/modules/2.6.20-16-generic/build/include/asm/processor.h:82: error: ‘CONFIG_X86_L1_CACHE_SHIFT’ undeclared here (not in a function)
/lib/modules/2.6.20-16-generic/build/include/asm/processor.h:82: error: requested alignment is not a constant
/lib/modules/2.6.20-16-generic/build/include/asm/processor.h: In function ‘cpuid_count’:
/lib/modules/2.6.20-16-generic/build/include/asm/processor.h:611: warning: pointer targets in passing argument 1 of ‘native_cpuid’ differ in signedness
/lib/modules/2.6.20-16-generic/build/include/asm/processor.h:611: warning: pointer targets in passing argument 2 of ‘native_cpuid’ differ in signedness
/lib/modules/2.6.20-16-generic/build/include/asm/processor.h:611: warning: pointer targets in passing argument 3 of ‘native_cpuid’ differ in signedness
/lib/modules/2.6.20-16-generic/build/include/asm/processor.h:611: warning: pointer targets in passing argument 4 of ‘native_cpuid’ differ in signedness
In file included from /lib/modules/2.6.20-16-generic/build/include/linux/sched.h:51,
from /lib/modules/2.6.20-16-generic/build/include/linux/utsname.h:35,
from /lib/modules/2.6.20-16-generic/build/include/asm/elf.h:12,
from /lib/modules/2.6.20-16-generic/build/include/linux/elf.h:7,
from /lib/modules/2.6.20-16-generic/build/include/linux/module.h:15,
from /usr/src/alsa/alsa-driver-1.0.9/include/adriver.h:45,
from /usr/src/alsa/alsa-driver-1.0.9/include/sound/driver.h:42,
from hpetimer.c:22:
/lib/modules/2.6.20-16-generic/build/include/linux/jiffies.h:33:3: error: #error You lose.
/lib/modules/2.6.20-16-generic/build/include/linux/jiffies.h:225:31: error: division by zero in #if
/lib/modules/2.6.20-16-generic/build/include/linux/jiffies.h:225:31: error: division by zero in #if
/lib/modules/2.6.20-16-generic/build/include/linux/jiffies.h:225:31: error: division by zero in #if
/lib/modules/2.6.20-16-generic/build/include/linux/jiffies.h:225:31: error: division by zero in #if
/lib/modules/2.6.20-16-generic/build/include/linux/jiffies.h:225:31: error: division by zero in #if
/lib/modules/2.6.20-16-generic/build/include/linux/jiffies.h:225:31: error: division by zero in #if
/lib/modules/2.6.20-16-generic/build/include/linux/jiffies.h:225:31: error: division by zero in #if
/lib/modules/2.6.20-16-generic/build/include/linux/jiffies.h:225:31: error: division by zero in #if
/lib/modules/2.6.20-16-generic/build/include/linux/jiffies.h:225:31: error: division by zero in #if
/lib/modules/2.6.20-16-generic/build/include/linux/jiffies.h:225:31: error: division by zero in #if
/lib/modules/2.6.20-16-generic/build/include/linux/jiffies.h:225:31: error: division by zero in #if
/lib/modules/2.6.20-16-generic/build/include/linux/jiffies.h:225:31: error: division by zero in #if
/lib/modules/2.6.20-16-generic/build/include/linux/jiffies.h:225:31: error: division by zero in #if
/lib/modules/2.6.20-16-generic/build/include/linux/jiffies.h:225:31: error: division by zero in #if
/lib/modules/2.6.20-16-generic/build/include/linux/jiffies.h:225:31: error: division by zero in #if
/lib/modules/2.6.20-16-generic/build/include/linux/jiffies.h:225:31: error: division by zero in #if
/lib/modules/2.6.20-16-generic/build/include/linux/jiffies.h:269:46: error: division by zero in #if
In file included from /lib/modules/2.6.20-16-generic/build/include/linux/sched.h:51,
from /lib/modules/2.6.20-16-generic/build/include/linux/utsname.h:35,
from /lib/modules/2.6.20-16-generic/build/include/asm/elf.h:12,
from /lib/modules/2.6.20-16-generic/build/include/linux/elf.h:7,
from /lib/modules/2.6.20-16-generic/build/include/linux/module.h:15,
from /usr/src/alsa/alsa-driver-1.0.9/include/adriver.h:45,
from /usr/src/alsa/alsa-driver-1.0.9/include/sound/driver.h:42,
from hpetimer.c:22:
/lib/modules/2.6.20-16-generic/build/include/linux/jiffies.h: In function ‘jiffies_to_msecs’:
/lib/modules/2.6.20-16-generic/build/include/linux/jiffies.h:274: error: ‘CONFIG_HZ’ undeclared (first use in this function)
/lib/modules/2.6.20-16-generic/build/include/linux/jiffies.h:274: error: (Each undeclared identifier is reported only once
/lib/modules/2.6.20-16-generic/build/include/linux/jiffies.h:274: error: for each function it appears in.)
/lib/modules/2.6.20-16-generic/build/include/linux/jiffies.h:280:46: error: division by zero in #if
/lib/modules/2.6.20-16-generic/build/include/linux/jiffies.h: In function ‘jiffies_to_usecs’:
/lib/modules/2.6.20-16-generic/build/include/linux/jiffies.h:285: error: ‘CONFIG_HZ’ undeclared (first use in this function)
/lib/modules/2.6.20-16-generic/build/include/linux/jiffies.h:293:46: error: division by zero in #if
/lib/modules/2.6.20-16-generic/build/include/linux/jiffies.h: In function ‘msecs_to_jiffies’:
/lib/modules/2.6.20-16-generic/build/include/linux/jiffies.h:298: error: ‘CONFIG_HZ’ undeclared (first use in this function)
/lib/modules/2.6.20-16-generic/build/include/linux/jiffies.h:306:46: error: division by zero in #if
/lib/modules/2.6.20-16-generic/build/include/linux/jiffies.h: In function ‘usecs_to_jiffies’:
/lib/modules/2.6.20-16-generic/build/include/linux/jiffies.h:311: error: ‘CONFIG_HZ’ undeclared (first use in this function)
/lib/modules/2.6.20-16-generic/build/include/linux/jiffies.h: In function ‘timespec_to_jiffies’:
/lib/modules/2.6.20-16-generic/build/include/linux/jiffies.h:330: error: ‘CONFIG_HZ’ undeclared (first use in this function)
/lib/modules/2.6.20-16-generic/build/include/linux/jiffies.h:336: error: ‘SHIFT_HZ’ undeclared (first use in this function)
/lib/modules/2.6.20-16-generic/build/include/linux/jiffies.h: In function ‘jiffies_to_timespec’:
/lib/modules/2.6.20-16-generic/build/include/linux/jiffies.h:349: error: ‘CONFIG_HZ’ undeclared (first use in this function)
/lib/modules/2.6.20-16-generic/build/include/linux/jiffies.h: In function ‘timeval_to_jiffies’:
/lib/modules/2.6.20-16-generic/build/include/linux/jiffies.h:371: error: ‘CONFIG_HZ’ undeclared (first use in this function)
/lib/modules/2.6.20-16-generic/build/include/linux/jiffies.h:375: error: ‘SHIFT_HZ’ undeclared (first use in this function)
/lib/modules/2.6.20-16-generic/build/include/linux/jiffies.h: In function ‘jiffies_to_timeval’:
/lib/modules/2.6.20-16-generic/build/include/linux/jiffies.h:387: error: ‘CONFIG_HZ’ undeclared (first use in this function)
/lib/modules/2.6.20-16-generic/build/include/linux/jiffies.h:400:6: error: division by zero in #if
/lib/modules/2.6.20-16-generic/build/include/linux/jiffies.h:400:6: error: division by zero in #if
/lib/modules/2.6.20-16-generic/build/include/linux/jiffies.h:400:6: error: division by zero in #if
/lib/modules/2.6.20-16-generic/build/include/linux/jiffies.h:400:6: error: division by zero in #if
/lib/modules/2.6.20-16-generic/build/include/linux/jiffies.h:400:6: error: division by zero in #if
/lib/modules/2.6.20-16-generic/build/include/linux/jiffies.h:400:6: error: division by zero in #if
/lib/modules/2.6.20-16-generic/build/include/linux/jiffies.h:400:6: error: division by zero in #if
/lib/modules/2.6.20-16-generic/build/include/linux/jiffies.h:400:6: error: division by zero in #if
/lib/modules/2.6.20-16-generic/build/include/linux/jiffies.h:400:6: error: division by zero in #if
/lib/modules/2.6.20-16-generic/build/include/linux/jiffies.h:400:6: error: division by zero in #if
/lib/modules/2.6.20-16-generic/build/include/linux/jiffies.h:400:6: error: division by zero in #if
/lib/modules/2.6.20-16-generic/build/include/linux/jiffies.h:400:6: error: division by zero in #if
/lib/modules/2.6.20-16-generic/build/include/linux/jiffies.h:400:6: error: division by zero in #if
/lib/modules/2.6.20-16-generic/build/include/linux/jiffies.h:400:6: error: division by zero in #if
/lib/modules/2.6.20-16-generic/build/include/linux/jiffies.h:400:6: error: division by zero in #if
/lib/modules/2.6.20-16-generic/build/include/linux/jiffies.h:400:6: error: division by zero in #if
/lib/modules/2.6.20-16-generic/build/include/linux/jiffies.h: In function ‘jiffies_to_clock_t’:
/lib/modules/2.6.20-16-generic/build/include/linux/jiffies.h:401: error: ‘CONFIG_HZ’ undeclared (first use in this function)
/lib/modules/2.6.20-16-generic/build/include/linux/jiffies.h: In function ‘clock_t_to_jiffies’:
/lib/modules/2.6.20-16-generic/build/include/linux/jiffies.h:412: error: ‘CONFIG_HZ’ undeclared (first use in this function)
/lib/modules/2.6.20-16-generic/build/include/linux/jiffies.h:431:6: error: division by zero in #if
/lib/modules/2.6.20-16-generic/build/include/linux/jiffies.h:431:6: error: division by zero in #if
/lib/modules/2.6.20-16-generic/build/include/linux/jiffies.h:431:6: error: division by zero in #if
/lib/modules/2.6.20-16-generic/build/include/linux/jiffies.h:431:6: error: division by zero in #if
/lib/modules/2.6.20-16-generic/build/include/linux/jiffies.h:431:6: error: division by zero in #if
/lib/modules/2.6.20-16-generic/build/include/linux/jiffies.h:431:6: error: division by zero in #if
/lib/modules/2.6.20-16-generic/build/include/linux/jiffies.h:431:6: error: division by zero in #if
/lib/modules/2.6.20-16-generic/build/include/linux/jiffies.h:431:6: error: division by zero in #if
/lib/modules/2.6.20-16-generic/build/include/linux/jiffies.h:431:6: error: division by zero in #if
/lib/modules/2.6.20-16-generic/build/include/linux/jiffies.h:431:6: error: division by zero in #if
/lib/modules/2.6.20-16-generic/build/include/linux/jiffies.h:431:6: error: division by zero in #if
/lib/modules/2.6.20-16-generic/build/include/linux/jiffies.h:431:6: error: division by zero in #if
/lib/modules/2.6.20-16-generic/build/include/linux/jiffies.h:431:6: error: division by zero in #if
/lib/modules/2.6.20-16-generic/build/include/linux/jiffies.h:431:6: error: division by zero in #if
/lib/modules/2.6.20-16-generic/build/include/linux/jiffies.h:431:6: error: division by zero in #if
/lib/modules/2.6.20-16-generic/build/include/linux/jiffies.h:431:6: error: division by zero in #if
/lib/modules/2.6.20-16-generic/build/include/linux/jiffies.h: In function ‘jiffies_64_to_clock_t’:
/lib/modules/2.6.20-16-generic/build/include/linux/jiffies.h:432: error: ‘CONFIG_HZ’ undeclared (first use in this function)
In file included from /lib/modules/2.6.20-16-generic/build/include/linux/gfp.h:4,
from /lib/modules/2.6.20-16-generic/build/include/linux/slab.h:14,
from /lib/modules/2.6.20-16-generic/build/include/linux/percpu.h:5,
from /lib/modules/2.6.20-16-generic/build/include/linux/rcupdate.h:41,
from /lib/modules/2.6.20-16-generic/build/include/linux/pid.h:4,
from /lib/modules/2.6.20-16-generic/build/include/linux/sched.h:72,
from /lib/modules/2.6.20-16-generic/build/include/linux/utsname.h:35,
from /lib/modules/2.6.20-16-generic/build/include/asm/elf.h:12,
from /lib/modules/2.6.20-16-generic/build/include/linux/elf.h:7,
from /lib/modules/2.6.20-16-generic/build/include/linux/module.h:15,
from /usr/src/alsa/alsa-driver-1.0.9/include/adriver.h:45,
from /usr/src/alsa/alsa-driver-1.0.9/include/sound/driver.h:42,
from hpetimer.c:22:
/lib/modules/2.6.20-16-generic/build/include/linux/mmzone.h: At top level:
/lib/modules/2.6.20-16-generic/build/include/linux/mmzone.h:43: error: requested alignment is not a constant
/lib/modules/2.6.20-16-generic/build/include/linux/mmzone.h:85: error: requested alignment is not a constant
/lib/modules/2.6.20-16-generic/build/include/linux/mmzone.h:282: error: requested alignment is not a constant
In file included from /lib/modules/2.6.20-16-generic/build/include/linux/pid.h:4,
from /lib/modules/2.6.20-16-generic/build/include/linux/sched.h:72,
from /lib/modules/2.6.20-16-generic/build/include/linux/utsname.h:35,
from /lib/modules/2.6.20-16-generic/build/include/asm/elf.h:12,
from /lib/modules/2.6.20-16-generic/build/include/linux/elf.h:7,
from /lib/modules/2.6.20-16-generic/build/include/linux/module.h:15,
from /usr/src/alsa/alsa-driver-1.0.9/include/adriver.h:45,
from /usr/src/alsa/alsa-driver-1.0.9/include/sound/driver.h:42,
from hpetimer.c:22:
/lib/modules/2.6.20-16-generic/build/include/linux/rcupdate.h:71: error: requested alignment is not a constant
/lib/modules/2.6.20-16-generic/build/include/linux/rcupdate.h:74: error: requested alignment is not a constant
In file included from /lib/modules/2.6.20-16-generic/build/include/linux/module.h:21,
from /usr/src/alsa/alsa-driver-1.0.9/include/adriver.h:45,
from /usr/src/alsa/alsa-driver-1.0.9/include/sound/driver.h:42,
from hpetimer.c:22:
/lib/modules/2.6.20-16-generic/build/include/asm/module.h:62:2: error: #error unknown processor family
In file included from /lib/modules/2.6.20-16-generic/build/include/asm/hardirq.h:5,
from /lib/modules/2.6.20-16-generic/build/include/linux/hardirq.h:7,
from /lib/modules/2.6.20-16-generic/build/include/linux/interrupt.h:11,
from hpetimer.c:26:
/lib/modules/2.6.20-16-generic/build/include/linux/irq.h:172: error: requested alignment is not a constant
In file included from /lib/modules/2.6.20-16-generic/build/include/linux/hardirq.h:7,
from /lib/modules/2.6.20-16-generic/build/include/linux/interrupt.h:11,
from hpetimer.c:26:
/lib/modules/2.6.20-16-generic/build/include/asm/hardirq.h:12: error: requested alignment is not a constant
make[1]: *** [hpetimer.o] Error 1
make[1]: Leaving directory `/usr/src/alsa/alsa-driver-1.0.9/acore'
make: *** [compile] Error 1