# emerge sun-jre-bin
Calculating dependencies... done!
>>> Verifying ebuild Manifests...
>>> Emerging (1 of 5) app-portage/portage-utils-0.1.28 to /
* portage-utils-0.1.28.tar.bz2 RMD160 ;-) ... [ ok ]
* portage-utils-0.1.28.tar.bz2 SHA1 ;-) ... [ ok ]
* portage-utils-0.1.28.tar.bz2 SHA256 ;-) ... [ ok ]
* portage-utils-0.1.28.tar.bz2 size ;-) ... [ ok ]
* checking ebuild checksums ;-) ... [ ok ]
* checking auxfile checksums ;-) ... [ ok ]
* checking miscfile checksums ;-) ... [ ok ]
* checking portage-utils-0.1.28.tar.bz2 ;-) ... [ ok ]
>>> Unpacking source...
>>> Unpacking portage-utils-0.1.28.tar.bz2 to /var/tmp/portage/app-portage/portage-utils-0.1.28/work
* Applying qmerge-posix-180871.patch ... [ ok ]
>>> Source unpacked.
>>> Compiling source in /var/tmp/portage/app-portage/portage-utils-0.1.28/work/portage-utils-0.1.28 ...
sed -n '/^DECLARE_APPLET/s:.*(\(.*\)).*:#include "\1.c":p' applets.h > include_applets.h
x86_64-pc-linux-gnu-gcc -DVERSION=\"0.1.28\" -DAPPLET_q -DAPPLET_qatom -DAPPLET_qcache -DAPPLET_qcheck -DAPPLET_qdepends -DAPPLET_qfile -DAPPLET_qgrep -DAPPLET_qlist -DAPPLET_qlop -DAPPLET_qmerge -DAPPLET_qpkg -DAPPLET_qsearch -DAPPLET_qsize -DAPPLET_qtbz2 -DAPPLET_quse -DAPPLET_qxpak -march=nocona -O2 -pipe -MM main.c > .depend
: q : qatom : qcache : qcheck : qdepends : qfile : qgrep : qlist : qlop : qmerge : qpkg : qsearch : qsize : qtbz2 : quse : qxpak :
x86_64-pc-linux-gnu-gcc -march=nocona -O2 -pipe -Wl,--export-dynamic main.c -o q -ldl
In file included from /usr/include/bits/local_lim.h:8,
from /usr/include/gentoo-multilib/amd64/bits/posix1_lim.h:153,
from /usr/include/bits/posix1_lim.h:8,
from /usr/include/gentoo-multilib/amd64/dirent.h:232,
from /usr/include/dirent.h:8,
from main.c:21:
/usr/include/gentoo-multilib/amd64/bits/local_lim.h:36:26: error: linux/limits.h: No such file or directory
In file included from /usr/include/bits/errno.h:8,
from /usr/include/gentoo-multilib/amd64/errno.h:36,
from /usr/include/errno.h:8,
from main.c:24:
/usr/include/gentoo-multilib/amd64/bits/errno.h:25:26: error: linux/errno.h: No such file or directory
main.c: In function 'initialize_flat':
main.c:606: error: 'ENOENT' undeclared (first use in this function)
main.c:606: error: (Each undeclared identifier is reported only once
main.c:606: error: for each function it appears in.)
main.c:616: error: 'EACCES' undeclared (first use in this function)
In file included from include_applets.h:6,
from main.c:1018:
qlop.c:13:24: error: asm/param.h: No such file or directory
In file included from include_applets.h:6,
from main.c:1018:
qlop.c: In function 'show_current_emerge':
qlop.c:355: error: 'HZ' undeclared (first use in this function)
In file included from include_applets.h:15,
from main.c:1018:
qmerge.c: In function 'pkg_merge':
qmerge.c:743: error: 'EEXIST' undeclared (first use in this function)
make: *** [q] Error 1
*
* ERROR: app-portage/portage-utils-0.1.28 failed.
* Call stack:
* ebuild.sh, line 1695: Called dyn_compile
* ebuild.sh, line 1033: Called qa_call 'src_compile'
* ebuild.sh, line 44: Called src_compile
* portage-utils-0.1.28.ebuild, line 27: Called die
* The specific snippet of code:
* emake || die
* The die message:
* (no error message)
*
* If you need support, post the topmost build error, and the call stack if relevant.
* A complete build log is located at '/var/tmp/portage/app-portage/portage-utils-0.1.28/temp/build.log'.
*
* Messages for package app-portage/portage-utils-0.1.28:
*
* ERROR: app-portage/portage-utils-0.1.28 failed.
* Call stack:
* ebuild.sh, line 1695: Called dyn_compile
* ebuild.sh, line 1033: Called qa_call 'src_compile'
* ebuild.sh, line 44: Called src_compile
* portage-utils-0.1.28.ebuild, line 27: Called die
* The specific snippet of code:
* emake || die
* The die message:
* (no error message)
*
* If you need support, post the topmost build error, and the call stack if relevant.
* A complete build log is located at '/var/tmp/portage/app-portage/portage-utils-0.1.28/temp/build.log'.
*