All pastes #73449 Raw Edit

Stuff

public text v1 · immutable
#73449 ·published 2006-06-27 21:15 UTC
rendered paste body
make  all-recursive
Making all in m4
make[2]: Nothing to be done for `all'.
Making all in intl
make[2]: Nothing to be done for `all'.
Making all in po
make[2]: Nothing to be done for `all'.
Making all in doc
make[2]: Nothing to be done for `all'.
Making all in src
/bin/sh libtool --mode=link g++  -O2 -Wall   -o steghide  Arg.o Arguments.o AssertionFailed.o AuFile.o AuSampleValues.o DFSAPHeuristic.o BFSAPHeuristic.o BinaryIO.o BitString.o BmpFile.o BmpPaletteSampleValue.o BmpRGBSampleValue.o BmpSampleValue.o WKSConstructionHeuristic.o DMDConstructionHeuristic.o CvrStgFile.o Edge.o EdgeIterator.o EmbData.o Embedder.o EncryptionAlgorithm.o EncryptionMode.o Extractor.o Graph.o JpegFile.o JpegSampleValue.o MCryptPP.o MHashKeyGen.o MHashPP.o Matching.o MatchingAlgorithm.o ProgressOutput.o PseudoRandomSource.o RGBTriple.o RandomSource.o SampleValue.o SampleValueAdjacencyList.o Selector.o Session.o SteghideError.o Terminal.o Utils.o Vertex.o WavChunk.o WavChunkHeader.o WavChunkUnused.o WavFile.o WavFormatChunk.o WavPCMSampleValue.o error.o main.o msg.o SMDConstructionHeuristic.o  ../intl/libintl.a -liconv -ljpeg -lmcrypt -lmhash -lz 
libtool: /usr/bin/libtool: cannot execute binary file
make[2]: *** [steghide] Error 126
make[1]: *** [all-recursive] Error 1
make: *** [all] Error 2