All pastes #721118 Raw Edit

Someone

public text v1 · immutable
#721118 ·published 2007-09-30 23:25 UTC
rendered paste body
  [nant] /home/nebadon/OpenSIM/trunk/OpenSim/Region/Communications/OGS1/OpenS im.Region.Communications.OGS1.dll.build build
            Buildfile: file:///home/nebadon/OpenSIM/trunk/OpenSim/Region/Communi cations/OGS1/OpenSim.Region.Communications.OGS1.dll.build
            Target framework: Mono 2.0 Profile
            Target(s) specified: build


            build:

                 [echo] Build Directory is /home/nebadon/OpenSIM/trunk/OpenSim/R egion/Communications/OGS1/bin/Release
                [mkdir] Creating directory '/home/nebadon/OpenSIM/trunk/OpenSim/ Region/Communications/OGS1/bin/Release'.
                  [csc] Compiling 6 files to '/home/nebadon/OpenSIM/trunk/OpenSi m/Region/Communications/OGS1/bin/Release/OpenSim.Region.Communications.OGS1.dll' .
                  [csc] /home/nebadon/OpenSIM/trunk/OpenSim/Region/Communication s/OGS1/OGS1GridServices.cs(7,40): error CS0234: The type or namespace name `Tcp'  does not exist in the namespace `System.Runtime.Remoting.Channels'. Are you mis sing an assembly reference?
                  [csc] /home/nebadon/OpenSIM/trunk/OpenSim/Region/Communication s/OGS1/OGS1GridServices.cs(7,1): error CS0246: The type or namespace name `Chann els.Tcp' could not be found. Are you missing a using directive or an assembly re ference?
                  [csc] Compilation failed: 2 error(s), 0 warnings

            BUILD FAILED - 0 non-fatal error(s), 2 warning(s)

            /home/nebadon/OpenSIM/trunk/OpenSim/Region/Communications/OGS1/OpenS im.Region.Communications.OGS1.dll.build(10,10):
            External Program Failed: /usr/lib/pkgconfig/../../lib/mono/2.0/gmcs. exe (return code was 1)

            Total time: 2.1 seconds.


BUILD FAILED

Nested build failed.  Refer to build log for exact reason.

Total time: 66.7 seconds.